##TITLE=$$ Begin of the data block
##JCAMP-DX=5.00 $$ ACD/SpecManager v 10.08
##SPECTROMETER/DATA SYSTEM=Varian
##DATE=18 Dec 2012 14:35:34
##DATA TYPE=INFRARED SPECTRUM
##DATA CLASS=XYDATA
##ORIGIN=
##OWNER=
##NPOINTS=3735
##FIRSTX=399.26403809
##LASTX=4000.35498047
##MAXX=4000.35498047
##MINX=399.26403809
##MAXY=80.95357513
##MINY=21.00369453
##XFACTOR=1.0000000000
##YFACTOR=0.000000100000000
##FIRSTY=58.89695740
##DELTAX=0.96440572
##XUNITS=1/CM
##YUNITS=TRANSMITTANCE
##XYDATA=(X++(Y..Y))
399.3E88969574m956780J3856087J718712l880730M570961L635521O0425m468765k012177
407.9E97492828j553306K639236l892784o781311M042816j012993j370735L289414
415.7E92853165L902626n445862k7885437l39394K6376534R889259k512932n824852
423.4E91013107o884651l023758N146713N78652J377106L483047J021462j548501J532555
432.1E92695732J560249j489334m570007k074738N821076J648102N7335m621888n335502
440.7E83691025M803314P015610P9422l927231j531220n155754j409034J200752k761116
449.4E82005768L498268M517441k176438q930626Q03528L457680j034965j766396o499329
458.1E73874931M966355J786079K112541J032944m356575m6997M1046l46222l620300
$$ plain form
399.3 588969574 584012794 597868881 599587593 595706863 600277824 603913345 603973770 599505005 597492828
407.9 597492828 595939522 598578758 594685974 587904663 591947479 590934486 589563751 592853165
415.7 592853165 596755791 591309929 563424492 563085098 589461632 599350891 596837959 591013107
423.4 591013107 584128456 581104698 586251411 586830063 588207169 591690216 592711678 591163177 592695732
432.1 592695732 594255981 592766647 588196640 586121902 591942978 593591080 593648415 589026527 583691025
440.7 583691025 588494339 595509949 595589371 591662140 590130920 584975166 583566132 584766884 582005768
449.4 582005768 585504036 590021477 587845039 578914413 579717941 583175621 582140656 580374260 573874931
458.1 573874931 578841286 580627365 582739906 583772850 579416275 579369278 579410324 579064102 575443802
466.8E75443802j871071N31273N428276N846100p215882p015724q56781J600609K944031
475.5E74834633j598396j814347J542206J53046k758103N219117P825660L330116o55136
484.1E86078796M62113J072731l286476J067543l250084m948273L679276M721984m17137
492.8E85180473k308273K700386J560516o04133O82220Q6136j880722k273331K58332
501.5E83401604l389626k191200O87828l01323n211868l470421O429405L783074J162910
510.2E80900383l486290m391937J25046o47889k583809l410263j178856r58175J60637
518.9E64528847r94721n38902J376610j085549K174988K970619j558990m000053j144333
527.5E61728516j829834j548157J557159p83043L59612L43208J039200J964836k70462
$$ plain form
466.8 575443802 573572731 574104004 579532280 585378380 578162498 571146774 570289993 571890602 574834633
475.5 574834633 573236237 571421890 572964096 573117142 570359039 575578156 583403816 586733932 586078796
484.1 586078796 586540909 587613640 584327164 585394707 582144623 577196350 580875626 585597610 585180473
492.8 585180473 582872200 585572586 587133102 586528969 587211189 587297325 585416603 583143272 583401604
501.5 583401604 580011978 577820778 578508606 578207283 572995415 569524994 575954399 579737473 580900383
510.2 580900383 577414093 573022156 573147202 572499313 569915504 566505241 565326385 564368210 564528847
518.9 564528847 563534126 562995224 564371834 563286285 565461273 568431892 566872902 562872849 561728516
527.5 561728516 559898682 558350525 559907684 559124641 559484253 559827461 560866661 562831497 562561035
536.2E62561035J64337j341705k81563o47812m93812J028251j109542M15649K400017
544.9E62694855K653732J092796J8616n63278L21846K245521K02141r09576j220513
553.6E66536140j75781J68305o02112k09580J17035N64881J166610L344651l42636
562.3E70567513l335610P76749J258468m1198l51410j79062l19252p00607n08385P14912
571.9E67882118R232k131233R6130J226959o45752k027702n33295O75621j154327j141930
581.5E62255821K73094J280938j501656j298332K680893K149429L09219r7961M56085
590.2E66507530p45048J05438J07841j362381M58413J050949N82390j163216j499939
598.9E64041977k236977l090934j504784k407761k409553k803536m488983p501106
$$ plain form
536.2 562561035 562725372 561383667 561102104 560454292 559960480 560988731 559879189 560294838 562694855
544.9 562694855 565348587 566441383 566459999 565896721 566218567 568464088 568666229 567756653 566536140
553.6 566536140 566360359 566528664 565926552 565716972 565834007 566398888 567565498 570910149 570567513
562.3 570567513 567231903 568008652 569267120 569225922 568874512 568695450 568376198 567675591 567167206 567882118
571.9 567882118 567891350 565760117 565856247 567083206 566437454 564409752 563876457 564552078 563397751 562255821
581.5 562255821 562528915 563809853 562308197 561009865 563690758 565840187 566149406 566051445 566507530
590.2 566507530 565762482 565867920 565975761 564613380 565071793 566122742 566705132 565541916 564041977
598.9 564041977 561805000 558714066 557209282 554801521 552391968 549588432 545099449 537598343
606.6E37598343p872315o759223r352227j0059051j2688065j2715530j0243263p545739
614.3D60362930m200096L65143L417320K5101j361885n044975p981034j0236473j0986938
623D24359093n448151p88231P235985J2937241J5437774J4447823J3455429J1204796
630.7D92841759O063347J104087l326988l461227o500511p320519m417076k252197
638.4D72730675Q95538K846375P337837J1223793J5601539J6178551J5349045J3114662
646.2E55278015R859200Q068809M743385L384705L082581K700424K613220K424812
653.9E92155151K565613K035866J617393J082116O25724l2768R28536J230011m29764
662.5F01777878Q68187O90155J020736K731820o38619p352562L753891M538689L313598
$$ plain form
606.6 537598343 529726028 522966805 513614578 503555527 490867462 478151932 467908669 460362930
614.3 460362930 456162834 456527977 459945297 459970398 458608513 453563538 445582504 435346031 424359093
623 424359093 418910942 418122711 425358696 438295937 453733711 468181534 481636963 492841759
630.7 492841759 498905106 500009193 496682205 493220978 486720467 479399948 474982872 472730675
638.4 472730675 473626213 476472588 483810425 495034218 510635757 526814308 542163353 555278015
646.2 555278015 565137215 573206024 577949409 581334114 584416695 587117119 589730339 592155151
653.9 592155151 594720764 596756630 598374023 599456139 600081863 600049095 600977631 602207642 601777878
662.5 601777878 602646065 603336220 604356956 607088776 606450157 599097595 602851486 607390175 610703773
671.2F10703773J154862r1400k11334N75103M20647j9188O06957J162338Q37059O51283
680.9F15790100J253700J117936L39546j149063j359215p63588k076492k971039j639786
689.6F08542099J07193r25674k109757j657677q15811r4604o96411j370163j405220
698.2E99573975q26836j329041j234664L51753m57192q91761R46693K136917J936760
706.9F00206604J575623J665306J890068J658783J176796J729583J842957J099396
714.6F12845116J242218J116600J120033J722069K553253K922134K026902J807441
722.3F27355766J333962L60145q11805j400566q05741j419487j196899J82533J69563
731F23767471p31697j264877o20270J26572J94664J48086l9024p26204q90694k63252
$$ plain form
671.2 610703773 611858635 611767235 611555901 612131004 612551651 612532463 613139420 614301758 615138817 615790100
680.9 615790100 617043800 618161736 618501282 617352219 615993004 615229416 613152924 610181885 608542099
689.6 608542099 608649292 607723618 605613861 603956184 603140373 603045769 602349358 600979195 599573975
698.2 599573975 598747139 597418098 596183434 596535187 596077995 595186234 596132927 598269844 600206604
706.9 600206604 601782227 603447533 605337601 606996384 608173180 609902763 611745720 612845116
714.6 612845116 614087334 615203934 616323967 618046036 620599289 623521423 625548325 627355766
722.3 627355766 628689728 629049873 628238068 626837502 626031761 624612274 623415375 623597908 623767471
731 623767471 623035774 621770897 621150627 621277199 621471863 621619949 621580925 620854721 619964027 619700775
740.7F19700775j80206N21240Q33092O38313J450424J919251L834190L971481J726532
749.3F34415092K071228K713471K918816K900848K643204K931137K390823K020264
757.1F55004883K027817J952591K617340K472076J881332J552506O55823q68607j564178
765.7F65731583p24945j425705k165451p86744P42875Q85543M65317P32727J366120
774.4F64821320K254028K126236J395645J945496J853942O60477J650238L210297K118759
783.1F82036438J405869J902389K522583J696930O14090J327591K82516R6054N24140
791.8F92408600j06888o57883p74841L82843j96152k02408K61155K90146J31912j99356
801.4F91337128K00195n65720m8828l86200k48031O63757j05820M19846n41306o64444
$$ plain form
740.7 619700775 619520569 620041809 620874901 621513214 622963638 624882889 628717079 632688560 634415092
749.3 634415092 636486320 639199791 642118607 645019455 647662659 650593796 652984619 655004883
757.1 655004883 657032700 658985291 661602631 664074707 665956039 667508545 668164368 667295761 665731583
765.7 665731583 665006638 663580933 661415482 660628738 661371613 662257156 662722473 663455200 664821320
774.4 664821320 667075348 669201584 670597229 672542725 674396667 675057144 676707382 679917679 682036438
783.1 682036438 683442307 685344696 687867279 689564209 690178299 691505890 691788406 691884460 692408600
791.8 692408600 692301712 691643829 690868988 691251831 691055679 690853271 691114426 691404572 691536484 691337128
801.4 691337128 691537323 690971603 690922775 690536575 690288544 690952301 690846481 691266327 690725021 690060577
811.1F90060577Q77076R91897O63605J156998N91278o93589m0207m11071L25927m41894
820.7F93080597j476288J08795r64432k66494j47095k236633k066193j010666j496582
829.4F83525009k915344m008179n341110l768997k981110m185180l858338l921509
837.1F52545242m188537m006577l189697k384033k826195k951813k010460k234688
844.8F28753242k230834n77355N71175P90939Q63419J200676J838531K199211L254700
853.5F36663704M570579L850251L220749L631286L039322K338486K198105K343368
861.2F61855850L217468K683564J488647J363220J392289P38830O89087J853409J308517
869.9F76590881P48597N19714N96847J028672P26242R76333J44806n12237j150360
$$ plain form
811.1 690060577 690937653 691929550 692593155 693750153 694341431 693647842 693607635 693196564 693522491 693080597
820.7 693080597 691604309 691713104 690748672 690482178 690335083 688098450 686032257 685021591 683525009
829.4 683525009 680609665 676601486 671260376 667491379 664510269 660325089 656466751 652545242
837.1 652545242 648356705 644350128 641160431 638776398 635950203 632998390 630987930 628753242
844.8 628753242 626522408 625945053 626516228 627307167 628170586 629371262 631209793 633409004 636663704
853.5 636663704 641234283 645084534 648305283 651936569 654975891 657314377 659512482 661855850
861.2 661855850 665073318 667756882 669245529 670608749 672001038 672739868 673428955 675282364 676590881
869.9 676590881 677339478 677859192 678456039 679484711 680210953 681187286 681332092 680819855 679669495
878.6F79669495j321106j290131j998062j665421j989593k304916l381959l008193
886.3F62710114j570969k219849j613006n81131m74549m93240j75095N03540Q09784
895F56895599R19342P43180J60217m89883l03650n61219l04946o5995j533813j261597
904.6F54197235r74655j731186j679687j987915k528077l056030l363800l240623l375473
913.3F32259789l253518l330307l227462k379570k681275l024330l004951k344666
921F09013710k500687l138389k125397k441177l047753k806472j310578m82979j046943
929.7E90113335o42662n5924J474228J557083J417999K321701K534371K973862K555236
938.4F04249229L129769M139709L491326L526268L952827L719063K957954L164940
$$ plain form
878.6 679669495 678348389 677058258 675060196 673394775 671405182 669100266 665718307 662710114
886.3 662710114 661139145 658919296 657306290 656725159 656250610 655757370 655582275 656085815 656895599
895 656895599 657814941 658558121 658718338 658228455 657924805 657363586 657058640 656992645 655458832 654197235
904.6 654197235 653222580 651491394 649811707 647823792 645295715 642239685 638875885 635635262 632259789
913.3 632259789 629006271 625675964 622448502 620068932 617387657 614363327 611358376 609013710
921 609013710 606513023 603374634 601249237 598808060 595760307 592953835 591643257 591160278 590113335
929.7 590113335 589470673 589414749 590888977 592446060 593864059 596185760 598720131 601693993 604249229
938.4 604249229 607378998 611518707 615010033 618536301 622489128 626208191 629166145 632331085
946.1F32331085M010887L368302K759590J942291J602478J467362K78091m08935q23517
954.8F46527634m05960r90982k594910k208710j795654j863976j595840k911453l927040
963.4F28233109l558045k962990k763824l090286k432595j953583j490058j591263
971.2F08390465j503792r69009j454583m47921L15628l18642j235924j804542j757889
979.8E99213791j296692n19028j848144l102455k873803k493286k163276k348252k718429
988.5E79850426l304711m000129n169754n990410q661995j2789498j5112304j1594048
996.2E13227577R31206J1329765J1960869O915894L223571N16282m87557N12848k1896
1004.9E48108559q34465j412888p24220r06677j809731j561584j693383j061249j367836
$$ plain form
946.1 632331085 636341972 639710274 642469864 644412155 646014633 647481995 647760086 647351151 646527634
954.8 646527634 646121674 645130692 642535782 640327072 638531418 636667442 635071602 632160149 628233109
963.4 628233109 624675064 621712074 618948250 615857964 613425369 611471786 609981728 608390465
971.2 608390465 606886673 605917664 604463081 604015160 604330788 604012146 602776222 600971680 599213791
979.8 599213791 597917099 597398071 595549927 592447472 589573669 587080383 584917107 582568855 579850426
988.5 579850426 576545715 572545586 567375832 561385422 552723427 539933929 524821625 513227577
996.2 513227577 514158783 525488548 537449417 544365311 547588882 548105164 547617607 548130455 548108559
1004.9 548108559 547274094 545861206 545136986 544230309 542420578 540858994 539165611 538104362 536736526
1013.6E36736526j637382k033691k471314k387733k467537k066994k891693k904167
1021.3E17876015k870179k835731k619133k115059k164116k767753j193695k023774
1029D99286575k251205j914940j981545k084960k968445j932144k265587j186524j603203
1037.7D81098022j350517N8785q76923K11182o28052j51291j62277j185837p21283
1046.4D76291809R7160R29184j79100M11492m33007K36245J399307L60184N52215O98471
1056D80363960R52759m55742j40877l71360q77571j035271j706848n72472p78999q8196
1065.7D75289383r88312j86615L97682j547355j309548p62748n7297k351227j017456
1074.4D67466507n39627k185211j270981j757126K54555l5134k64892j326523k419891
$$ plain form
1013.6 536736526 535099144 533065453 530594139 528206406 525738869 523671875 520780182 517876015
1021.3 517876015 515005836 512170105 509550972 507435913 505271797 502504044 501310349 499286575
1029 499286575 497035370 495120430 493138885 491053925 488085480 486153336 483887749 482701225 481098022
1037.7 481098022 479747505 479806290 478929367 479140549 478512497 478361206 478198929 477013092 476291809
1046.4 476291809 476388969 477318153 477139053 477550545 477117538 477353783 478753090 479113274 479665489 480363960
1056 480363960 481316719 480860977 480720100 480348740 479471169 478435898 476729050 476156578 475377579 475289383
1065.7 475289383 474301071 474114456 474512138 472964783 471655235 470892487 470835190 468483963 467466507
1074.4 467466507 466926880 464741669 463470688 461713562 461968117 461932983 461668091 460341568 457921677
1083D57921677k465134k927437m23012j775016k916108m506034m626427m427376o649246
1091.7D27205887o960373q443794p634240j0117721j0271225j0085106j0784454q898392
1099.4C54010582j1127510q626175q982925q237496q701324q650608o621762q814029
1107.1B84248753n890236q029957n879574m863243m638653k518368l662834n44548
1114.9B48221340k008457M73862k70253O36025K107544O49643K603626L1033K514953
1123.5B54959316J273384J656647J185207l41091J353779j601906l76205k847691k352142
1132.2B52909298l411789m171085k542115m160060r44500k589722r98211k200184k155247
1140.9B29736385j545257l256874n41020l396187j086158k491951j759262j242123
$$ plain form
1083 457921677 455456543 452529106 452106094 450331078 447414970 442908936 438282509 433855133 427205887
1091.7 427205887 420245514 411801720 404167480 394049759 383778534 373693428 362908974 354010582
1099.4 354010582 342883072 334256897 325273972 317036476 308335152 299684544 293062782 284248753
1107.1 284248753 278358517 270328560 264448986 259585743 254947090 252428722 248765888 248221340
1114.9 248221340 246212883 246686745 246416492 247052517 249160061 249809704 252413330 252444363 254959316
1123.5 254959316 256232700 257889347 259074554 258733463 260087242 258485336 258109131 255261440 252909298
1132.2 252909298 249497509 245326424 242784309 238624249 237679749 235090027 234091816 231891632 229736385
1140.9 229736385 228191128 224934254 224393234 220997047 219910889 217418938 215659676 214417553
1148.6B14417553l029347J43586j494847J531048J02692J232300J490879O71310K440720
1157.3B17505894L77407K921695J189900L714790K637196J754494L951301K646656
1165B36699333N279198L079815N326137M817849N064907N826664M253902O892300N352745
1173.7B82592850P197304O014766O335240O708641O072826P304440N154571O725426
1181.4C34106064O032257O691322N537033N217171O186905M454002O012459M367104
1189.1C78604317M892387M172402M144210N207444M426269N462341L938179N030747
1196.8D15878296N208244N621567N562401N199585O019172M892731N472756M352951
1204.5D58207703N051422M553070L726768M757576M435654M882126L268127L581963
$$ plain form
1148.6 214417553 211388206 211531792 210036945 211567993 211670685 212902985 214393864 215065174 217505894
1157.3 217505894 217883301 220804996 221994896 225709686 228346882 230101376 234052677 236699333
1165 236699333 241978531 245058346 250384483 255202332 260267239 266093903 270347805 277240105 282592850
1173.7 282592850 289790154 295804920 302140160 308848801 314921627 322226067 327380638 334106064
1181.4 334106064 340138321 346829643 352366676 357583847 363770752 368224754 374237213 378604317
1189.1 378604317 383496704 387669106 391813316 397020760 401447029 406909370 410847549 415878296
1196.8 415878296 421086540 426708107 432270508 437470093 443489265 448381996 453854752 458207703
1204.5 458207703 463259125 467812195 471538963 476296539 480732193 485614319 488882446 492464409
1212.3D92464409L091431K587356K864990J796799K322884J456604J504364J078109
1220E09166946J234818J423149Q41408J435966M32625O53191K40173M05464M20990
1228.6E16254730k51617O09054P59888J160278K82822Q69484J418953R67445J005974
1237.3E23077011P33452O71310j56402P51304N60799M49181O87675M46930R85680J72538
1247E28379478Q53920O45905P67517P78542j51406K7504J71814R47647j21498M10347
1256.6E32709770N85404L89099J237259J59034Q29010J273346J374970K26936J68915
1265.3E38953743R93767M29916Q90503K72560J319199J702041J485367J579361J444931
1274E49071388K212563J812668K231865J393127J379051J987381J493073J781769J766433
$$ plain form
1212.3 492464409 495555840 498143196 501008186 502804985 505127869 506584473 508088837 509166946
1220 509166946 510401764 511824913 512666321 514102287 514534912 515188103 515428276 515833740 516254730
1228.6 516254730 516003113 516612167 517372055 518532333 518815155 519684639 521103592 522071037 523077011
1237.3 523077011 523810463 524481773 524325371 525076675 525637474 526086655 526774330 527221260 528206940 528379478
1247 528379478 529233398 529879303 530646820 531425362 531273956 531301460 531473274 532420921 532299423 532709770
1256.6 532709770 533295174 533684273 534921532 535080566 535909576 537182922 538557892 538784828 538953743
1265.3 538953743 539947510 540377426 541267929 541540489 542859688 544561729 546047096 547626457 549071388
1274 549071388 551283951 553096619 555328484 556721611 558100662 560088043 561581116 563362885 565129318
1282.7E65129318K281265K019883K239418K321777K422943K555428K058029K291145
1290.4E83319206J689148J646652J588135J797829J955528J650887J952400J939201
1298.1E97538986K052574J875229K225838J686020J108589J409264R53254P62253N75180
1306.8F10187187P56073Q01697Q77495J076736J062508J078453J143799J294632P3433
1315.4F18352013O04095J723366Q47320L42370K04887O49681O26831R97162J364899
1324.1F25712624J094207J233063Q38509R63287J017227M30603j38244n04685q9187
1332.8F30557404J11427M93278M00124l47023J03722P90176M04129m52461L61557R31778
1342.4F33354111K78473m79317o82106j22376J34240k33498n85136l99857J11427j00670
$$ plain form
1282.7 565129318 567410583 569430466 571669884 573991661 576414604 578970032 581028061 583319206
1290.4 583319206 585008354 586655006 588243141 590040970 591996498 593647385 595599785 597538986
1298.1 597538986 599591560 601466789 603692627 605378647 606487236 607896500 608849754 609612007 610187187
1306.8 610187187 610943260 611744957 612622452 613699188 614761696 615840149 616983948 618278580 618352013
1315.4 618352013 618956108 620679474 621526794 621869164 622074051 622723732 623350563 624347725 625712624
1324.1 625712624 626806831 628039894 628878403 629841690 630858917 631289520 631151276 630646591 630557404
1332.8 630557404 630668831 631162109 631562233 631215210 631318932 632109108 632513237 632060776 632422333 633354111
1342.4 633354111 633632584 633153267 632471161 632348785 632483025 632249527 631664391 631264534 631375961 631275291
1352.1F31275291j19171p5340m66080n22422l34893o13250p24946o6337k52609j60256
1361.7F27939987j55449j314048P1945J57852q49114o91108j280556j508789p36046
1370.4F21634674r86938n03197p76024j992035m93088J07003j06049k42081j23787
1379.1F16518478r6511o12755n65911j63002p3585j70708Q78525Q05435j047058O18095
1388.7F16091003J314202O13861O75850O72455q7471j813050k025032N24864P11937
1397.4F16678619o65741k580642p48406O49033j13297q2321l9100j635361r01528K33078
1407.1F10794334j47361q15316j161422o19240o2637j86730j78680K81219K99263m37546
1416.7F07765884j23329N69420l510704O25267K341652L82309l38593j072692J072006
$$ plain form
1352.1 631275291 631156120 631080780 630614700 630092278 629757385 629144135 628419189 628352852 628100243 627939987
1361.7 627939987 627784538 626470490 626542435 626700287 625851173 625160065 623879509 622370720 621634674
1370.4 621634674 620647736 620144539 619368515 617376480 616883392 616990395 616884346 616642265 616518478
1379.1 616518478 616421967 615809212 615243301 615080299 615006714 614836006 615714531 616519966 615472908 616091003
1388.7 616091003 617405205 618019066 618694916 619367371 619279900 617466850 615441818 615966682 616678619
1397.4 616678619 616012878 613432236 612683830 613332863 613219566 613137245 613098145 611462784 610561256 610794334
1407.1 610794334 610646973 609831657 608670235 608050995 607988358 607801628 607622948 607904167 608203430 607765884
1416.7 607765884 607642555 608211975 604701271 605326538 607668190 608050499 607711906 606639214 607711220
1425.4F07711220J643715P25822J175537J12229j67580J070976J356201R34830O55556
1434.1F15218506J587601Q12149k480050R98955K951165J675987Q79135J060333N71022
1442.7F23274803R77822Q10432J049652N63736m61502p1297J285935J596183P47605
1451.4F29773369Q74595J131249J441383Q54454M32015j303864j501770L839531J837197
1460.1F37378159K207069J231804J317139K827911j026611L0365J588516J824875J920089
1468.8F49299316J635361K143936q5602k44598J581650M268265M076767N37490J470414
1477.5F64682999K666702K422333K034301J158905J020585J185150R67331O40716J079331
1486.1F77858353k06681q09707J545715k669754k521057K254486J505814L38974L71475
$$ plain form
1425.4 607711220 609354935 610080757 611256294 611368523 611200943 612271919 613628120 614562950 615218506
1434.1 615218506 616806107 617618256 615138206 616137161 619088326 620764313 621643448 622703781 623274803
1442.7 623274803 624252625 625063057 626112709 626676445 626214943 626143646 627429581 629025764 629773369
1451.4 629773369 630647964 631779213 633220596 634075050 634507065 633203201 631701431 635540962 637378159
1460.1 637378159 639585228 640817032 642134171 644962082 643935471 643965836 645554352 647379227 649299316
1468.8 649299316 650934677 653078613 652993011 652748413 654330063 658598328 662675095 663212585 664682999
1477.5 664682999 667349701 669772034 671806335 672965240 673985825 675170975 676138306 676779022 677858353
1486.1 677858353 677651672 676841965 678387680 675717926 673196869 675451355 676957169 677296143 677667618
1494.8F77667618r3003n236053J305542n87921l398972M94232r93042j359329l71704
1503.5F67427368J357651j68610r872741o853257J791611K860565j054077N47257k122803
1512.2F53912964l513107j52970j283874m72565k532883l398819K107697K960358k470551
1520.8F45156250o465607j80664J591339K260437l726043j139984L14025j886558J95732
1529.5F36118927O01158j50413j329461j492767l448791P66983L98292L56941K496491
1538.2F34317360l522377q816109K580414J272774j624871J154709L75214n55954K829170
1546.9F28010330Q51326Q44078l61938j682472J380882O73408J068077j744041J970711
1555.6F31010361M660034M370499k973290j4075584R341430N619355L483276J188965
$$ plain form
1494.8 677667618 677574615 672338562 673644104 673056183 669657211 670151443 669158401 667799072 667427368
1503.5 667427368 668785019 668616409 658743668 651890411 653682022 656542587 655488510 656035767 653912964
1512.2 653912964 650399857 650246887 648963013 648490448 645957565 642558746 644666443 647626801 645156250
1520.8 645156250 638690643 638509979 640101318 642361755 638635712 637495728 637809753 635923195 636118927
1529.5 636118927 636720085 636569672 635240211 633747444 630298653 631065636 631463928 631820869 634317360
1538.2 634317360 630794983 621978874 624559288 625832062 624207191 625361900 625737114 625181160 628010330
1546.9 628010330 628861656 629705734 629343796 627661324 629042206 629715614 630783691 629039650 631010361
1555.6 631010361 635670395 640040894 637067604 622992020 632333450 637952805 641436081 642625046
1563.3F42625046M32510j91269R0561J439819P56302K25830l577728K006149K411652
1572F46218872N44891L95661p172j112594q243676K106476J452217p35473q84323j700058
1581.6F38034821o22521j381340q50983j548538k030906j632462k021713j622658l424797
1590.3F22898903k086449k753410k202530k163429l044281j867714k923546j096191
1598F04761353k160950j639366k503662l058434j943893l813668j976394k773667k281532
1606.7E82609787l135414k090836k256126k756615p5111k617645j455536k382202n87883
1615.4E65252419j553345j0926666J717186o38924j67236k242547m87747j390381n631599
1624E43931160M92363r32732M42009l399124j950149n41497j553878j110116k087554
$$ plain form
1563.3 642625046 643057556 642866287 642956848 644396667 645152969 645378799 641801071 643807220 646218872
1572 646218872 646763763 647159424 647152252 646039658 637795982 639902458 641354675 640619202 639734879 638034821
1581.6 638034821 637412300 636030960 635179977 633631439 631600533 629968071 627946358 626323700 622898903
1590.3 622898903 620812454 618059044 615856514 613693085 610648804 608781090 605857544 604761353
1598 604761353 602600403 600961037 598457375 595398941 593455048 589641380 587664986 584891319 582609787
1606.7 582609787 579474373 577383537 575127411 572370796 572295685 569678040 568222504 565840302 565252419
1615.4 565252419 563699074 552772408 554489594 553850670 553683434 551440887 550953140 549562759 543931160
1624 543931160 544423523 543490791 543932800 540533676 538583527 538042030 536488152 535378036 533290482
1632.7E33290482O20422l86772l601418l686180J286736Q65554K71378R09271j530342
1641.4E28039131P70645r14612Q32978R51881l370247J96839k288285L673363J386299
1650.1E29277992K924156L172570k252045o736183J881180N525055J746063J913299
1657.8E37452087L72239R56268J896515J571197K225724r02443L356742K288743K465591
1666.5E51682663K913399K348633M46586m19502L778229K00195K941132L746948J302109
1675.1E68940392J38702K661858L987541K614822L430557R22280L580360N270195p32994
1683.8E90813713m781113L344880P266426L880386K357368L124428K424507M100113
1691.5F12530708L778611M048271M037933M294930k191620L987083O649704O231461
$$ plain form
1632.7 533290482 533910904 533524132 529922714 526236534 527523270 528388824 528660202 529569473 528039131
1641.4 528039131 528809776 527895164 528728142 529680023 526309776 526506615 524218330 527891693 529277992
1650.1 529277992 532202148 535374718 533122673 526386490 528267670 533792725 535538788 537452087
1657.8 537452087 537824326 538780594 540677109 542248306 544474030 543571587 546928329 549217072 551682663
1666.5 551682663 554596062 556944695 557391281 556971779 560750008 560950203 563891335 567638283 568940392
1675.1 568940392 569079094 571740952 575728493 578343315 581773872 582696152 586276512 591546707 590813713
1683.8 590813713 586032600 589377480 596643906 600524292 602881660 606006088 608430595 612530708
1691.5 612530708 616309319 620357590 624395523 628690453 626498833 630485916 637135620 643367081
1699.3F43367081J999206n398178R336395O266556M553070K964478K891083L498458
1707F69478149L351975M508362K603378J847534K627030K666626L097610K36282o1340
1715.6F90355606L106995K729644k283477M155197M412231K097168J377335Q41980
1723.4G06792679P03659J168823O57807O24084J389084K079544o36368K29874M393310
1732G17402496L591843m036331n293274N297928L941421J469956J952743j425857j975632
1740.7G20925293M417114K906647n6076J768722L765564K751007J584931J532516Q20008
1749.4G40415726L852386K95029p46536M325485K476044K522583K787780o01501J721573
1758.1G57048569K867508K637405K971268k505646n56564L032303J155853P66296J108475
$$ plain form
1699.3 643367081 645366287 639968109 649304504 655571060 660124130 663088608 665979691 669478149
1707 669478149 672830124 677338486 679941864 681789398 684416428 687083054 690180664 690416946 690355606
1715.6 690355606 693462601 696192245 693908768 698063965 702476196 704573364 705950699 706792679
1723.4 706792679 707496338 708665161 709322968 709947052 711336136 713415680 712779312 713009186 717402496
1732 717402496 720994339 716958008 711664734 716962662 720904083 722374039 724326782 722900925 720925293
1740.7 720925293 725342407 728249054 728192978 729961700 733727264 736478271 738063202 739595718 740415726
1749.4 740415726 744268112 744563141 743816605 748142090 750618134 753140717 755928497 755326996 757048569
1758.1 757048569 759916077 762553482 765524750 763019104 762462540 765494843 766650696 767416992 768525467
1766.8G68525467L53775k840805K553406M329452J22376k862473j008453M511566K105255
1775.4G75789566j339493J254807L03116P91778j29242j564560J295548K575607J750336
1784.1G80727463o41175M63181J981201R68247K6092R54132j65939k73743k352218
1792.8G81687241j371537L659439J050492o97632J722946K252579L32184j290970J924133
1801.5G89268875o26602p39975Q43887p6446P16247J61438j81122J018219J242142
1810.2G91626663j197510M33121J667938N06363R23081K52380K58560j068115o82220
1818.8G92720261K24990q8729J167755Q2397J285019J450729k673721M01077K689591
1827.5G97259369K017822r06982m865113O93512K107392J10855L42331Q72879J162872
$$ plain form
1766.8 768525467 768879242 766038437 768591843 772921295 773043671 770181198 769172745 773684311 775789566
1775.4 775789566 774450073 775704880 776007996 776799774 776670532 775105972 776401520 778977127 780727463
1784.1 780727463 780086288 780549469 782530670 783498917 783525009 784479141 784313202 784039459 781687241
1792.8 781687241 780315704 783975143 785025635 784328003 786050949 788303528 788635712 787344742 789268875
1801.5 789268875 788642273 787902298 788746185 788669739 789385986 789547424 789366302 790384521 791626663
1810.2 791626663 790429153 790862274 792530212 793036575 793959656 794212036 794470596 793402481 792720261
1818.8 792720261 792945251 792856522 794024277 794106674 795391693 796842422 794168701 794569778 797259369
1827.5 797259369 799277191 798370209 793505096 794198608 796306000 796416855 796759186 797632065 798794937
1836.2G98794937N37110l31421J079254K23312K78778j97296O49033M86374n588456
1844.9G95931625J879578K333603m0894j30844P80487J151429K31552O66732O791Q0490
1854.5H02890549N1727k93121j66550n53207J86233n9357P07093N63278L47671N99518
1864.2H04273834J91651P21893o6071J09787j980896j881103J295318Q88291M38461
1872.8H03991165J73645O60858K92054K89001N01328M63256J71509m04129J69220k58179
1882.5H06049728R7428l05252m18701L80020J16653R33609n53818j557235J199112
1891.2H05941544J551132J78985k79388n90363p01294L82157m64707J7395L71094K22244
1900.8H06628799O68335P4006N80444L9215n2872J12152n50460l99628j40686m98276
$$ plain form
1836.2 798794937 799332047 799000626 800079880 800303192 800581970 800384674 801033707 801520081 795931625
1844.9 795931625 797811203 800144806 800103912 799973068 800753555 801904984 802136536 802803268 802810059 802890549
1854.5 802890549 802942276 802649155 802482605 801929398 802115631 802056274 802763367 803326645 803674316 804273834
1864.2 804273834 804465485 805187378 805121307 805231094 803250198 801369095 802664413 803552704 803991165
1872.8 803991165 804164810 804825668 805117722 805406723 805908051 806371307 806542816 806138687 806307907 806049728
1882.5 806049728 806147156 805841904 805423203 805803223 805919876 806853485 806299667 804742432 805941544
1891.2 805941544 807492676 807671661 807392273 806801910 806100616 806482773 806018066 806035461 806406555 806628799
1900.8 806628799 807297134 807371140 807951584 807990799 807937927 808050079 807499619 807099991 806959305 806461029
1910.4H06461029l84598P29676M0664M14124J73721M14810J686325k172088r39026
1919.1H06424637J116943J82648n8670j655502m12980R52454N85251l23715j33362
1927.8H06677704M91562M72564K03248M6997L19976n64804k78549k84271k39334J35269
1937.5H06980362k15149K31628j78222R67254j9378k248459J020126J344071k03324
1946.1H07678909o74896L4638M6615l28979k22550k40707J03225L50953L94821J79596
1955.8H07321625K98080j09482k31399j77918m29382n0278l75976j39008J2589K00653
1965.4H06319504J24206p80868K25067R95407N08728l88870k594J01166n66407l23639
1975.1H06211700l44009j18713k73590j50834M10462L80936O2408k35443k24610k93350
$$ plain form
1910.4 806461029 806076431 806806107 806846771 807260895 807434616 807849426 809535751 807363663 806424637
1919.1 806424637 807541580 807724228 807665558 806010056 805597076 806549530 807134781 806811066 806677704
1927.8 806677704 807169266 807641830 807845078 807892075 808212051 807647247 807368698 807084427 806845093 806980362
1937.5 806980362 806765213 806996841 806818619 807785873 807766495 805518036 806538162 807882233 807678909
1946.1 807678909 807004013 807038651 807085266 806756287 806533737 806293030 806396255 806747208 807142029 807321625
1955.8 807321625 807619705 807510223 807278824 807100906 806671524 806621246 806245270 806106262 806118851 806319504
1965.4 806319504 806443710 805662842 805887909 806883316 807392044 807003174 807000580 807101746 806535339 806211700
1975.1 806211700 805867691 805748978 805475388 805324554 805735016 806115952 806178360 805942917 805718307 805424957
1984.7H05424957R9488k05079n74264o10199l83606N74112M5929q31070J93787R10949
1994.3H04645004K20871J7243N1117k79465j24893m91562j44730l02124m64706N5465
2004H03182220j69448r8343j21384L71399N22766K68707k4490n29099l37448m20684
2013.6H02644196k92283r4757k30941m23508j26953J09176K83432P43103J38627m32892
2023.3H02317200n03235q6594k46811n55038j17645l04566j66397l03726J5716L76053
2032.9H00424957J69068J17798L051J80741o06003o04553l16697l15780l28598m81339
2042.6G98242645J90659l3341L34168M57916J56784j00021n38635P3700k80686j84479
2052.2G98318710j09939l99094n44815m02908L08456j42059R6054N5618K91214L17383
$$ plain form
1984.7 805424957 805524445 805319366 804745102 804134903 803751297 804325409 804371338 803540268 803734055 804645004
1994.3 804645004 804865875 804883118 804934235 804654770 804529877 804038315 803893585 803591461 803126755 803182220
2004 803182220 803012772 802914429 802793045 803164444 803687210 803955917 803931427 803402328 803064880 802644196
2013.6 802644196 802351913 802257156 802026215 801602707 801475754 801584930 801868362 802611465 802750092 802317200
2023.3 802317200 801813965 801727371 801480560 800925522 800807877 800503311 800336914 800033188 800048904 800424957
2032.9 800424957 800594025 800711823 800714874 800895615 800289612 799685059 799368362 799052582 798723984 798242645
2042.6 798242645 798433304 798399963 798734131 799192047 799348831 799248810 798710175 798783875 798503189 798318710
2052.2 798318710 798208771 797809677 797264862 796861954 797170410 797028351 797124405 797180023 797471237 797788620
2061.9G97788620n34592j98745q97751j070557l27072q3237l68499n10788j99891k29415
2071.5G93368073K30484J38702J01318l22342o41784m55933q08258m99496n89066m68369
2081.1G90053329k09808Q2092J35193k19192K98767K97241J1749q2168K43530O0196
2090.8G90670929k45895k33002n85251j19324j96686j16195L77426N02167K82058L40653
2100.4G90676880P79037K05613N0506m34112j99433L30277L6544K89231L0670L00980
2110.1G92066193K9220L06473O03180k19803J80206K79770J75247k47802k17057m31594
2119.7G92524033p71714P4845L06015M11148j95465k89307l5477P3319L26233k56577
2129.4G92167053j37405k17056l45536l91845k38038R8038K10648N97992J52054P7133
$$ plain form
2061.9 797788620 797254028 797055283 796157532 795086975 794759903 794676666 794308167 793797379 793597488 793368073
2071.5 793368073 793598557 793737259 793838577 793516235 792874451 792418518 791610260 791110764 790521698 790053329
2081.1 790053329 789843521 789925613 790060806 789841614 790140381 790437622 790449371 790367203 790610733 790670929
2090.8 790670929 790425034 790192032 789606781 789487457 789290771 789174576 789552002 790054169 790336227 790676880
2100.4 790676880 791455917 791661530 791712036 791277924 791078491 791408768 791445312 791734543 791765213 792066193
2110.1 792066193 792095413 792401886 793005066 792785263 792965469 793245239 793420486 793172684 792955627 792524033
2119.7 792524033 791752319 791827164 792133179 792544327 792348862 792059555 792024078 792097397 792423630 792167053
2129.4 792167053 792029648 791812592 791467056 791075211 790837173 790935211 791145859 791743851 791895905 791973038
2139G91973038J89438K13546J83258J96991K47651j30997J61514j75857k83280j98212
2148.6G92377090n722N92423L20740L43856L93525N92880J55792j51825j12839l54156
2158.3G94151764K13165j13144k92129P4157K72370r3308q5067O14700Q3008J55182
2167.9G94980698K59323o8283n01404o86340n3940j31455m21066k81830M05884J07345
2177.6G93608932k2430M51889J82572L46679l9444n11551m74929J26571M2114k27050
2187.2G93483353K74200j43127J59988O94199Q76770O04629M69437M75998k31476R9411
2196.9G96763382n2643R9259K69470q1787J40457j20545J06354M73175P03354L1052
2206.5G98331528p4234N23987J59683O9122l94669m18396k78930J6632K04468m731
$$ plain form
2139 791973038 792162476 792376022 792559280 792756271 793003922 792872925 793034439 792858582 792575302 792377090
2148.6 792377090 792371368 792963791 793284531 793628387 794021912 794614792 794770584 794618759 794505920 794151764
2158.3 794151764 794364929 794251785 793959656 794033813 794306183 794212875 794127808 794742508 794825516 794980698
2167.9 794980698 795240021 795171738 794670334 793983994 793930054 793798599 793377533 793095703 793501587 793608932
2177.6 793608932 793586502 794038391 794220963 794567642 794528198 794016647 793541718 793668289 793710403 793483353
2187.2 793483353 793757553 793614426 793774414 794468613 795345383 795950012 796419449 796895447 796663971 796763382
2196.9 796763382 796710739 796809998 797079468 796997681 797138138 797017593 797123947 797597122 798300476 798331528
2206.5 798331528 798257294 798781281 798940964 799010086 798615417 798197021 797918091 797934723 798139191 798134460
2216.1G98134460J55640K53677O53000J9684j4801J52970j54801J60065N9128L7689
2225.8G99456711p25556m43496N188n6763N03082J22528J12534l1815q5983J47553
2235.4G99003983Q5220j84708l36380J09864j21155l71399k29111J52283k9679J68076
2245.1G98246994L84064J831L09830l72468K5788L61862l42865k66495j66855K62680
2254.7G98444366k69241N1193M95377J23672J95694M2649P5683k31552L205q1101j67160
2265.3G98682785K0294J39313J88065m83017Q9340K36740M8752N1574K91367L45688
2275G99610901l65906K19422j30005j67618r8114m57916J58157P9193m7836l13721
2284.6G98486557J70441J31836J13296L76816l13034k0447m4784K20489J58157j07650
$$ plain form
2216.1 798134460 798290100 798543777 799196777 799216461 799201660 799354630 799199829 799359894 799419022 799456711
2225.8 799456711 798731155 798287659 798292847 798236084 798739166 798861694 798974228 798942413 798856430 799003983
2235.4 799003983 799089203 798904495 798568115 798677979 798556824 798185425 797956314 798108597 798078918 798246994
2245.1 798246994 798631058 798632889 798942719 798570251 798596039 798957901 798615036 798348541 798181686 798444366
2254.7 798444366 798175125 798226318 798721695 798845367 799041061 799083710 799159393 798927841 798931046 798849945 798682785
2265.3 798682785 798703079 798842392 799030457 798547440 798636780 798873520 798922272 798973846 799265213 799610901
2275 799610901 799244995 799464417 799334412 799166794 799068680 798610764 798768921 798848114 798800278 798486557
2284.6 798486557 798656998 798788834 798902130 799278946 798965912 798945465 798900681 799121170 799279327 799171677
2294.3G99171677m15879n68542L81317L3493j4420j26419L09983M60129k11869k3575
2303.9G98995895n89065m2496k2812o1111M0588l05328j90201q35266J33819M7989
2313.5G97172012J38169N37185j22528L5782n53131k44904K65503O58417r36432j618194
2323.2G95331879K02865Q4610M20304J28097J72348n3329L01819K39639j030274j27487
2332.8G95670471k01797N37033k61765p22809O23856Q23441N39856p84379M62113L57437
2342.5G97043457j65405m9744J75324P67212l19977P19757J178970J95236p34710j49155
2352.1G98660965N84946p4540j07116j013870o02417j39390m88739r69162j81121J454620
2361.8G97124176O79092k13775j637802L42102J178894Q0261P17010N81055P85675
$$ plain form
2294.3 799171677 798755798 798187256 798568573 798602066 798587646 798461227 798771210 799231339 799019470 798995895
2303.9 798995895 798406830 798364334 798341522 798280411 798320999 798015671 797825470 796990204 797124023 797172012
2313.5 797172012 797310181 797847366 797724838 797760620 797207489 796962585 797228088 797886505 796950073 795331879
2323.2 795331879 795534744 795619354 796039658 796167755 796340103 796286774 796588593 796828232 795797958 795670471
2332.8 795670471 795468674 796005707 795743942 795021133 795644989 796468430 797008286 796223907 796686020 797043457
2342.5 797043457 796878052 796828308 797003632 797770844 797450867 798170624 799349594 799544830 798810120 798660965
2352.1 798660965 799245911 799171371 799064255 798050385 797447968 797308578 796819839 795850677 795669556 797124176
2361.8 797124176 797803268 797589493 795951691 796293793 797472687 797552948 798269958 798851013 799636688
2370.4G99636688J51367K74201N33752O12793k08587m62037Q49991L32032J25732l5248
2380.1H01810684K70767Q61588M97131O03180L44391L6392k90146k36816l3264j65329
2389.7H03698578m2572O5460O1646j43509L38287K42310J99966L36456m47158j33362
2399.4H04176102M5700l31726n42069k46658o0883k53372J59149o9656j59378J30310
2409H02847519M90951M42505j64413j34201l61405n60607l52173j39618k20719j00326
2418.7H01747513J70364o1340r5139J91803O01273J72500k66494l05100n48706m12750
2428.3H01193924k26059O256k6779j57318m09851o5537M57993J95083L22571k6550
2438H01263733k80838j07422k65884m25339m76532n02777m34189L05252K33460j61286
$$ plain form
2370.4 799636688 799788055 800062256 800596008 801208801 801000214 800538177 801388168 801720200 801845932 801810684
2380.1 801810684 802081451 802943039 803440170 804043350 804387741 804424133 804133987 803897171 803863907 803698578
2389.7 803698578 803656006 803721466 803783112 803639603 803977890 804220200 804420166 804756622 804309464 804176102
2399.4 804176102 804221802 803890076 803348007 803101349 803040466 802787094 802946243 802876587 802717209 802847519
2409 802847519 803338470 803780975 803616562 803482361 803120956 802560349 802208176 802068558 801847839 801747513
2418.7 801747513 801917877 801856537 801761398 801953201 802554474 802726974 802460480 802155380 801606674 801193924
2428.3 801193924 800967865 800974121 800947342 800790024 800380173 800314636 800772629 800967712 801290283 801263733
2438 801263733 800982895 800875473 800609589 800184250 799707718 799204941 798770752 799076004 799309464 799148178
2447.6G99148178n5313K48642N13992J41373j1368p91092j042938k78015J4801k47345
2457.2G97640915p36084k59705N78995P26242l6621L73230Q53272j91727n66940r04694
2466.9G97476883p47452o65665m28314J86386n0735j54114m34875L34091Q55026K47574
2476.5G96618805Q3008j80283m47464p65838n71824l09753j62582l62778m77676L35922
2486.2G93759537L48510l8299j3046N4702m4632O5155Q6136k45819n23529q55179o31027
2496.8G91962509l09448K56348K50701m3411K03781o8130L33481L04336k77862n49622
2506.4G92062683q48846m89807k00654j94625n8747R5139l09372L3493O71692L44925
2516.1G91105881k8610l62626p1182j81045m93164q25806o11191M17633M4403j96609
$$ plain form
2447.6 799148178 799092865 799341507 799855499 799996872 799985504 799194412 798151474 797873459 797888260 797640915
2457.2 797640915 796904831 796645126 797224121 797950363 797913742 798286972 799140244 798948517 798381577 797476883
2466.9 797476883 796729431 796063766 795635452 795821838 795771103 795616989 795182114 795516205 796371231 796618805
2476.5 796618805 796701813 796521530 796074066 795308228 794736404 794426651 794264069 793901291 793423615 793759537
2486.2 793759537 794108047 794069748 794056702 794111404 794066772 794131927 794218063 793972244 793448715 792593536 791962509
2496.8 791962509 791653061 791909409 792160110 792116699 792320480 792252350 792585831 792890167 792612305 792062683
2506.4 792062683 791213837 790724030 790523376 790328751 790270004 790365143 790055771 790089264 790760956 791105881
2516.1 791105881 791077271 790714645 790643463 790462418 789969254 789143448 788532257 788949890 788994293 788797684
2525.7G88797684P248K14996J98975J60369J81733l30429R3765k99607r38415o72302
2535.4G87414017l13721K0065k03933R5062L61938L16468J3809J47018J95618j47553
2545G87898788R5597o28739q16497m93241k62985R0179M4480J80816J14212L62549
2554.6G86585159j41525k25677J99508k72217m19693o42166l64685j74713r384j30463
2564.3G84404144l61862K41776L26461L91159j7852l14560l38288l75976j23062k75803
2573.9G83556137N4016J1673l72009m70276m7836L69110m7074j50146k5711k5253l71781
2584.5G82480850j71356K8763m63562n70297k86103j10092n68695j63574K25448J72577
2594.2G80573959J51291m07867j30539q7280l51029m03595j35574k25449o67648O3019
$$ plain form
2525.7 788797684 788804932 789019928 789218903 789379272 789561005 789230576 789324341 789024734 788086319 787414017
2535.4 787414017 787100296 787120361 786916428 787011490 787373428 787689896 787703705 787850723 788046341 787898788
2545 787898788 787994385 787365646 786549149 786055908 785792923 785883102 785927582 786108398 786222610 786585159
2554.6 786585159 786443634 786217957 786417465 786145248 785725555 785083389 784718704 784543991 784534607 784404144
2564.3 784404144 784042282 784284058 784610519 785001678 784983826 784669266 784330978 783955002 783831940 783556137
2573.9 783556137 783610153 783621826 783249817 782779541 782731705 783100815 783053741 782903595 782877884 782852631 782480850
2584.5 782480850 782309494 782338257 781874695 781304398 781018295 780908203 780339508 780175934 780401382 780573959
2594.2 780573959 780725250 780317383 780186844 780099564 779748535 779344940 779209366 778983917 778316269 778379288
2603.8G78379288J2741k68707j93406m28161j83182J93405Q0261l82919l62930n13916
2613.5G76332474m86984k55433m1885j8768k50321J14517j09787k62451k64129j97907
2623.1G74559326R384j68762k36816p24716k72065J93863j81503o45218m97284L71857
2632.8G72408066k67716p24792m48227p5607J29852k09503j77460m17099j38168m2877
2642.4G70036469l47901m59671k34299M19312k67258p37152k10342p9499m08630l03421
2652G67407608n0201l27301k28043j29166m4784j75629j68381l15094o66656k66190
2661.7G65036163l77350l7155R613o56891k77404O4316M57m99496l58200L26385k85644
2672.3G62944794o49643r7962k11105r7580K89001r5291m85992m46930R16k38648l74908
$$ plain form
2603.8 778379288 778392029 778123322 777929916 777501755 777318573 777511978 777592239 777209320 776846390 776332474
2613.5 776332474 775845490 775590057 775548172 775529404 775279083 775393600 775283813 775021362 774757233 774559326
2623.1 774559326 774568710 774399948 774163132 773438416 773166351 773360214 773178711 772533493 772036209 772408066
2632.8 772408066 772140350 771415558 770967331 770891724 771021576 770812073 770634613 770217514 770079346 770036469
2642.4 770036469 769688568 769228897 768994598 769413910 769146652 768409500 768199158 768119659 767711029 767407608
2652 767407608 767357407 767030106 766802063 766672897 766628113 766452484 766284103 765969009 765302353 765036163
2661.7 765036163 764658813 764621658 764631271 763974380 763696976 763761292 763761749 763262253 762904053 763230438 762944794
2672.3 762944794 762295151 762197189 761986084 761888504 762177505 762082214 761596222 761149292 761150208 760911560 760536652
2682.9G60536652j99280m19846L510j05667j98975k07977k48642j602l12272k66036
2692.5G58579865l60489o4698j21765o06384k69470m10309l72391m09622k62833K98615
2702.2G56000519J76697l9139l1281l86963q30459m21448j79749j65176j98898q3695
2711.8G53840408J93711j58615n32380q58001j80741K90833p0038j60599l55453l57132
2721.5G51651993q24051m53491L98559K11792l61328o57425m39682o90307l54310J15128
2731.1G48596878N5847r7275m06570l55453m85917k39105k5482j26267m27322n31540
2740.8G45957794k94266l60946J36566P5073j6022J80436j31684l95965o91757l18757
2750.4G44140472l31192n63125p5608L14866j64032o77338l22495j70974j76239n44586
$$ plain form
2682.9 760536652 760337372 759917526 759921036 759815369 759616394 759408417 759159775 759158173 758845901 758579865
2692.5 758579865 758219376 758154678 758032913 757426529 757157059 756746750 756374359 755964737 755701904 756000519
2702.2 756000519 756177216 756138077 756106796 755719833 754889374 754467926 754288177 754123001 753924103 753840408
2711.8 753840408 754034119 753875504 753343124 752485123 752304382 752595215 752525177 752364578 752009125 751651993
2721.5 751651993 750827942 750374451 750773010 750984802 750623474 749966049 749526367 748836060 748481750 748596878
2731.1 748596878 748652725 748555450 748148880 747793427 747307510 747068405 747042923 746916656 746489334 745957794
2740.8 745957794 745663528 745302582 745439148 745514221 745498199 745678635 745546951 745150986 744459229 744140472
2750.4 744140472 743809280 743246155 743170547 743485413 743321381 742644043 742321548 742150574 741974335 741429749
2760G41429749m80271j03454j04828l17231p37075j73493k28653n76019n22537l40348
2769.7G37845840N7450k70996R6588o1569q15201q14514l55378N9891l88565n68466
2779.3G34785080n75256l44696l50113m14200l49655o55518l9444J526k36588k98309
2789G31522827q17261n72357k21557n05448o75125k72598m69818o97785l56140j82495
2798.6G26752243m87137o40945j04676l65295m90417o01120r08814o81610n84335r3003
2808.3G21794891l37677o04171m63715n03540l70712n89676m47235n10178p02743n37262
2817.9G16727982n06134p80564p77511n59311r53827o37741k73209n15366n86395m81872
2827.6G10656052n46112r80378p76519n18570o15540r35745r32007p37915r57184o59790
$$ plain form
2760 741429749 740949478 740846024 740741196 740423965 739686890 739513397 739284744 738708725 738186188 737845840
2769.7 737845840 737903290 737632294 737728882 737667313 736852112 736037598 735682220 735742111 735353546 734785080
2779.3 734785080 734209824 733865128 733515015 733100815 732751160 732095642 732056198 732057724 731821136 731522827
2789 731522827 730705566 730133209 729911652 729406204 728731079 728458481 727988663 727290878 726934738 726752243
2798.6 726752243 726265106 725624161 725519485 725154190 724663773 724062653 723153839 722472229 721887894 721794891
2808.3 721794891 721457214 720853043 720389328 719885788 719515076 718925400 718478165 717967987 717265244 716727982
2817.9 716727982 716221848 715441284 714663773 714104462 713150635 712512894 712239685 711724319 711137924 710656052
2827.6 710656052 710109940 709129562 708353043 707834473 707218933 706283188 705351181 704613266 703656082 702996292
2837.2G02996292n63049r66187j499862j269913r24606j534348j702576j858291k134552
2845.9F90542908k034607k043610k443771j914520j218644j313629n00107l32489l79562
2854.6F78361969k39868m34418k72369l98789p4692n65490q54416l63464o52771l87803
2864.2F74117889k57949q42209j206665o46592m70581j006164q58688q88291j023941
2872.9F66916809p16171n98526p33643m42047o64520q50983k23160k11563k44217l89251
2882.5F61842728n19486o59180q69598q87680r90524m99878o45676r06448q29468r76028
2892.2F54058762q00019o41861m84237o91834o65817r89227j203309n69763l14636
2900.8F47698059m29764j116943p99484l95203m42581q9722m88663l37905n12543r87091
$$ plain form
2837.2 702996292 702433243 701467056 699967194 698697281 697772675 696238327 694535751 692677460 690542908
2845.9 690542908 688508301 686464691 684020920 682106400 680887756 679574127 679074020 678741531 678361969
2854.6 678361969 678122101 677687683 677415314 677016525 676941833 676376343 675521927 675158463 674505692 674117889
2864.2 674117889 673859940 673017731 671811066 671164474 670693893 669687729 668829041 667940750 666916809
2872.9 666916809 666200638 665602112 664868469 664426422 663761902 662910919 662687759 662476196 662231979 661842728
2882.5 661842728 661323242 660664062 659794464 658906784 657916260 657416382 656770706 655864258 655034790 654058762
2892.2 654058762 653258743 652616882 652132645 651440811 650774994 649785767 648582458 648012695 647698059
2900.8 647698059 647268295 646151352 645351868 644956665 644514084 644424362 643935699 643597794 643085251 642098160
2910.5F42098160q34275o02798j49918o65550j287651j145897j232147j480942j037407
2919.2F33661575l51371l13759p07245r31435o69594K2431Q02345Q6861m25873J45645
2928.8F31319580j0033k8991q9875J1330P9651J22223N47104N88875N82046M48113
2938.5F33570023M33006K22816K72980N29671L87993K72102j89590P6599L61099P5607
2948.1F36012306n9204j29852j78261p37343p01294n32379o11038k25411j29318j40304
2957.7F32567902k28577j33286L89138N38864J29204Q3694L11203L81279O91452R41239
2967.4F35672112O28776k4528L54614J255722J091194Q45718J324006J169509R57032
2976.1F43274155J294403O02798O32172R69009P44477Q08944J84784Q38852J284714
$$ plain form
2910.5 642098160 641263885 640661087 640511169 639845619 638557968 637412071 636179924 634698982 633661575
2919.2 633661575 633310204 632996445 632289200 631357765 630688171 630710602 631512947 631599808 631173935 631319580
2928.8 631319580 631309547 631280556 631190681 631202011 631281662 631403885 631950989 632539864 633121910 633570023
2938.5 633570023 634003029 634225845 634498825 635028496 635416489 635688591 635499001 635575600 635936699 636012306
2948.1 636012306 635953102 635823250 635644989 634907646 634206352 633673973 633062935 632837524 632708206 632567902
2957.7 632567902 632339325 632206039 632595177 633134041 633263245 633346939 633658142 634039421 634730873 635672112
2967.4 635672112 636300888 636276360 636630974 637886696 638977890 639823608 641147614 642317123 643274155
2976.1 643274155 644568558 645171356 645803528 646772537 647517014 648325958 648510742 649349594 650634308
2984.7F50634308N04379O99082R90295R34525P76596O95266K65580L60794M71649M25110
2994.4F56757584O64672k7465L41415M85458o8664N4703k47422J38932L36914Q9645
3004F58525772J30615j41067j82572J80741J34735n10407k30407K96554j38016k21328
3013.7F57844620J18561j84708n37491k27890J1368n33142j208039p02591j2969J34582
3023.3F54702301k64282q73566m09698j41449m32282l13415n0507l25851o13175j76849
3033F51101227l62244p77206q26569m57229l1586m12674o18363m56161k61765k28576
3042.6F46668854k51465l53012r39560r65347k53830k37427o50177n86929q18787p07321
3052.2F40904999j56403j17874k77100n49545n87425o69060q60557q71468m61311k25296
$$ plain form
2984.7 650634308 651138687 651837769 652828064 653762589 654539185 655234451 655500031 655860825 656332474 656757584
2994.4 656757584 657422256 657394791 657736206 658221664 658153000 658207703 657960281 658099213 658436127 658525772
3004 658525772 658656387 658515320 658332748 658513489 658648224 658137817 657907410 658203964 658065948 657844620
3013.7 657844620 657963181 657778473 657240982 657013092 657024460 656491318 655283279 654580688 654567719 654702301
3023.3 654702301 654438019 653564453 653154755 653013306 652581024 652267609 652217102 651891251 651278076 651101227
3033 651101227 650738983 649961777 649135208 648677979 648646393 648233719 647615356 647159195 646897430 646668854
3042.6 646668854 646417389 646064377 645124817 644159470 643905640 643668213 643018036 642431107 641612320 640904999
3052.2 640904999 640748596 640630722 640353622 639804077 639216652 638547592 637687035 636815567 636354256 636128960
3061.9F36128960l41339k26326p02820m65126l05977q12798k61879q7242l50227q46634
3071.5F31728592q60825j81465j40304l86582n89371n18569k75879N0659p0191l87497
3081.2F28368568o21795p58553l53317l76587m69170o29921o26831l29666n45807n69496
3090.8F23087425j79672j42174p96547n07278l70865q61816n41039k85988M9324r35669
3100.5F18515701j266975j54648k71606m31748o49795l24135k16103q09097n24941
3109.1F13866653k61573m56047q37365q26034o85234n99213q32825j170616l03650
3117.8F07894096J49575p08123p00225p1373p73850j359863j338730j232147n07508
3126.5F01351852n17196p74575q43391p07817k53944n62783r89875l98636N72n55916
$$ plain form
3061.9 636128960 635787621 635561295 634858475 634393349 634087372 633274574 633012695 632925453 632575226 631728592
3071.5 631728592 630867767 630686302 630545998 630159416 629570045 629051476 628775597 628826256 628756065 628368568
3081.2 628368568 627746773 626988220 626634903 626258316 625789146 625159225 624532394 624202728 623656921 623087425
3090.8 623087425 622907753 622765579 621969032 621461754 621090889 620229073 619688034 619402046 619451370 618515701
3100.5 618515701 617248726 617094078 616822472 616390724 615740929 615416794 615200691 614391594 613866653
3109.1 613866653 613605080 613149033 612311668 611485634 610800400 610201187 609368362 608197746 607894096
3117.8 607894096 608043671 607335548 606635323 606563950 605790100 604430237 603091507 601859360 601351852
3126.5 601351852 600834656 600060081 599216690 598508873 598254929 597692146 596702271 596303635 596304207 595748291
3136.1E95748291n16777o93626q23861o68563j300507p81860n65949j030350q30001
3144.8E88536797q00438n90592j87568j07346j039085j385918o85692o83098r65652
3153.5E82091408p69234n42297r38759r15833l91655l76091r45510q59108o29540j532097
3163.1E74191284j224289l63807j22414m59709j379242q75969m00620o22673o43959
3171.8E68098602o42700n89065q30117o49414n46760p73430q71544j059609p90443
3180.5E61345520n67474p58248o96068q04405j190033p64427p3891o44683j339493
3189.2E54506798q78792m53033j71319m03709q37593n02396n68123n83114j240196
3197.9E48868523j636658n30777k78015l79372j067848j256981k13585j0300m71534
$$ plain form
3136.1 595748291 595231514 594537888 593714027 593045464 591744957 590963097 590397148 589366798 588536797
3144.8 588536797 587736359 587145767 586958199 586850853 585811768 584425850 583740158 583057060 582091408
3153.5 582091408 581322174 580779877 579841118 578925285 578533630 578157539 577212029 576352921 575723381 574191284
3163.1 574191284 572966995 572603188 572480774 572021065 570641823 569765854 569365234 568742561 568098602
3171.8 568098602 567455902 566866837 566036720 565387306 564840546 564067116 563195572 562135963 561345520
3180.5 561345520 560778046 560019798 559323730 558519325 557329292 556564865 556490974 555846291 554506798
3189.2 554506798 553628006 553174973 553003654 552599945 551762352 551259956 550691833 550108719 548868523
3197.9 548868523 547231865 546701088 546423073 546043701 544975853 543718872 543505287 543494987 543023453
3206.5E43023453q50907m56237p51839j175270p90253o62536m41742r29947o31752
3215.2E36332970p4883p23343n53207k85683r26971r50127k95257k61422p26623r60846
3224.9E30574608n35278n29366q51822n69191m30870j90010m64859n75638m76913o33164
3234.5E25317497m39834r26361r81102n77736l65067n71709o68220m12788q06618k15645
3244.2E19352417l94897r69468l17154m95147o68640o66466n05638m13666k85301m23279
3253.8E14212761q02231k29530l19672q26683r63402n31273k14424p31659n56526k82287
3263.4E08755074n05219m28581k86751p15790p38601m94538m05006K7542k14348n08728
3273.1E04485054n82619m65126m69551p35550m25377m37736l07274l34053p04002m88282
$$ plain form
3206.5 543023453 542172546 541716309 540964470 539789200 538998947 538336411 537894669 536964722 536332970
3215.2 536332970 536258087 535534744 534981537 534695854 533768883 532818756 532523499 532262077 531535454 530574608
3224.9 530574608 530039330 529509964 528658142 528088951 527658081 527468071 527003212 526427574 525950661 525317497
3234.5 525317497 524877663 523951302 522970200 522392464 522027397 521455688 520787468 520374680 519568062 519352417
3244.2 519352417 518957520 517988052 517670898 517175751 516507111 515840645 515335007 514921341 514636040 514212761
3253.8 514212761 513410530 513181000 512861328 512034645 511071243 510539970 510325546 509593887 509037361 508755074
3263.4 508755074 508249855 507821274 507534523 506818733 506080132 505585594 505180588 505208130 504993782 504485054
3273.1 504485054 503902435 503437309 502967758 502232208 501806831 501369095 501061821 500727768 500023766 499535484
3282.7D99535484j07879j14479l66555l14483l31497l81814q04939p08504r2124j10817
3292.4D96202393j71433n76019m11301k86941l04108r6932p12890n69191k69318m97017
3302D92307243p14264o70967k75077k85187m03328k17629o4506n37377n11741j39427
3311.7D88487740J14364m05006j489372o59752j42670l13492m69742r96475m16756
3320.3D83708839n9623n1995j24511n90439r07746o69975k96211m62456n62134q55980
3330D79127769p12776m92134n45196m22745k69661L04108N6572m31557q05435j224404
3339.6D74584541q15468l64265k76604n64041n72510o28776o88439m52652l74221r1095
3349.3D69756470m51355q48122o74362n13306m04205n64880o76575r35860p56988R4452
$$ plain form
3282.7 499535484 499427605 499313126 498946571 498632088 498300591 497918777 497113838 496405334 496313210 496202393
3292.4 496202393 496030960 495454941 495043640 494756699 494452591 494355659 493642769 493073578 492804260 492307243
3302 492307243 491592979 490922012 490646935 490361748 489958420 489740791 489676285 489138908 488627167 488487740
3311.7 488487740 488602104 488197098 486707726 486047974 485905304 485591812 485122070 484125595 483708839
3320.3 483708839 483649216 483597221 483472710 482882271 481974525 481304550 481008339 480545883 479983749 479127769
3330 479127769 478414993 477922859 477377663 476954918 476685257 476989365 477045937 476614380 475808945 474584541
3339.6 474584541 473769073 473404808 473128204 472564163 471991653 471362877 470674438 470221786 469847565 469756470
3349.3 469756470 469305115 468456993 467782631 467269325 466865120 466300240 465623665 464687805 463930817 464025269
3358.9D64025269j79863r90487o13746k69013l25355k40212j24702k95792r34601j048164
3368.6D59003334j159515o75507j78184p30172m80232k60467j28365j91574l57018
3377.2D54842300l28407r71527p43942m5166M75006m41857j622924o44875k39105k41585
3386.9D50037918j14326K8915L12233j93634l02773k96173n37719n71251n79186j60446
3396.5D47623558m2496m22592k80037k76031m62914o4888N0926k65159k30904n1918
3406.2D45577545k62489j49231j02921k78511J42899o9580l95699o26068l19481M31099
3415.8D43947563j02081j29624J78833M5243J9417k25106k40440j35918j26037k9908
3425.5D43201942K17400O3324K01111J5220j14212M67301P7400J8120k78244l98941
$$ plain form
3358.9 464025269 463845406 462854919 462241173 461972160 461646805 461406593 461281891 460986099 460051498 459003334
3368.6 459003334 457843819 457168312 456990128 456259956 455779724 455519257 455390892 455199318 454842300
3377.2 454842300 454513893 453542366 452798424 452753258 453228264 452786407 451163483 450518608 450279503 450037918
3386.9 450037918 449923592 449952507 450264740 450071106 449768333 449472160 448934441 448363190 447784004 447623558
3396.5 447623558 447581062 447158470 446878433 446602402 446139488 446074600 446125526 445860367 445629463 445577545
3406.2 445577545 445315056 445165825 445062904 444784393 444927292 444857712 444462013 443835945 443516464 443947563
3415.8 443947563 443845482 443715858 443894691 443939934 443959351 443734245 443493805 443357887 443231850 443201942
3425.5 443201942 443419342 443482666 443683777 443698997 443584785 444052086 444129486 444147606 443869362 443470421
3435.1D43470421L63998P73888M64744m22630K53105P07550L88642k48452l47137N10521
3444.7D45914650M50363R84230o63338p01980J239586K82249O92177O98204K33345
3453.4D49129486O23665L56407P81441M54788j05553N6076N14069M66652O58798P52068
3463.1D53687897j99852K14691P91893O33087K52266M63753M52156k57836M05312P14722
3472.7D57158089J118202J063690p9460O62422P55921J63917L59154J93634N95779
3481.4D61991348L18413q2016J000824P13959K57835J055260R11827O86798J014938
3490.1D67869186N32799j50413L99513J171341J001968L93486N6763M23393P70645
3498.7D72468681O56510N22918R42841Q30040M58870M54407J21650L53127L58162J252556
$$ plain form
3435.1 443470421 443834419 444608307 445073051 444650421 444903526 445611076 445999718 445751266 445404129 445914650
3444.7 445914650 446365013 447349243 446685905 445983925 447223511 447505760 448197937 448896141 449129486
3453.4 449129486 449753151 450109558 450890999 451345787 451240234 451296310 451810379 452277031 452935829 453687897
3463.1 453687897 453488045 453702736 454494629 455127716 455379982 455843735 456295891 456038055 456443367 457158089
3472.7 457158089 458276291 459339981 459260521 459922943 460678864 460842781 461201935 461395569 461991348
3481.4 461991348 462309761 462227745 463228569 463942528 464200363 465255623 466167450 466854248 467869186
3490.1 467869186 468401985 468251572 468651085 469822426 470824394 471217880 471274643 471698036 472468681
3498.7 472468681 473125191 473648109 474590950 475420990 475879860 476334267 476455917 476809044 477167206 478419762
3508.4D78419762J415825k2316N48057Q63762J369972Q71506J96877R03739O19088
3517.1D85186272L62587K70424J336021J584206R90066O28662j145515K95486J829529
3525.7D91337738J164856P77664N75676O08177P23038O02303O68525R10759Q23212
3534.4D98191948J548729M54063l96385J587830J339836Q59566Q32519J031265R45855
3543.1E06395226P95402P54890J68038Q49419k03476R92546J767273J921196K056961
3551.8E15497475j050034O41136J124230J173515J945839N12581J139679R13925P07550
3560.5E22605896K48413K024269K033730K89383L497352P7095p97538L31153j257972
3569.1E29051781L006630J499862P32117J641388K167282J028328L93333J780739P73697
$$ plain form
3508.4 478419762 479835587 479813271 480361328 481225090 482595062 483466568 483663445 484567184 485186272
3517.1 485186272 485548859 485819283 487155304 488739510 489729576 490358238 489212723 489508209 491337738
3525.7 491337738 492502594 493280258 493855934 494464111 495187149 495789452 496457977 497368736 498191948
3534.4 498191948 499740677 500194740 499798355 501386185 502726021 503585587 504418106 505449371 506395226
3543.1 506395226 507190628 507945518 508113556 508962975 508759499 509752045 511519318 513440514 515497475
3551.8 515497475 514447441 515088577 516212807 517386322 519332161 519844742 520984421 521898346 522605896
3560.5 522605896 522854309 524878578 526912308 527201691 530699043 530776138 529978600 530309753 529051781
3569.1 529051781 532058411 533558273 534290390 535931778 538099060 539127388 539520721 541301460 542075157
3577.8E42075157K140122J800270P27806J765175K056617J182213K57683M227715K054214
3586.5E58286972l396492O27747N56755L023719K638131K983970Q83217l95202L679962
3595.2E68888779o89736J220703K972680O72569K865791J199761O62536J875038J953659
3603.9E81621780K042160K414971J607132j204262L192368l55645J17302P456055J676063
3612.5E98567924k225952L444786K671L483123M136467P5531J361161r78470Q39195
3621.2F08706436L864250K492295K113342L159370K212258K618942O527328p52677
3628.9F30941544r317856M950638M947586N621833K486000j048355K660675L742066
3636.6F44984131K691574R73663J671830K214889K689972J797028N11398K496796L519744
$$ plain form
3577.8 542075157 544215279 546015549 546743355 548508530 550565147 551747360 552005043 556232758 558286972
3586.5 558286972 554890480 555518227 556074982 559098701 561736832 564720802 565604019 565208817 568888779
3595.2 568888779 568199043 569419746 572392426 573064995 575930786 577130547 577793083 579668121 581621780
3603.9 581621780 583663940 586078911 587686043 586481781 589674149 589318504 589435806 596891861 598567924
3612.5 598567924 596341972 599786758 599789429 603272552 607409019 607484550 608845711 607867241 608706436
3621.2 608706436 612570686 615062981 617176323 620335693 622547951 625166893 631694221 630941544
3628.9 630941544 621623688 626574326 631521912 637143745 639629745 638581390 641242065 644984131
3636.6 644984131 647675705 648649368 650321198 652536087 655226059 657023087 657534485 660031281 663551025
3645.3F63551025N613327M29154l999710M177246O51092j343689J10856N669555M639588
3654F79498444L812255N085526o775055J875229N333939J534500J769333R48867K185517
3662.7F95268555J224746J618500J983261N35660M082718K917709j198272j137925
3670.4G05294952n221939L806000R040299J0095596p78656j9615250M281082P527161
3678.1G14429245M159088k440719L96957L503189K147064J192856j44424N16815M202804
3686.8G27962875N359421r295959l353196P836991o097489n40771N365524J189118
3694.5G28426514J486740l73306q66242J168060O05164K327728K364273m530105j085739
3703.2G29523087M781723J355590L78647J707306L152695L725052o939163L598403
$$ plain form
3645.3 663551025 669164352 669593506 665593796 669771042 670422134 669078445 669189301 674858856 679498444
3654 679498444 683310699 688396225 681621170 683496399 688830338 690364838 692134171 693083038 695268555
3662.7 695268555 696493301 698111801 700095062 700630722 704713440 707631149 706432877 705294952
3670.4 705294952 700073013 703879013 712919312 723014908 722236252 702621002 706902084 714429245
3678.1 714429245 718588333 716147614 716544571 720047760 722194824 723387680 723243256 723760071 727962875
3686.8 727962875 733322296 724026337 720673141 728510132 722412643 721871872 727237396 728426514
3694.5 728426514 729913254 729539948 728673706 729841766 730446930 732774658 735138931 730608826 729523087
3703.2 729523087 734304810 735660400 736039047 737746353 740899048 744624100 737684937 741283340
3710.9G41283340M441605j3026276M672089M582367L85513N73654K302628J338120
3718.6G46553040l115769J563721N999679k818679n404206M343109J769867M07486
3726.3G49298248k411575j208878L079377J395797N124283m139557p220306R907989
3734G53825378j24664j0746994R82819J848678O42624L384400L281555l523026L119736
3742.7G52690506J0844879j1333389j5971756J1006622N746689N154724j929321r307556
3750.4G46901398J0284576n543671o204834N247651M366760L222504o321564K374573
3758.2G54327393N780410q778991j350708M775314J461716j73493L024369l048783
3765.9G56017227m551925M281921O145019P68280j0958175J114425L967896Q35113
$$ plain form
3710.9 741283340 745724945 732698669 737370758 741953125 742338638 742912292 745214920 746553040
3718.6 746553040 743437271 745000992 751000671 748181992 742777786 747120895 748890762 749298248
3726.3 749298248 746886673 745677795 748757172 750152969 755277252 751137695 743917389 753825378
3734 753825378 753700714 742953720 743936539 745785217 746427841 749812241 753093796 749570770 752690506
3742.7 752690506 763535385 752201996 736230240 747236862 752983551 758138275 756208954 746901398
3750.4 746901398 757185974 751642303 745437469 750685120 755051880 758274384 751952820 754327393
3758.2 754327393 760107803 751328812 749978104 754753418 756215134 756041641 759066010 756017227
3765.9 756017227 751465302 755747223 761892242 762660522 751702347 752816772 756784668 757619781
3773.6G57619781N75028p40356N32989J57623J821289r51690o703263L180542K806549
3782.3G58298492J140519J529770l397980j306000J555023R43909M15192o59256j74561
3790.9G58345108M07944L28521n23452J041946L094177l347625m301758J881866M275513
3799.6G61202240O436615o435852j1191940M432373L151779M230041M752121j0583038
3807.3G55994339l871002N556335K100144O8741O86035N47409J360473M950409k155685
3816G65237198j4353943N228119N848083M304657J097107j9298629L455429O481018
3823.7G57999039J917114K155075j18713l644104O27441J849823K889710N53436r372559
3832.4G54856262L150177P467957n980149o82678Q149719p994308m586487P497482
$$ plain form
3773.6 757619781 758194809 757454453 757987442 758145065 759966354 759014664 752311401 755491943 758298492
3782.3 758298492 759439011 760968781 757570801 756264801 757819824 758763733 759178925 758519669 758345108
3790.9 758345108 758753052 759081573 758558121 759600067 762694244 759346619 755044861 756926727 761202240
3799.6 761202240 767638855 761203003 750011063 754443436 757595215 761825256 766577377 755994339
3807.3 755994339 752123337 757679672 759779816 759848557 760534592 761082001 762442474 767392883 765237198
3816 765237198 750883255 756111374 761959457 766264114 767361221 748062592 751518021 757999039
3823.7 757999039 759916153 762071228 761952515 758308411 758935852 760785675 763675385 764228821 754856262
3832.4 754856262 758006439 765474396 759494247 758811569 766961288 758966980 754380493 761877975
3840.1G61877975n328598K55661O348267l199692l685226K060928J199494O14929K450332
3848.8G62594070J86615J803513O113510o045837k025376j4575653J694947R983444
3856.5G59729233j113739j613083J987152K142868K444687n998383Q5831P155533n527496
3865.2G59292603n488968L858413M767990N298615p200241q914414L562699O858139
3872.9G62034836M608764j0743255j31989L968888m1123K236176M385605o209336p345657
3881.6G52762909O237411J877518J940079M591904j3972397O11648M043732J381988
3889.3G59474792N049134p22275q714447J783066L590851j167298P80487N83420J738892
3898G62396622J643524r122315M708863K179794m974213M911499l468475k405929Q24356
$$ plain form
3840.1 761877975 756549377 756805038 763153305 759953613 756268387 758329315 759528809 760143738 762594070
3848.8 762594070 762780685 764584198 770697708 764651871 762626495 748050842 749745789 759729233
3856.5 759729233 758615494 757002411 758989563 761132431 763577118 757578735 757664566 764820099 759292603
3865.2 759292603 753803635 757662048 762430038 767728653 760528412 751613998 755176697 762034836
3872.9 762034836 766643600 755900345 755768356 759737244 759696121 761932297 766317902 760108566 752762909
3881.6 752762909 759000320 760877838 762817917 767409821 753437424 754049072 758092804 759474792
3889.3 759474792 764523926 763801651 755087204 756870270 760461121 759293823 760074310 760657730 762396622
3898 762396622 764040146 754917831 759626694 761806488 756832275 761743774 758275299 755869370 756693726
3906.7G56693726J266098K132263j059418k48489R01718O00891p33337p67212J963043
3915.3G60749283K191315l772126l168487M430008J82266l941727J807251J887207
3923.1G60364990R21784k947998k840805J925125J750564J657868q60749p57980J453934
3931.7G60666733l053742j551895J494217K73438K84500L82309R9487k96402j73721
3940.4G58124924K062072J590806m342804j919709J170655J287536J660614j708832
3948.1G57925262J7090m501k105331J907577K7695j045914J002045K76794k63061n80597
3957.8G57157059M76989M65851N77774j9836j412201J58157K02790Q7967l6316p61261
3967.4G56896973Q2473j96914j29242J504440N59921j517181o30722R54742N86930
$$ plain form
3906.7 756693726 757959824 760092087 759032669 758784180 759685898 760286789 759553452 758786240 760749283
3915.3 760749283 762940598 759168472 755999985 760429993 760612259 756670532 758477783 760364990
3923.1 760364990 761286774 758338776 755497971 757423096 759173660 760831528 759970779 759212799 760666733
3931.7 760666733 757612991 756061096 757555313 757828751 758113251 758495560 758595047 758298645 758124924
3940.4 758124924 760186996 761777802 757434998 755515289 756685944 757973480 759634094 757925262
3948.1 757925262 757942352 757937851 755832520 757740097 757767792 756721878 757723923 758000717 757737656 757157059
3957.8 757157059 757634048 758099899 758677673 758657837 757245636 757403793 757606583 757694550 757658234 756896973
3967.4 756896973 756979446 756782532 756653290 758157730 758717651 757200470 756569748 757524490 758111420
3976.1G58111420n55420n41229j36567L17231L35846m61197k23999P33261N33752p99179
3985.7G57313919m35791P01294P89337Q09860o48574j280442M0436Q01926L84063o83288
3995.4G57792740p30744L5859M37622m35257k39563
4000.2G56860657
$$ plain form
3976.1 758111420 757556000 757014771 756878204 757195435 757531281 757070084 756846085 757579346 758113098 757313919
3985.7 757313919 756878128 757579422 758368759 759178619 758530045 757249603 757290039 758091965 758476028 757792740
3995.4 757792740 757061996 757097855 757535477 757100220 756860657
4000.2 756860657
##END=$$ End of the data block
