##TITLE=$$ Begin of the data block
##JCAMP-DX=5.00 $$ ACD/SpecManager v 10.08
##SPECTROMETER/DATA SYSTEM=Varian
##DATE=07 Jan 2013 10:27:40
##DATA TYPE=INFRARED SPECTRUM
##DATA CLASS=XYDATA
##ORIGIN=
##OWNER=
##NPOINTS=3735
##FIRSTX=399.26403809
##LASTX=4000.35498047
##MAXX=4000.35498047
##MINX=399.26403809
##MAXY=170.65725708
##MINY=9.72467613
##XFACTOR=1.0000000000
##YFACTOR=0.000001000000000
##FIRSTY=96.66865540
##DELTAX=0.96440572
##XUNITS=1/CM
##YUNITS=TRANSMITTANCE
##XYDATA=(X++(Y..Y))
399.3I6668655P3988602r4339317l4103127K561463p082238N76256K0346115o698013
407E1918396o471008M807113k528091q50399r333733l905197J1360146J1319404L263680
415.7E9580311q792481j3365062k108357N826882O101917Q283779M824047q975651
423.4E1375385q802833N28965L936378J0707180j502846j7645996l686733J1906654
431.1D6816154Q751629n562873j0375565J768166J1971214p59049j0936393L173236
438.8D4846519N436673o069718j16119Q600170J994354l272045K340111o766365m119736
447.5D2873844J1063809O914436k990631o747837N993591L295998p973034l604031
455.2D8826145o128837R367572P271813j6474888J319118P547593k485630o696248
$$ y = [96668655, 170657257, 76317940, 42214813, 44776276, 37694038, 38270294, 58616409, 51918396, 45447388, 50254501, 47726410, 46876011, 37542278, 33637081, 44997227, 56316631, 59580311, 50787830, 37422768, 35314411, 41141293, 47243210, 55526989, 60351036, 51375385, 42572552, 43101517, 47037895, 57745075, 56242229, 38596233, 34909500, 46816154, 55567783, 50004910, 39629345, 41397511, 53368725, 52609676, 41673283, 44846519, 50283192, 44213474, 44097355, 52697525, 54691879, 51419834, 53759945, 46993580, 42873844, 53937653, 60852089, 57861458, 51113621, 57107212, 60403210, 52430176, 48826145, 42697308, 52064880, 59336693, 42861805, 44180923, 51728516, 49242886, 42546638]
462.9D2546638J673504L892815L737103N599285j77132m935280l459057l48045O127609
471.6E4657440N034321o968849K848697L018506l834607l605941o226242K695716O309292
480.3E3928333l941921n730160K724724P966412j88610j214974l833782k319126K251297
489D9642193k022240J29044L039077K831139l310219l780098L179955j453278l968582
497.6D4286991J962814M070317l032620m823414N129654M605538o7490k027347m694558
506.3D5409885j920410K372196J934285J203205J582912j509079k857792K37480Q04673
515D7257355J236416P59685j347957J582679J353607J394642J483410o791138o203716
523.7D0724983J781643M435490K702106p52350j909900j033303R85295J809540j950486
$$ y = [42546638, 44220142, 48112957, 51850060, 57449345, 57272213, 52336933, 48877876, 48529831, 54657440, 59691761, 52722912, 55571609, 58590115, 54755508, 51149567, 44923325, 47619041, 53928333, 49986412, 44256252, 46980976, 54947388, 54758778, 53543804, 49710022, 47390896, 49642193, 47619953, 47748997, 50788074, 53619213, 50308994, 46528896, 49708851, 48255573, 44286991, 46249805, 50320122, 47287502, 42464088, 47593742, 52199280, 52131790, 50104443, 45409885, 43489475, 45861671, 47795956, 48999161, 50582073, 49072994, 46215202, 46452682, 47257355, 48493771, 49253456, 47905499, 49488178, 50841785, 52236427, 53719837, 46928699, 40724983, 42506626, 46942116, 49644222, 48891872, 46981972, 45948669, 46933964, 48743504, 46793018]
532.4D6793018n96336J191307j989037J369149K573833k61333M07619j660034j237762
541D6590424j14407j366856m89071R62281J489074n00419L51250Q57521j278099J021507
550.7D7523205J308384p09606n03079n6129Q73088J775300Q60202j773971l132664
559.4D6164730n57964J941776N31185M23855O12499j739490j785370P33257J767697
568D8092175n41066j127990n56141n33863K488376K267395j025554n19577Q25447J39881
577.7D9509083j188183j609104n34596P32945R93179P41516p25563j108982N4245k01996
587.3D6662544O4942J30813r41684L26160K297253M85347k077831k296554k88521J419647
597D5782116M0302j274685J333382L044281q26244k326435l69820l06625K81513P50381
$$ y = [46793018, 46196682, 47387989, 45398952, 46768101, 49341934, 49080601, 49488220, 47828186, 46590424, 46476017, 45109161, 44620090, 45582371, 47071445, 46571026, 46922276, 47779797, 46501698, 47523205, 48831589, 48121983, 47618904, 47562775, 48435863, 50211163, 51071365, 49297394, 46164730, 45606766, 47548542, 48079727, 48503582, 49116081, 47376591, 45591221, 46324478, 48092175, 47551109, 46423119, 45866978, 45333115, 47821491, 50088886, 49063332, 48543755, 49369202, 49509083, 48320900, 46711796, 46177200, 46910145, 47903324, 48644840, 47919277, 46810295, 46864540, 46662544, 46727486, 46858299, 45916615, 46242775, 48540028, 49025375, 46947544, 44650990, 44362469, 45782116, 45822418, 44547733, 45881115, 48925396, 48099152, 45772717, 45402897, 45096272, 45377785, 46128166]
606.6D6128166r43405k643154j965160m54266l96088n47119k149528j840561M94579
615.3C5683464J286289M38919r13189J128399J028763k708282k258625j213536k459005
624C0013197j137655J996221J834521J315887K799934L412854j35739j722282J169731
632.7C9546669J334118M31335j404064l125046j732486l65143O24252J151264J770932
641.3C8231831J315998K161758K473683j03207K75497J261376J469066J651615J208397
650D9946014N85770r43344M2156R39015L20888O88984k82352j242131k80349J031131
659.7E0805782M07898K76863M73835n50258J57898N55851j74332R23519K235851k706882
669.3E2406025l73306J504894M41200m53453L45539M54552m94072m5471O13041j054432
$$ y = [46128166, 45184761, 42541607, 40576447, 40122181, 39726093, 39178974, 37029446, 35188885, 35683464, 36969753, 37408672, 36495483, 37623882, 38652645, 35944363, 33685738, 32472202, 30013197, 28875542, 30871763, 32706284, 34022171, 36822105, 40234959, 40099220, 38376938, 39546669, 40880787, 41312122, 39908058, 36783012, 35050526, 34685383, 35309635, 36460899, 38231831, 39547829, 41709587, 44183270, 44080063, 44355560, 45616936, 47086002, 48737617, 49946014, 50531784, 49588440, 49630596, 50569611, 50890499, 51579483, 51297131, 50055000, 49774651, 50805782, 51213680, 51490543, 51964378, 51414120, 51572018, 52127869, 51953537, 52877056, 55112907, 52406025, 52032719, 53537613, 53978813, 53525360, 53870899, 54325451, 53831379, 53785908, 54398949, 53344517]
678.9E3344517o17337R22585M74407J35857r07387q37479P75048N08712l62678m559
688.6E3431686j69525k71435l3470j054660K2842J736778n41828k637157j529519N94365
698.2D9548077J718711J317917l3115j125240j058434o26369N36621O05808R8495J063023
707.9E2045494N30518l25425l63052L7060P71465N06466L81680R5195m90535n28424
717.5E2660442N51972O76719j277027k30671J291405N03498M52194N21595Q0174n31284
727.2E4699017r90384q37886k58847P10244J327003l42098j387085L27434K76993L8330
736.8E3562721L31795o10600j04087O53270O28880j71093p5172R14669n1117q08209
746.5E4271057j19911Q56598M35665k15939N88829K25544P2915M15439o1489K43649
$$ y = [53344517, 52727180, 53649765, 54124172, 54260029, 53352642, 52515163, 53290211, 53798923, 53436245, 53431686, 53262161, 52990726, 52957256, 51902596, 51925438, 53662216, 53120388, 50483231, 48953712, 49548077, 51266788, 52584705, 52551590, 51426350, 50367916, 49741547, 50278168, 50883976, 50982471, 52045494, 52576012, 52250587, 51887535, 51924595, 52696060, 53202526, 53584206, 53679401, 53188866, 52660442, 53212414, 53889133, 52612106, 52381435, 53672840, 54176338, 54628532, 55150127, 55230301, 54699017, 53708633, 52870747, 52611900, 53322144, 54649147, 54307049, 52919964, 53247398, 53524391, 53562721, 53894516, 53283916, 53179829, 53833099, 54461979, 54290886, 54215714, 55130383, 55079266, 54271057, 54151146, 55007744, 55443409, 55227470, 55816299, 56041843, 56114758, 56530197, 56468708, 56712357]
756.1E6712357O75506L74039m45259n88978O98132J197696L0537N1643Q16620K87491
765.7E9809784k48783j022083q41076O91585M69845K33429N12707r13773q42590Q50014
775.4E8699059N35461k5101L94959J28410n7415M97971O61827r808J77899M50809l42796
786F1111275m51683m87099k58232K81299K90619K36508l14743L81164J386620O21284
795.6F2797012K32212j93729p49226n06111L14766Q30380l13366o80630l75256l36406
805.3F1019646M80224k57389q00785K92133L88402k81533l78742M07555K00565l71834
814.9F0698242L83438O24035L22277Q1879J58695M87808J19248l38394q16964n9528
824.6F1660736R87682l50559p96417n05467m28134Q24119n60005j546932Q2081L06831
$$ y = [56712357, 57387863, 57761902, 57316643, 56727665, 57425797, 58623493, 58654030, 58705673, 59522293, 59809784, 59561001, 58538918, 57697842, 58389427, 58859272, 59092701, 59605408, 58691635, 57849045, 58699059, 59234520, 59209419, 59604378, 59732788, 59675373, 60173344, 60835171, 60825363, 61003262, 61454071, 61111275, 60659592, 60172493, 59914261, 60195560, 60486179, 60722687, 60407944, 60789108, 62175728, 62797012, 63029224, 62835495, 62086269, 61580158, 61894924, 62725304, 62411938, 61731308, 61356052, 61019646, 61499870, 61242481, 60441696, 60733829, 61122231, 60840698, 60461956, 60869511, 61070076, 60698242, 61081680, 61705715, 62027992, 62109871, 62268566, 62756374, 62875622, 62537228, 61720264, 61660736, 62648418, 62297859, 61501442, 60995975, 60567841, 61391960, 60831955, 59285023, 59367104, 59673935]
834.2E9673935K09179l00099k02850j66622j092724j44028n60424j732438m58477P10667
843.9E5936119M02065m81140p57404m99596N81520J076248k33314q74367j44066N72461
853.5E5578526K37037M56566R01966M18858N45727M10427Q57734Q90244o82453n66468
863.1E9048164Q08869R68609j29807j39133q8929m29355Q26076J056156p4474n24830
872.8F1321346Q9703K83050p1857L34446k72972L9635P42660m14703l18489m41235
882.4F1291584j630470q53417Q70201N90477n73520l97221n00732m31187R40880J177776
892.1F0484371p69386j251377R4696L29567L09757N74265L03928o49941q97090j78040
901.7E8350750J78753M47605m1031l72570k92305l71303R5268j88858o44478n48351
$$ y = [59673935, 59883114, 59583015, 59380165, 59213543, 58120819, 57976791, 57416367, 55683929, 55225452, 55936119, 56338184, 55857044, 55099640, 54600044, 55181564, 56257812, 56024498, 55150131, 55006065, 55578526, 55815563, 56272129, 57174095, 57592953, 58138680, 58549107, 59406841, 60297085, 59614632, 59048164, 59857033, 60825642, 60695835, 60556702, 60467773, 60038418, 60864494, 61920650, 61846176, 61321346, 61411049, 61694099, 61622242, 61956688, 61683716, 61723351, 62466011, 62051308, 61732819, 61291584, 59661114, 58807697, 59677898, 60268375, 59694855, 59297634, 58796902, 58365715, 59306595, 60484371, 59714985, 58463608, 58558304, 58887871, 59197628, 59771893, 60075821, 59425880, 58528790, 58350750, 58529503, 58977108, 58936077, 58563507, 58271202, 57899899, 57995167, 57806309, 57161831, 56613480]
911.4E6613480l44933j13892Q481K3937m14540p77652o71997m5285L9280m15081l51330
922E3550468n01415n63244K47742M30351q13636q02777j16661n5218L06115j82171
931.6E1499554p71118j98086R74376R38614K36389J08922l60222L52226R64737K80380
941.3E4025772J87706N60017R64039Q49636N93841J69491J67034O44020j4316o44322
950.9E7502918j59622O72318L53488k4917J07033k55055L8117Q7669m12830q94287
960.6E7014832p76028p2590m60670q53405j81378K57145k71213k17694K02027l24810
970.2E4316216l40527p5123k56370j9032Q6067q4335K14188K7771k49108j34056p36698
980.8E2748993m99260J03214j77990j13857k73232p16278n09754p5191r3174m16081
$$ y = [56613480, 56268547, 56154655, 56163136, 56187073, 55772533, 54994881, 54322884, 54277599, 54316879, 53901798, 53550468, 53049053, 52485809, 52733551, 53163902, 52350266, 51547489, 51430828, 51375610, 51681725, 51499554, 50728436, 50530350, 51504726, 52443340, 52679729, 52788651, 52428429, 52780655, 53745392, 54025772, 54213478, 54773495, 55737534, 56587170, 57181011, 57350502, 57517536, 58161556, 58147240, 57502918, 57343296, 58015614, 58369102, 58344185, 58451218, 58196163, 58234280, 58321949, 57909119, 57014832, 56238804, 56166214, 55705544, 54852139, 54670761, 54927906, 54656693, 54438999, 54641026, 54316216, 53975689, 53900566, 53644196, 53625164, 53711231, 53626896, 53841084, 53868855, 53619747, 53485691, 52748993, 52249733, 52352947, 52174957, 52061100, 51787868, 51071590, 50561836, 50486645, 50393471, 49977390]
990.5D9977390p42439o91925p91771j282268j373940j528076n75279J335266J338348
999.1D5665306K55127L04592O86550M86775o7791l15499k95311l88694P3864P686o07551
1009.7D5805054r7729m4750j76K31613l35605k97829m98298n10514j20010m81388l82733
1020.3D3267635j55048l61877l48092l25965j57193L25142J04710o46305o78665k47532
1030D0776810R5062j60214n94596k36504J86493j66519q83526p57465O2706M44248
1039.6C8766495K69008k75974k87002K48474M20025O5029n75253k05685N48340K92462
1049.3C9265919j49689p1884j64879n03212L3810L35369R266R8743K5105l4478n6633
1059.9C8787437k79174p8095K48902j04359n26112m59133K30888Q42846n8128n85297
$$ y = [49977390, 49234951, 48543026, 47751255, 46468987, 45095047, 43566971, 42991692, 44326958, 45665306, 45920433, 46225025, 46911575, 47398350, 47330559, 47015060, 46719749, 46331055, 46404919, 46412605, 45805054, 45707325, 45662575, 45662399, 45894012, 45558407, 45260578, 44762280, 44251766, 44131756, 43650368, 43267635, 43112587, 42750710, 42402618, 42076653, 41919460, 42244602, 42349312, 41703007, 41024342, 40776810, 40871872, 40711658, 40117062, 39880558, 40067051, 39900532, 39017006, 38259541, 38322247, 38766495, 39035503, 38759529, 38472527, 38721001, 39141026, 39206055, 38630802, 38425117, 38973457, 39265919, 39116230, 39044346, 38879467, 38376255, 38410065, 38745434, 38754700, 38853443, 38878548, 38844070, 38787437, 38508263, 38430168, 38679070, 38574711, 38048599, 37589466, 37820354, 38663200, 38605072, 38019775]
1069.5C8019775N0061j7067l50537K39369L64582n51228o54720l46878K63103M75659
1079.2C7492119J58176L42098o92657p06924L37520k79991k59582M62596l2692n89481
1088.8C6231182m40494l82096P1747j09180j061478j081017q65390q04348r29631j100254
1098.5B9529041j433544j075088n71438j242985r78525j007282j226656j243479j280829
1107.1A9469215l05082o08652p70668p06547p61198k53565k47150n51194r24837j37078
1116.8A4203244M00614L81585K93187j07141j01866J66679M92190K13801N8970R5197
1126.4A6096460L31253N1796j84902J11387k82144o1607j80367l44878l39795m83401
1136.1A4713802o3849j61091j81116k34104j78838m31603m71127n95799r27165j28693
$$ y = [38019775, 38069836, 38052769, 37702232, 37941601, 38306183, 37754955, 37100235, 36753357, 37016460, 37492119, 37650295, 37992393, 37299736, 36592812, 36930332, 36650341, 36390759, 36853355, 36820663, 36231182, 35790688, 35408592, 35480339, 35371159, 34309681, 33228664, 32363274, 31558926, 30629295, 29529041, 28095497, 27020409, 26448971, 25205986, 24227461, 23220179, 21993523, 20750044, 19469215, 19164133, 18555481, 17784813, 17078266, 16317068, 16063503, 15816353, 15265159, 14340322, 14203244, 14603858, 14985443, 15278630, 15171489, 15069623, 15236302, 15728492, 15942293, 16001263, 16096460, 16427713, 16479509, 16294607, 16405994, 16123850, 16062243, 15881876, 15536998, 15197203, 14713802, 14649953, 14488862, 14307746, 14073642, 13894804, 13463201, 12992074, 12396275, 11469110, 11340417]
1145.7A1340417k51616j15604N632k82139k86948n43519j41547J43698N53269K74731
1155.4A0696374K02000Q7760m9215N44620J24021M53312K55888k18541J17331N13857
1165A2727407Q37378K88466L39823L71780N72234N37390N78425R99443O72766P27199
1174.6A8652311O32723P58375M55195N26941J024283P24224J129827J008129M49612
1183.3B5361620M57748J143299J352623O66262J81746K68306J020947Q41167M81591
1192C1775309L75105K77015O09444P32139O84258L59699O72745Q28823N86105N89257
1201.6C7489899M43084N37533K97661J80561M27715N37957N25756L28301K28908M24012
1211.3D1421387L98029l2597J65795L85757K24083K53330K92054n8098o2363M43993
$$ y = [11340417, 11088801, 10973197, 10978829, 10696690, 10409742, 9866223, 9724676, 9868374, 10421643, 10696374, 10898374, 10986134, 10936919, 11481539, 11605560, 12058872, 12314760, 12096219, 12213550, 12727407, 13564785, 13853251, 14193074, 14564854, 15137088, 15674478, 16252903, 17252346, 17925112, 18652311, 19285034, 20043409, 20498604, 21025545, 22049828, 22774052, 23903879, 24912008, 25361620, 25819368, 26962667, 28315290, 28981552, 29163298, 29431604, 30452551, 31293718, 31775309, 32150414, 32427429, 33036873, 33769012, 34453270, 34812969, 35485714, 36314537, 36900642, 37489899, 37932983, 38470516, 38768177, 38948738, 39376453, 39914410, 40440166, 40768467, 40997375, 41421387, 41819416, 41786819, 41952614, 42338371, 42562454, 42815784, 43107838, 43049740, 42987377, 43431370]
1220.9D3431370m3995n7343J44348k65106P618Q3069J59386k2125j16723K58954L51333
1231.5D3930786K47856l06118k27630K33585K80380R1213k9644M6711l4782K4521O1218
1242.2D4318096L15956J56765k89730j16199o329j10863j69326M47731M63672j71875
1251.8D4837898p4283Q8592J76281k3094J4267K93556J32549M2286J17321P5463j54232
1262.4D5526604k87583n150M62124L91590Q9035j52503p3369J80436N3886K54471J05270
1273D6544811J55651M91017K00725K86885K02392L1494K53880L36685J70754K61287
1282.7D8935581M33048J39069Q9317J59054L11356L52325K29725L28991K51568Q5270
1292.3E1315304J8097L24104M48174K43366J11770P6268K25456J65214M2981Q1634
$$ y = [43431370, 43387375, 43330032, 43474380, 43209274, 43216892, 43299961, 43459347, 43437222, 43320499, 43579453, 43930786, 44178642, 43872524, 43644894, 43878479, 44158859, 44250072, 44220428, 44267139, 44232357, 44256878, 44318096, 44634052, 44790817, 44501087, 44384888, 44378559, 44267696, 44098370, 44546101, 45009773, 44837898, 44763615, 44852207, 45028488, 45005394, 45019661, 45313217, 45445766, 45488052, 45605373, 45680836, 45526604, 45239021, 45233871, 45695995, 46087585, 46176620, 46024117, 45950748, 46131184, 46185070, 46439541, 46544811, 46700462, 47191479, 47392204, 47679089, 47881481, 47912975, 48166855, 48503540, 48674294, 48935581, 49368629, 49507698, 49597015, 49756069, 50067425, 50419750, 50649475, 50978466, 51230034, 51315304, 51333401, 51657505, 52105679, 52349045, 52460815, 52537083, 52762539, 52927753, 52970734, 53052368]
1301.9E3052368K38892J07017j1982J15403M7267J70449J73893J44779J67068P3315
1311.6E4278469K2564L9864L13659K20585r415q9626O0806L18123l5614j03466K06116
1322.2E5222065J90540K07527K36916n5344j39904j2165k3788N0777K67617L23799
1331.8E6268040r9896j11423O2038k89528j90574J81099n906j98417J36383J11576
1341.5E5863392R7126J51855k36702M2073L76674J71986j43559k53532L7743r3979
1351.1E6013077q2020J42643J7563N0484O0688l59627m00086J69407J8761m67434k37572
1361.7E4925884M27838L25981l02716n2253j03298j06659r27j35472Q3191j67644k68078
1372.3E4625847m4781k27650r8861J00178j32489k36141J7910K9221L6827l147j24756
$$ y = [53052368, 53291260, 53398277, 53386295, 53501698, 53548965, 53719414, 53893307, 54038086, 54205154, 54278469, 54301033, 54340897, 54654556, 54875141, 54865726, 54776100, 54836906, 55155029, 55119415, 55015949, 55222065, 55412605, 55620132, 55857048, 55801704, 55661800, 55649635, 55625847, 55676624, 55944241, 56268040, 56168144, 56056721, 56118759, 55829231, 55638657, 55819756, 55813850, 55615433, 55751816, 55863392, 55960518, 56112373, 55875671, 55917744, 56294418, 56466404, 56322845, 56069313, 56107056, 56013077, 55931057, 56073700, 56091263, 56141747, 56202435, 55842808, 55442722, 55612129, 55630890, 55163456, 54925884, 55353722, 55679703, 55376987, 55324734, 55221436, 55114777, 55113850, 54978378, 55061569, 54893925, 54625847, 54581066, 54353416, 54254555, 54354733, 54222244, 53986103, 54004013, 54033234, 54070061, 54066914, 53942158]
1382.9E3942158k5055K1362J23787J70685P7026J25305J20694j0876J87801j1352l56182
1393.6E4365353p7088n7129Q557j61923k87632N0534M3964J42406N2006r8263k06726
1404.2E3774059M2157L19828K2148m6330l02688k7218O5613k77668p2129j55655j56292
1414.8E3185825m860M590r0973j20305j12964J22955L42350J74843J46439j99543j54232
1425.4E3294125J97342r5479m5372J77651L68156J32561L2360K29988K37877K47208
1435E4776417k77996p75673M15329L88798L94428K81891j41034j78756J62945K43324
1444.7E5289673R6687n0327K25170J24916j81549J04919J09898J91628J46396J8921
1454.3E6076332K2621L54187L04489p35881L72341K34279K13208L77044m7584j57669
$$ y = [53942158, 53917103, 53938465, 54062252, 54232937, 54309963, 54435268, 54555962, 54545086, 54732887, 54721535, 54365353, 54288265, 54231136, 54239693, 54077770, 53790138, 53840672, 53884636, 54027042, 54079048, 53980785, 53774059, 53816216, 54136044, 54158192, 54111862, 53809174, 53781956, 53847569, 53569901, 53497772, 53342117, 53185825, 53180965, 53185555, 53094582, 52974277, 52861313, 52984268, 53326618, 53501461, 53647900, 53448357, 53294125, 53491467, 53395988, 53350616, 53528267, 53896423, 54028984, 54061344, 54291332, 54529209, 54776417, 54498421, 53722748, 54138077, 54526875, 54921303, 55203194, 55062160, 54883404, 55046349, 55289673, 55386360, 55336033, 55561203, 55686119, 55504570, 55609489, 55719387, 55911015, 56057411, 56076332, 56098953, 56453140, 56757629, 56021748, 56394089, 56628368, 56841576, 57218620, 57171036, 57013367]
1464E7013367j79238L91377L72623R1942J77269L51772K77752j2531l74916m0875P60895
1474.6E8829437N02625J40777L64468K11868Q0735K49107K43805J04999N5081n0698
1484.2F0732204O2306K98694K49825o3301j26534k80067j98658K29439K24148J82148
1493.8F1310204K50209k4707o64593J2886J33312k16274j07571q6654k45755k10773
1503.5F0150284j63635n27878m49589J32236m12899k0092J0098j22582k36682r8603
1513.1E8260658l5267j03061m10641p33974Q9355M21177J35639o09890j21029j31744
1522.8E6761223J26919K58369m70920r9762l1472q9061r0462j38111N7525m8965m68899
1533.4E5766384n05661L74249l4378k42848M8515q11622q2340M44526M87210L05477
$$ y = [57013367, 56834129, 57225506, 57598129, 57690071, 57867340, 58219112, 58496864, 58484333, 58109417, 58068542, 58829437, 59332062, 59472839, 59837307, 60049175, 60129910, 60379017, 60622822, 60727821, 60782902, 60732204, 60794510, 61093204, 61343029, 61279728, 61153194, 60873127, 60674469, 60903908, 61128056, 61310204, 61560413, 61535706, 60871113, 60883999, 61017311, 60801037, 60693466, 60606812, 60361057, 60150284, 59986649, 59458771, 59009182, 59141418, 58728519, 58708427, 58718525, 58595943, 58359261, 58260658, 58225391, 58122330, 57711689, 56977715, 57067070, 57488247, 57623886, 57013996, 56892967, 56761223, 56888142, 57146511, 56675591, 56575829, 56544357, 56455296, 56364834, 56226723, 56284248, 56235283, 55766384, 55260723, 55634972, 55600594, 55357746, 55406261, 54594639, 54512299, 54956825, 55444035, 55749512]
1543E5749512l28041k15779R651L3585j85001n84m3522k2320L19905J93935L08796
1553.6E5820137L2959k95250n8697J15078P54116j476268M82635Q87440K25559k6382
1563.3E6461327l6671J23569L34553J58226j10840K0306k16030J15589L09280J9963
1572.9E7179272k00123k05135J0215l66192Q6659K34066o2443k69115l00583m1611
1582.6E6065010Q47j49643m94507l41060q4664j79302j0574j90365k30336l07998m03813
1593.2E3673595l49269j28571j41972o09783m94259l84498k3564J9040j89949l16216
1602.8E1054554n71743m11919m63287j50085k95014l26580j65207k86186n9040l15666
1612.5D8009827k01626l49720k26769j21475j030235L3596j1856q7357l91529p2136
$$ y = [55749512, 55421471, 55205692, 55215343, 55248928, 55063927, 55063343, 55019821, 54997501, 55317406, 55511341, 55820137, 55853096, 55557846, 55499149, 55614227, 56368343, 54892075, 55374710, 56262150, 56487709, 56461327, 56424656, 56548225, 56882778, 57041004, 56930164, 56950470, 56734440, 56850029, 57159309, 57179272, 56979149, 56774014, 56784229, 56418037, 56504696, 56738762, 56676319, 56407204, 56106621, 56065010, 56065857, 55916214, 55421707, 55080647, 54995983, 54816681, 54806107, 54615742, 54385406, 54077408, 53673595, 53324326, 53195755, 53053783, 52444000, 51949741, 51565243, 51541679, 51560719, 51370770, 51054554, 50482811, 50070892, 49607605, 49457520, 49162506, 48835926, 48670719, 48384533, 48325493, 48009827, 47808201, 47458481, 47231712, 47110237, 46080002, 46113598, 46101742, 46014385, 45622856, 45550720]
1622.1D5550720O4572m81392k82631l69293k0314l07148k02057p3677j90952r4547
1631.7D3593281k98943j938j92417j110935J46103O52367O2725j79696P1438n1323
1641.4D2690662P9182j85402q808O2626j57364J00277R5131N00229L3916K22946J97075
1652D3630470m73877L2589K98847O22124J59859J46084M6573K06524K16996l8830K29793
1662.6D5077152K2496J99615K72823M66950L76858J71478L58730J82976M09435J18469
1672.3D7656982J79608J78470K205O15666N77812M33220J64749K32922J84787M65927
1681.9E0692348P54426r5288r21680Q15235O59191N57770N36197J87428L56552M71706
1691.5E4013885K33727M43443N33562M95808M8504K64801N33573O24408m7443J84528
$$ y = [45550720, 45615292, 45133900, 44851269, 44481976, 44461662, 44154514, 43952457, 43878780, 43687828, 43593281, 43294338, 43292400, 43099983, 41989048, 42135151, 42787518, 42850243, 42670547, 42741985, 42690662, 42769844, 42584442, 42575634, 42638260, 42480896, 42581173, 42676304, 43176533, 43210449, 43433395, 43630470, 43156593, 43189182, 43488029, 44110153, 44270012, 44416096, 44462669, 44669193, 44886189, 44847359, 45077152, 45099648, 45299263, 45572086, 46039036, 46415894, 46587372, 46946102, 47129078, 47538513, 47656982, 47836590, 48015060, 48017265, 48632931, 49210743, 49643963, 49808712, 50041634, 50226421, 50692348, 51446774, 51351486, 50429806, 51245041, 51904232, 52462002, 52998199, 53185627, 53542179, 54013885, 54247612, 54691055, 55224617, 55720425, 55768929, 56033730, 56567303, 57191711, 57144268, 57328796]
1701.2E7328796R18152M79031N33741L94008L37327K41634L17196O63448K98294J12694
1710.8F1624321J33839J35967M14688J06468J76865O70799K38247q06862J83491L64071
1720.5F3241894K65835O4476k64328l3486K76318K71633J56399J33060L71155L097
1730.1F4486053k57820L58750K95067k60537k75665J29662K54783J66855L42941M85184
1739.8F5725273j15570N0713K6649M1145L30224L34335L74229K27806r8129P973M68132
1750.4F7372780L66073M05182N34211K03567J33217J68396n5390L12317M37813O9123
1760F9947289j37291k77306J24321K44606K28401L51349J55052J6220p7835L06458
1769.7G0881264M16603j68923m09095o4995M62112J26648k10487K70058K02659L37067
$$ y = [57328796, 58246948, 58725979, 59259720, 59653728, 59991055, 60232689, 60549885, 61213333, 61511627, 61624321, 61758160, 61894127, 62308815, 62415283, 62592148, 63262947, 63501194, 62694332, 62877823, 63241894, 63507729, 63572205, 63307877, 63274391, 63550709, 63822342, 63978741, 64111801, 64482956, 64486053, 64228233, 64586983, 64882050, 64621513, 64345848, 64475510, 64730293, 64897148, 65240089, 65725273, 65609703, 65660416, 65687065, 65728210, 66058434, 66392769, 66766998, 66994804, 66896675, 66904648, 67372780, 67738853, 68144035, 68678246, 68881813, 69015030, 69183426, 69128036, 69440353, 69878166, 69947289, 69809998, 69532692, 69657013, 69901619, 70130020, 70481369, 70636421, 70652641, 70574806, 70881264, 71297867, 71128944, 70719849, 70654854, 71116966, 71243614, 71033127, 71303185, 71505844, 71842911]
1779.3G1842911K74048p4891j00669o8802J54091k05460k78191K41654K05803n6389
1788.9G1934105J08101K30560J4313j85372j13739K09473J99265J27540N2139N1934
1798.6G2628319J38923q0040n9799j14204N8555m653j38588K05062J68808O4454l090
1809.2G2863747p4234J2535J21101J11305K6078J30340J79276J78917l4638j38611
1818.8G3375816l2982l5667N8456q5914Q9302J68549k98554O7925L07952K07016M8020
1829.4G3869919k48039l8208K02613K59102K1111k54639j43829n6671M631J65268J93092
1840.1G3974350J87439m8409k2972j39145n18226L43422L40858J59584M4701m4052
1849.7G4277550J03782N6717j32110j19591J63040O5575l5927L5011j22047p5730L2807
$$ y = [71842911, 72116959, 72042068, 71941399, 71872597, 72026688, 71821228, 71543037, 71784691, 71990494, 71934105, 72042206, 72272766, 72287079, 72101707, 71987968, 72197441, 72396706, 72524246, 72576385, 72628319, 72767242, 72687202, 72627403, 72513199, 72571754, 72567101, 72428513, 72633575, 72802383, 72866837, 72863747, 72789513, 72802048, 72923149, 73034454, 73060532, 73190872, 73370148, 73549065, 73514427, 73375816, 73342834, 73307167, 73365623, 73279709, 73369011, 73537560, 73239006, 73306931, 73614883, 73821899, 73869919, 73621880, 73583672, 73786285, 74045387, 74066498, 73811859, 73668030, 73611359, 73615990, 73781258, 73974350, 74161789, 74113380, 74090408, 73951263, 73433037, 73776459, 74117317, 74276901, 74321602, 74277550, 74381332, 74438049, 74305939, 74186348, 74349388, 74414963, 74379036, 74414047, 74292000, 74216270, 74249077]
1860.3G4249077J41891o500n9723L2807O3209J62758j7227O9801p5035l20831m0978
1870.9G4199249P4982J61400L8643P2189p2121j23626N981j30585J49216K39937n3665
1881.5G4561600p7240J09619J14303L3532Q9706l3386m097o7703k32567O8908K5651
1892.1G4588326o1257R2674R079j38275K052K42524K39456j16081j99265l044N7655
1902.7G4713844m9392j36712Q7487K52693O4735k63466j56143J5206q5167O6810R2652
1913.3G4602547N0750n5168o3667J24100j87149j13457K58675J69609J8303q5198k05406
1923.9G4513939k6741J56013N4718n6022o2104J24833k6276j52466O7429l6591N4093
1934.6G4610825o8520k07253J56930K16835M936q0223l9879k58713o0089K93571L3303
$$ y = [74249077, 74390968, 74384468, 74324745, 74357552, 74420761, 74583519, 74566292, 74636093, 74561058, 74240227, 74199249, 74274231, 74435631, 74474274, 74546463, 74474342, 74350716, 74356697, 74226112, 74375328, 74615265, 74561600, 74484360, 74593979, 74708282, 74741814, 74831520, 74798134, 74794037, 74726334, 74493767, 74562675, 74588326, 74527069, 74619743, 74628822, 74490547, 74492599, 74735123, 74974579, 74858498, 74659233, 74656189, 74713844, 74664452, 74527740, 74615227, 74867920, 74932655, 74669189, 74513046, 74528252, 74443085, 74509895, 74602547, 74653297, 74598129, 74534462, 74658562, 74471413, 74357956, 74616631, 74786240, 74804543, 74719345, 74513939, 74487198, 74643211, 74697929, 74641907, 74579803, 74704636, 74678360, 74525894, 74593323, 74556732, 74610825, 74542305, 74335052, 74491982, 74708817, 74713753, 74633530, 74593651, 74334938, 74274849, 74568420, 74601723]
1945.2G4601723k0226J49483L1502j40160R293j07796q7173J86737K2392n1178j62850
1955.8G4431747r635J82342J3329J8760k1156n9731j00517l3821k274M3526K23831
1966.4G4686401L2929j10329j38969p7683J02066n2711k82288j52908J80549K25914
1976G4412971J26374j2146j68823q3870N752q6738j40725J1086J41846O9702o79N2879
1987.6G4327629l2913j65459n401K08946K7611j91246N2032Q0391q62n898p7682R6634
1999.2G4313782P6881j12762j66497r9647L5637K2545M4868Q4641j1193j35467p5386
2009.8G3977402l7491m3274O3141n6244j29013N8411J52702J32225L6171j98052j35658
2020.4G3820320O5399K0066N1574k9205L8574Q9745j14289j04270n2201J8776m0787
$$ y = [74601723, 74581497, 74730980, 74762482, 74622322, 74631615, 74523819, 74436646, 74623383, 74645775, 74594597, 74431747, 74422112, 74604454, 74617783, 74636543, 74615387, 74555656, 74455139, 74421318, 74419044, 74462570, 74686401, 74719330, 74609001, 74470032, 74392349, 74494415, 74441704, 74159416, 74006508, 74187057, 74412971, 74539345, 74527199, 74358376, 74274506, 74280258, 74193520, 74052795, 74063881, 74205727, 74275429, 74274750, 74327629, 74294716, 74129257, 74123856, 74332802, 74360413, 74169167, 74221199, 74301590, 74300728, 74294830, 74217148, 74313782, 74390663, 74277901, 74111404, 74011757, 74047394, 74069939, 74114807, 74199448, 74188255, 74052788, 73977402, 73939911, 73896637, 73959778, 73903534, 73774521, 73832932, 73985634, 74117859, 74154030, 73955978, 73820320, 73885719, 73905785, 73957359, 73928154, 73966728, 74056473, 73942184, 73837914, 73785713, 73804489, 73763702]
2031G3763702l7803n4894o3652L1540j10817K4574J12717M3724j12434j31729R2331
2041.6G3557259r8023J4465K1225n9921K22183R0149j35429k07184j10359m334J73424
2052.2G3463455J30051j31134l7842j19896k9915J53229J5350j12060j26953k5521
2061.9G3178764j22871k556J78574j572q9226p637J08704j7700j47858p1251k8564
2072.5G2976807j7815q9989j42433K2461J29700l8017j75118j19034L8086O3553K4727
2083.1G2672928N7312n7724r9671L6736O1157j10008k39143n8030J72875J27853L6583
2093.7G2600868j8623p7843J24008J65627j27030k20108o7291Q5571J3886j3649L8788
2104.3G2504204l861l540J02600J91010q3733j24939J41022L8185K4155M9583K2690
$$ y = [73763702, 73725899, 73671005, 73607353, 73638893, 73528076, 73552650, 73665367, 73709091, 73596657, 73464928, 73557259, 73459236, 73473701, 73494926, 73435005, 73657188, 73747337, 73611908, 73404724, 73294365, 73290031, 73463455, 73593506, 73462372, 73424530, 73304634, 73274719, 73427948, 73443298, 73331238, 73204285, 73178764, 73055893, 73053337, 73231911, 73230339, 73141113, 73133476, 73242180, 73224480, 73076622, 73005371, 72976807, 72958992, 72869003, 72726570, 72749031, 72878731, 72840714, 72665596, 72546562, 72584648, 72648201, 72672928, 72730240, 72672516, 72572845, 72609581, 72670738, 72560730, 72321587, 72263557, 72436432, 72564285, 72600868, 72582245, 72504402, 72628410, 72794037, 72667007, 72446899, 72379608, 72465179, 72479065, 72465416, 72504204, 72500343, 72496803, 72599403, 72790413, 72706680, 72581741, 72722763, 72760948, 72785103, 72834686, 72857376]
2114.9G2857376J76529R2712l2676n9860j33027j14959p5959N7076L8505R5170L16848
2125.5G3217735n1429l07541j72036j18522j2261O0547J11847m4388k1064J49330l9337
2136.1G2772881j8509J28021P3341O5315m1427k19147K0790K37450J02577N1834p9040
2146.7G3094086j49102m0771J8417n2162m654J32202k601N7258L9605j25519L8276
2157.3G3005035J55999R4978j29608r9312J27213O8702k6077k2858k1766J457J3824
2167.9G3167587j68312j31531J23887P3226n2406n4710m58n455L0037Q0620l8689o3873
2179.5G2959923J21834J78077q2641j86608J015k2781j14685N2810J62445J68862M0161
2190.1G3278412j74393q110J67877O6552o2356o8305J3237N6266N7907k2400J40900
$$ y = [72857376, 73033905, 73126617, 73093941, 73034081, 72901054, 72786095, 72710136, 72767212, 72805717, 72900887, 73217735, 73166306, 72858765, 72686729, 72568207, 72555946, 72616493, 72728340, 72683952, 72662888, 72812218, 72772881, 72754372, 72882393, 72955734, 73021049, 72979622, 72760475, 72781265, 73018715, 73121292, 73173126, 73094086, 72944984, 72904213, 72922630, 72870468, 72865814, 72998016, 72995415, 73052673, 73092278, 72966759, 73005035, 73161034, 73256012, 73126404, 73027092, 73154305, 73223007, 73196930, 73174072, 73152306, 73153763, 73167587, 72999275, 72867744, 72991631, 73064857, 73012451, 72957741, 72957283, 72951828, 72981865, 73062485, 73023796, 72959923, 73081757, 73259834, 73177193, 72990585, 72991600, 72968819, 72854134, 72906944, 73069389, 73238251, 73278412, 73104019, 73095909, 73263786, 73330338, 73267982, 73199677, 73212914, 73269180, 73327087, 73304687, 73445587]
2200.7G3445587K25937N8281l5759r9327L265k0904j8730j2642L0426J28227r8488
2211.3G3605873j9760n8800j66374J03218J25343R1088N3001J4008l6644n2712J06301
2221.9G3764542J80313P522k50526j26549R3819N5183J4763J3168j13235m7272Q8867
2232.5G3680595j55449j38580N1842O5376N5039N8250J64139K4216k05948j82518K0660
2243.2G3437622J46866J06819P576o9946j2451J6189P4547J15738O7802p2303j44898
2253.8G3673561m1222J6778K5001j21086P2327J64581q3611j6128j9867J22276O7887
2264.4G3860497m1726O5819n0346K022m1146L052O0974M2229l052k33307p0206Q5183
2275.9G3679993O4697R079N2772J44494l5614j77048j46988J40427J65702K2164l9208
$$ y = [73445587, 73671524, 73729805, 73694046, 73594719, 73597984, 73577080, 73558350, 73545708, 73576134, 73704361, 73605873, 73586113, 73527313, 73360939, 73464157, 73589500, 73680588, 73733589, 73747597, 73710953, 73658241, 73764542, 73944855, 73952377, 73701851, 73575302, 73669121, 73724304, 73739067, 73752235, 73639000, 73591728, 73680595, 73525146, 73386566, 73438408, 73503784, 73558823, 73617073, 73781212, 73805428, 73599480, 73416962, 73437622, 73584488, 73691307, 73698883, 73628937, 73616486, 73632675, 73707222, 73822960, 73890762, 73818459, 73673561, 73632339, 73649117, 73674118, 73553032, 73625359, 73789940, 73706329, 73690201, 73670334, 73792610, 73860497, 73818771, 73884590, 73834244, 73836266, 73795120, 73798172, 73859146, 73901375, 73898323, 73665016, 73594810, 73679993, 73744690, 73753769, 73806541, 73951035, 73915421, 73738373, 73591385, 73731812, 73897514, 73919678, 73880470]
2286.5G3880470j12777O8763M9630L3332J4862m4136O6834J9424n3482p0183J42022
2297.2G3994759J50009j5198J28822R3323j04141j69075N0201J84601R4200O0875q0398
2307.8G4387978n3231J24420P6409n6824j59332j13243K95364N25978J61728k47070
2317.4G4942177k32475R7564L68317L14026p118k74331k80861M8707J30348M898N10719
2328G5621971N42580Q0330r8404j5404L45169k05841l34076K26502j62072n058M14818
2338.6G6410515j59035l95721J43280J15219l3264M24225q0765p27326k86331M6379
2348.3G5457176K20955K00371r4895J64254M28367M06685J20690j82373K83447j0040
2357.9G6994637K59529M82437l25501J48972m0962o54313p3043M42985J2161j94671
$$ y = [73880470, 73767693, 73836456, 73886086, 73919418, 73934280, 73890144, 73956978, 73976402, 73922920, 73852737, 73994759, 74144768, 74129570, 74258392, 74351715, 74247574, 74078499, 74128700, 74313301, 74407501, 74468376, 74387978, 74334747, 74459167, 74535576, 74478752, 74319420, 74206177, 74501541, 75027519, 75189247, 74942177, 74709702, 74807266, 75175583, 75489609, 75482491, 75208160, 74927299, 74976006, 75106354, 75111252, 75621971, 76164551, 76244881, 76146477, 76131073, 76476242, 76270401, 75936325, 76162827, 76000755, 75995697, 76410515, 76251480, 75855759, 75999039, 76114258, 76080994, 76505219, 76424454, 75697128, 75410797, 75457176, 75678131, 75878502, 75783607, 75947861, 76376228, 76782913, 76903603, 76721230, 77004677, 76994637, 77254166, 77736603, 77411102, 77560074, 77519112, 76864799, 76791756, 77234741, 77246902, 77052231]
2367.6G7052231K5291n34256n55572j49460j50780j70517j30104R5436j8593k16644
2377.2G5247032j75255j52717p904k1134j68281j24283j55480k02995O3217J39138
2386.8G4441338j06774k0363R7870j19324p3074J29280r590k9396M8424q1253r3926
2397.4G4183212J1139J35941J16409k5780o1973m6219K1393N1284R598p9750J9982
2408.1G4335236J21933j64170j27777J9554j79535j32385N5512J36558J0719l7475
2417.7G4038170J23588J04035J04400k273j42189j5892J5617q7867p6432Q3855O4621
2428.3G4209633p6141l2799L4302p5249k42058q9424J81923J33827r3285o8176O6284
2438.9G3948837N5840O4483q9683j33659N0964Q0200n7831j58043L2021J808j06102
$$ y = [77052231, 77077522, 76543266, 75987694, 75838234, 75687454, 75516937, 75386833, 75482269, 75463676, 75247032, 75071777, 74919060, 74911156, 74890022, 74721741, 74597458, 74441978, 74238983, 74302200, 74441338, 74334564, 74314201, 74412071, 74292747, 74219673, 74348953, 74339363, 74309967, 74358391, 74277138, 74183212, 74194351, 74330292, 74446701, 74420921, 74358948, 74312729, 74334122, 74385406, 74395004, 74315254, 74335236, 74457169, 74292999, 74165222, 74184776, 74005241, 73872856, 73928368, 74064926, 74075645, 74038170, 74161758, 74265793, 74370193, 74367920, 74225731, 74209839, 74225456, 74137589, 74061157, 74145012, 74209633, 74133492, 74100693, 74134995, 74059746, 73817688, 73728264, 73910187, 74044014, 73950729, 73882553, 73948837, 74004677, 74069160, 73979477, 73845818, 73896782, 73976982, 73919151, 73761108, 73793129, 73794937, 73688835]
2449.5G3688835N3330L5148N9059O0334q0964j28685n5412K3697l9993q1673n9692
2460.1G3473984J9554L2608p8285l449J53153J20071m4563j67610j20911p6851o0120
2470.7G3247581J05973Q4007k5711k2759r0950M3831J90575L4859j00090K4002K5001
2481.3G3516319j04881l4920n0041L311K3918j01402r5489l0457J21300L5568r6001
2492G3187225J7472J01463K8297m5250J8982j55975j62468K3621p5348J5198J79725
2502.6G3132942J00205m4159p9438m1061m0604l1036k4147j39633j38680J45493J87401
2513.2G3027283Q1855Q6876J1757j40625k33696r9991l486k6512k2354J17126J00845
2523.8G2899078o3034J23581O4781j63192j26702j30523j26313L2273K11296K4086
$$ y = [73688835, 73742165, 73777313, 73836372, 73896706, 73815742, 73687057, 73631645, 73655342, 73615349, 73533676, 73473984, 73493538, 73526146, 73447861, 73444412, 73597565, 73717636, 73673073, 73505463, 73384552, 73307701, 73247581, 73353554, 73437561, 73411850, 73389091, 73298141, 73341972, 73532547, 73567406, 73467316, 73491318, 73516319, 73411438, 73376518, 73326477, 73329788, 73353706, 73252304, 73156815, 73126358, 73247658, 73283226, 73187225, 73204697, 73306160, 73334457, 73289207, 73308189, 73152214, 72989746, 73013367, 72938019, 72953217, 73132942, 73233147, 73188988, 73109550, 73068489, 73027885, 72996849, 72972702, 72833069, 72694389, 72839882, 73027283, 73109138, 73196014, 73207771, 73067146, 72833450, 72733459, 72729973, 72703461, 72681107, 72798233, 72899078, 72836044, 72959625, 73024406, 72861214, 72734512, 72603989, 72477676, 72509949, 72721245, 72745331]
2533.4G2745331j27197n9067k8076L6232k4201q5968l7834L6240K0057J39763J36040
2544G2751320k13158q6883P0182j49017r2010R1835P2807M7379K5817k4711J3450J5252
2555.6G2522263N0842r0042j48606N234o3705R4276O1585p4562P2189n4215j03843
2566.2G2271416l3455L6178k7237r8602O3667P7424j1963j59745r033K14348k029j97365
2577.8G2123604j32546N9723n1117q4182J42578R9487N7053n1995k14767j81183l387
2588.4G1763268J12319M9561M7592j13945j80099L2486M7004J13251J28319j80138
2598G1819618k80540m4716J22841J44768J6448j01837r1430o8299Q2314q0200k19811
2608.6G1299156Q3656O8352j3397p8796j45165J839J53213J37886k57003k15569Q8402
$$ y = [72745331, 72618134, 72559067, 72530991, 72567223, 72543022, 72457054, 72419220, 72455460, 72475517, 72615280, 72751320, 72538162, 72451279, 72521461, 72372444, 72280434, 72372269, 72445076, 72492455, 72518272, 72493561, 72507011, 72522263, 72573105, 72483063, 72334457, 72339691, 72275986, 72370262, 72431847, 72357285, 72429474, 72375259, 72271416, 72237961, 72274139, 72246902, 72148300, 72211967, 72289391, 72277428, 72117683, 72108650, 72322998, 72320969, 72123604, 71991058, 72050781, 71999664, 71915482, 72058060, 72157547, 72214600, 72162605, 71947838, 71766655, 71763268, 71875587, 71925148, 71972740, 71858795, 71678696, 71711182, 71758186, 71871437, 71999756, 71819618, 71539078, 71494362, 71617203, 71761971, 71778419, 71676582, 71585152, 71516853, 71599167, 71518967, 71299156, 71382812, 71451164, 71437767, 71358971, 71213806, 71215645, 71368858, 71506744, 71249741, 71034172, 71122574]
2619.3G1122574Q1749Q8432o8588o5766M6143R1164k9930j74538j0422m4426m9454
2629.9G0986938J5740L9467O485j29738Q255M6921J2390j01509j86356j7830n2482
2640.5G0628281l0915k3582o7795O5773Q3084p2593j45508P7354Q1139j26793k9068
2651.1G0439377O1821L1959L785q7250j61644j21712k2423K6047J4328K2347M2106
2661.7G0248741n0339j19850k1263M6471N1643l3531p3059Q995j64108j14922Q9668
2672.3F9868446J9303J38534P477j80748o7413q5381j396L5500P93l7857j20468k4178
2683.9F9552612P6493L8108q6189m7233K7298m4426r957j2031m4625M2618M2832l0281
2695.4F9505219j22292j86775o8314P6813Q7097n9502j0467P4081j69578n7656Q0223
$$ y = [71122574, 71204323, 71292755, 71224167, 71158401, 71204544, 71295708, 71265778, 71091240, 71080818, 71036392, 70986938, 71002678, 71042145, 71048630, 70918892, 70927147, 70974068, 70986458, 70884949, 70698593, 70680763, 70628281, 70597366, 70573784, 70505989, 70571762, 70654846, 70582253, 70436745, 70514099, 70595238, 70468445, 70439377, 70501198, 70533157, 70536942, 70449692, 70288048, 70166336, 70143913, 70169960, 70184288, 70206635, 70248741, 70198402, 70078552, 70057289, 70103760, 70155403, 70121872, 70048813, 70057808, 69893700, 69778778, 69868446, 69887749, 70026283, 70033760, 69853012, 69785599, 69700218, 69698822, 69734322, 69735115, 69697258, 69576790, 69552612, 69629105, 69667213, 69581024, 69533791, 69561089, 69516663, 69506706, 69494675, 69450050, 69492668, 69535500, 69505219, 69382927, 69196152, 69127838, 69204651, 69291748, 69232246, 69221779, 69295860, 69126282, 69068626, 69148849]
2706F9148849L9849P4219q8921K2247l4836k45323l5850N2620n1468j07903J0338l487
2717.6F8780334p4806O0921L0968o3782r094L2814j22597k08321j22055j6380J09421
2728.2F8397423O7634m4464o5078M0329J45561J2108j77788j07430M1443L7445l3325
2738.8F8313858j16341O958r231j93291p6271l9665n6793K7130R4406N8823q0262n0132
2750.4F7879189L2951q408j18477n9120O9901l662j15486r5727j1901k9900j4626J7746
2762F7542480J7579l2227j02226M6554M5151j03722n4496o5773r6909M9187J6792j04538
2773.5F7157852n9662j61094p8560P0198L532K7947r7786r6359j4374j10390n5534
2784.2F6585770k4948L2516P1922k3147m3457p5722o9389j36254j78657J08268J04142
$$ y = [69148849, 69188698, 69262917, 69173996, 69196243, 69161407, 68916084, 68880234, 68932854, 68881386, 68773483, 68783821, 68780334, 68705528, 68766449, 68797417, 68733635, 68724541, 68757355, 68634758, 68426437, 68304382, 68288002, 68397423, 68465057, 68420593, 68355515, 68395844, 68541405, 68553513, 68375725, 68268295, 68309738, 68347183, 68313858, 68197517, 68204475, 68195244, 68001953, 67925682, 67886017, 67829224, 67856354, 67950760, 68009583, 67929321, 67879189, 67912140, 67903732, 67785255, 67726135, 67796036, 67792374, 67676888, 67581161, 67569260, 67539360, 67524734, 67542480, 67560059, 67527832, 67425606, 67472160, 67517311, 67413589, 67359093, 67293320, 67196411, 67245598, 67262390, 67157852, 67098190, 66937096, 66858536, 66928734, 66932266, 66960213, 66862427, 66766068, 66751694, 66641304, 66585770, 66560822, 66593338, 66665260, 66642113, 66598656, 66522934, 66453545, 66317291, 66138634, 66246902, 66351044]
2794.8F6351044j09734M0177O94j96610j15776k8915k0043n6472j65947n1499O3484
2805.4F5710403j52290j08528N8708o0737n4657O3270j4923j05995o3469j98647k01759
2816F4871376l2509n2559P0496J23489k8091j72417k51945j37017N9708K9892j95389
2826.6F4285034j31775o0646m8614Q4099k7436j28124j50681j06514M0566o4087k53193
2837.2F3438629k30648j71116j48411r5127o9221n1407j23226k19216k96890k78713
2846.8F1754654k14645l44578k74521j55945j36921M9297J58913K0912j85390k30419
2856.5F0441357k04045N5527K67414J78089o2378k34981L1959J8963j39705j59714
2866.1F0192486k89597j72447o6360q553r7134j14112n6317j87607q5292n7717q8848
$$ y = [66351044, 66241310, 66281487, 66282181, 66085571, 65969795, 65940880, 65920837, 65864365, 65698418, 65646919, 65710403, 65558113, 65449585, 65508293, 65447556, 65392899, 65456169, 65441246, 65335251, 65271782, 65073135, 64871376, 64838867, 64786308, 64856804, 64980293, 64952202, 64779785, 64527840, 64390823, 64450531, 64480423, 64285034, 64153259, 64092613, 64043999, 64128098, 64100662, 63972538, 63821857, 63715343, 63755909, 63691822, 63438629, 63207981, 63036865, 62888454, 62793327, 62724106, 62672699, 62549473, 62330257, 62033367, 61754654, 61540009, 61195431, 60920910, 60764965, 60628044, 60677341, 60836254, 60857166, 60671776, 60441357, 60237312, 60292839, 60560253, 60738342, 60675964, 60440983, 60472942, 60491905, 60352200, 60192486, 59902889, 59730442, 59664082, 59655529, 59558395, 59444283, 59387966, 59200359, 59115067, 59057350, 58968502]
2876.7E8968502q2008j11611m3922N9475N8506q9329m9755m2141L914L5950k13143
2887.3E8494438j78848m646j63918k82024l6003m975r3105r8084k32410j98345j74923
2897.9E7027157j5537J05945K4697k0581r9033L5324l8708k02183j08928N0144R0664
2908.6E6848961k12998l45954k06906K3979J09375K861r6454l16372k27532k5264j62022
2919.2E5391674j82690Q1921J31687l5267l715j61041l13191M2156J28144j28869J02444
2929.8E5053253K42375r5246j50108J39816K33933r3315j63247R0680J81720Q2432
2939.4E5522293j05335j4092K2255R4837J74008n3955L8959N6889j2993M3610j08384
2950E5658092n2177P0747R5196L2253k19509k05288o2873j09734L6579J23791K0344
$$ y = [58968502, 58886494, 58774883, 58730961, 58790436, 58848942, 58759613, 58709858, 58667717, 58671631, 58707581, 58494438, 58315590, 58310944, 58147026, 57865002, 57828999, 57824024, 57730919, 57632835, 57400425, 57202080, 57027157, 57011620, 57117565, 57142262, 57121681, 57022648, 57057972, 57019264, 56817081, 56708153, 56758297, 56848961, 56635963, 56290009, 56083103, 56107082, 56216457, 56219318, 56122864, 55806492, 55578960, 55553696, 55391674, 55208984, 55290905, 55422592, 55387325, 55383610, 55222569, 54909378, 54951534, 55079678, 54950809, 55053253, 55295628, 55200382, 55050274, 55190090, 55424023, 55330708, 55167461, 55258141, 55439861, 55522293, 55416958, 55402866, 55425121, 55519958, 55693966, 55640011, 55678970, 55735859, 55722866, 55766476, 55658092, 55605915, 55676662, 55771858, 55804111, 55584602, 55379314, 55316441, 55206707, 55243286, 55367077, 55387421]
2960.6E5387421J12682Q4549n5744j13354R811K30568J47766N4352R6833J39640J11374
2971.2E6205898j0540K3812J79790J42517k5177P6897J83906J74603J51005k4235N0388
2981.8E7128864J03791J2710J49552R1915r827L1517P5634K85965K51720K5872Q217
2992.5E8155930l0148R834M4815j5251R6436P6671r2682q0352M0970J11103J9775o3480
3004E8273621j3626k434o8535o9355J15566J62998M3290J06250n99j96582p0878P5398
3015.6E8355114k5845j99058j41049J0746Q4671q7474k32026l24N1441n5114o4511
3026.2E7696571n9860m2038k8023k9815q3027J983j564r1953n5866m196p8430k45667
3037.8E6978115j6457J34091k1175q2608j62586q1470l7449q8112j72516j86520L9730
$$ y = [55387421, 55500103, 55584652, 55528908, 55415554, 55425365, 55655933, 55803699, 55858051, 55954884, 56094524, 56205898, 56195358, 56219170, 56398960, 56541477, 56516300, 56593197, 56777103, 56951706, 57102711, 57078476, 57128864, 57232655, 57245365, 57394917, 57486832, 57477005, 57508522, 57584156, 57870121, 58121841, 58147713, 58155930, 58125782, 58135616, 58180431, 58165180, 58261616, 58338287, 58245605, 58165253, 58206223, 58317326, 58337101, 58273621, 58259995, 58257561, 58189026, 58119671, 58235237, 58398235, 58441525, 58547775, 58547176, 58350594, 58279716, 58355114, 58329269, 58130211, 57989162, 57999908, 58084579, 57997105, 57765079, 57764755, 57816196, 57761082, 57696571, 57636711, 57594673, 57566650, 57536835, 57453808, 57455791, 57454227, 57362274, 57306408, 57302212, 57223782, 56978115, 56961658, 57095749, 57074574, 56991966, 56829380, 56747910, 56710461, 56622349, 56449833, 56263313, 56303043]
3048.4E6303043M9889o4964q8272j64250o4720J78452N5725k28924k28718j18549k1298
3059E5607414m0500r0950n1575m254k5756q3641j34655j05645O6830K5158k2099l2566
3070.6E5107761p9567j3076j23570p7919j07860j92337N1330j7555j79550K4498J53915
3081.2E4546070l0636p1571j08856k23118j11847p2407Q09J3245K3010Q7402k2110
3091.8E4029991j30482j99897o6746o6944j62693l2231P7153K8755j69640r6721J3279
3102.4E3223824r1031j82682j10889l220j33388q0013K269m7283l7151j28166j72642
3113E2239628j24790p6203q4316J148M0459j02051r5386m7745j24447j14792j1898
3123.6E1499607p2117j72497j66755n181n752j97121o1371q0173p6698P9475j14342
$$ y = [56303043, 56352932, 56287968, 56199696, 56035446, 55970726, 56149178, 56204903, 55975979, 55747261, 55628712, 55607414, 55566914, 55475964, 55424389, 55420135, 55394379, 55310738, 55176083, 55070438, 55137268, 55162426, 55140327, 55107761, 55028194, 55015118, 54891548, 54813629, 54705769, 54513432, 54564762, 54547207, 54367657, 54392155, 54546070, 54515434, 54443863, 54335007, 54111889, 54000042, 53927635, 53928444, 53941689, 53964699, 54052101, 54029991, 53899509, 53699612, 53632866, 53565922, 53403229, 53370998, 53448151, 53476906, 53307266, 53210545, 53223824, 53132793, 52950111, 52839222, 52836002, 52702614, 52622601, 52624870, 52577587, 52540436, 52412270, 52239628, 52114838, 52038635, 51954319, 51955467, 51995926, 51893875, 51798489, 51750744, 51626297, 51511505, 51499607, 51427490, 51254993, 51088238, 51083057, 51077305, 50880184, 50818813, 50738640, 50661942, 50741417, 50627075]
3134.2E0627075j09920q8444j57921j35944r5726L9367p0442j48433p9003k02247j69152
3144.8D9409210P8285M395k54086j43917R602l3390j28239k23495j04786n5313l3951
3155.4D8524315K5055j94588j63750m985j15586j89064j07006O0639k5078j71852k32411
3166D7405689j52881P1689l7922j50524j68472j35010n6190r2106j08902j68961j1646
3176.6D6394764k3876j51329n3501j17279j05259j32775q4823j7304j04370j82556
3186.3D5421692j63574J26007L296j96816j12854o1848J9257k14386k40742o4582Q834
3196.9D4524284N3311j61904j77955m0417j1909j45428k53681j35037j12568j3580
3206.5D3525116j0937j99737q1230J3340r4574r6486n4679q0147j70193j25473m0554
$$ y = [50627075, 50517155, 50428711, 50270790, 50134846, 50039120, 50078487, 50008045, 49859612, 49780609, 49578362, 49409210, 49487495, 49491890, 49237804, 49093887, 49103489, 49070099, 48941860, 48718365, 48613579, 48558266, 48524315, 48549370, 48354782, 48191032, 48186047, 48070461, 47881397, 47774391, 47835030, 47809952, 47638100, 47405689, 47252808, 47324497, 47286575, 47136051, 46967579, 46832569, 46776379, 46684273, 46575371, 46406410, 46394764, 46370888, 46219559, 46166058, 46048779, 45943520, 45810745, 45725922, 45708618, 45604248, 45421692, 45258118, 45384125, 45387421, 45190605, 45077751, 45015903, 45035160, 44820774, 44580032, 44515450, 44524284, 44577595, 44415691, 44237736, 44197319, 44185410, 44039982, 43786301, 43651264, 43538696, 43525116, 43514179, 43314442, 43233212, 43246552, 43151978, 43055492, 43000813, 42920666, 42750473, 42625000, 42584446]
3217.2D2584446m6879n6263r9190j03157k14450j69438O1123K0016P374l8926j37653
3227.8D1807003n5115j0395n3486q2199r6885j15044n5531j50348k18113q1841L5099
3238.4D0923145Q6842o4854j99596k40227K4342Q9096k52457O290M4022k30045j41815
3249D0044743p7435p6935m5154P9418m8577k21317j67759j8692R4658o2672r0423p4448
3260.5C9335407K991J7185k11975j88724r2404K8896Q2467p9750j50364n1163J9443
3271.2C8712009J164p805j24496j23669p3845n4543l875q6399m4384j00190j24225
3281.8C7969742O6547k9602j42307o2233o5411o5563n5809j10744N1761Q5083r9930
3292.4C7541534l3092j60809k07805N4500M6894m6768r4257o1447j5164p6252J6510
$$ y = [42584446, 42537567, 42481304, 42382114, 42278957, 42064507, 41895069, 41956192, 41976208, 41983582, 41944656, 41807003, 41751888, 41741493, 41688007, 41605808, 41508923, 41393879, 41338348, 41188000, 40969887, 40888046, 40923145, 41009987, 40945133, 40745537, 40505310, 40529652, 40618748, 40366291, 40372581, 40416603, 40186558, 40044743, 39967308, 39890373, 39845219, 39924637, 39876060, 39654743, 39486984, 39468292, 39562950, 39500278, 39409855, 39335407, 39338398, 39355583, 39143608, 38954884, 38862480, 38891376, 38973843, 38894093, 38743729, 38692566, 38712009, 38713173, 38705368, 38580872, 38457203, 38383358, 38328815, 38324940, 38238541, 38194157, 38093967, 37969742, 38036289, 38006687, 37864380, 37802147, 37736736, 37671173, 37615364, 37504620, 37556381, 37641464, 37541534, 37508442, 37347633, 37139828, 37194328, 37241222, 37194454, 37100197, 37038750, 37023586, 36947334, 36963844]
3303C6963844M9443j21827p1811Q6776p1010k20627j18755q3515o9664m6578k8770
3313.6C6267506k0737j50063j82731j49193p996J44581j05171j70639p965o5968n7071
3324.2C5494553m895j2481n6031m7767l9521j22768j45859j65130o5869K8317j10275
3334.8C4752274j29315m7119k6741l2913j11084o8604k6874j17420j42777p6054J17062
3345.4C4090435N1842j18862r9560j87203N051J02764j14208k16278k69367k8881M2285
3356C3258018r7312j03630j10772L5858j0639q2039j06304k03506q885O8966q2939
3366.6C2556816j55476o8656r144j50463j53584q1900n7285m1063l0644n346j19699
3377.2C1683556p4549J9985n5782n8186j85711j02958R1890o0680l1020N4808q2054
$$ y = [36963844, 37013287, 36891460, 36819649, 36906425, 36835415, 36614788, 36496033, 36412518, 36342854, 36296276, 36267506, 36246769, 36096706, 35913975, 35764782, 35756786, 35901367, 35796196, 35625557, 35617592, 35551624, 35494553, 35489658, 35477177, 35421146, 35373379, 35333858, 35211090, 35065231, 34900101, 34834232, 34862549, 34752274, 34622959, 34575840, 34549099, 34516186, 34405102, 34336498, 34309624, 34192204, 34049427, 33973373, 34090435, 34142277, 34023415, 33923855, 33736652, 33741703, 33844467, 33730259, 33513981, 33244614, 33215733, 33258018, 33160706, 33057076, 32946304, 32982162, 32971523, 32889484, 32783180, 32579674, 32570789, 32639755, 32556816, 32401340, 32332684, 32323540, 32173077, 32019493, 31937593, 31880308, 31839245, 31808601, 31803255, 31683556, 31609007, 31628992, 31573210, 31515024, 31329313, 31226355, 31318245, 31257565, 31226545, 31281353, 31199299]
3387.8C1199299j15112K1966n9753j64692k7231j51688l9434J21021p3150K1539m3949
3398.4C0688816j46963K0985N237o9631o9872m1725l1361K680K0872j4914o1712K2640
3410C0325052J33288k2990j23947p7337k1587j5814m8250q3327j23155J02373J97141
3420.6C0241447j8791k1271n908j02545O2978J78751j59830j97639J09415J87510k6083
3431.2C0248034k72152m2767K37885J31626j32908o3935J92294M3487m1189N7024M5925
3441.8C0403324m1914N55J22812J8134k2383M4689P3536O4362P7137N4763n0249O7288
3453.4C0812054Q4636l6657l1446l0173L6730P0448K3409Q7166J27887k6569J09757
3464C1227242K43635K3876P2435J05545m4134P673J12357R4465K4792J4394L7896O7228
$$ y = [31199299, 31084187, 31106153, 31046400, 30881708, 30854477, 30702789, 30663355, 30784376, 30711226, 30732765, 30688816, 30541853, 30562838, 30568075, 30498444, 30428572, 30386847, 30355486, 30358166, 30379038, 30364124, 30302412, 30325052, 30458340, 30435350, 30311403, 30234066, 30212479, 30196665, 30148415, 30065088, 29941933, 30044306, 30241447, 30222656, 30201385, 30195477, 30092932, 30155910, 30334661, 30174831, 29977192, 30086607, 30274117, 30248034, 29975882, 29933115, 30171000, 30302626, 30169718, 30105783, 30298077, 30341564, 30300375, 30357399, 30403324, 30361410, 30361965, 30484777, 30502911, 30480528, 30525217, 30598753, 30663115, 30740252, 30795015, 30744766, 30812054, 30896690, 30860033, 30828587, 30798414, 30835144, 30905592, 30929001, 31016167, 31144054, 31117485, 31227242, 31470877, 31494753, 31567188, 31672733, 31628599, 31636272, 31748629, 31843094, 31867886, 31882280, 31920176, 31987404]
3475.6C1987404K9232Q5354Q9920L9444J04370M6703Q9913M4323r884J15848J28498
3486.2C2751125J36261m0794j37085O9874K09862J06281k3281J92989K74262N8319
3495.8C3597813j10390K9701K27242J05282O5647M7069M3122J62433K4471o9534L1067
3506.5C4153923P7213P5627J40510J27472J42430K23781J47736M6131p9899J9573K20265
3517.1C5294762M7115j9314Q2104J0418J21132L18596J07406j06529K3052J44024K58442
3527.7C6281208K66735K2366q278P0175P0911J23452J28128J44668J8193j2551K19277
3538.3C7324284K91580J62926p8923r086J39488K01683L10409J07117m8912r5020J40209
3548.9C8445755K51305J32976J81278M3320R3929J24020J28979J07372M35K60651J39545
$$ y = [31987404, 32016636, 32101990, 32191910, 32231354, 32335724, 32382427, 32472340, 32516663, 32506779, 32622627, 32751125, 32887386, 32846592, 32709507, 32779381, 32989243, 33095524, 33072243, 33265232, 33539494, 33597813, 33487423, 33517124, 33744366, 33849648, 33915295, 33962364, 34005486, 34167919, 34192390, 34122856, 34153923, 34231136, 34306763, 34447273, 34574745, 34717175, 34940956, 35088692, 35134823, 35054924, 35074497, 35294762, 35341877, 35322563, 35404667, 35415085, 35536217, 35854813, 35962219, 35855690, 35878742, 36022766, 36281208, 36547943, 36570309, 36562031, 36632206, 36703117, 36826569, 36954697, 37099365, 37117558, 37105007, 37324284, 37615864, 37778790, 37699867, 37690781, 37830269, 38031952, 38342361, 38449478, 38400566, 38305546, 38445755, 38697060, 38830036, 39011314, 39054634, 39148563, 39272583, 39401562, 39508934, 39509369, 39770020, 39909565]
3559.5C9909565J5503J89739K13001J33805J38382L54553Q7471K20970K37656j32992
3569.1D1367653K51057P4611J7632J40415J15532K17014K42546K81655K03048J88088
3578.8D3099251R6638J88137K41478J08356J81656L9585K70977K19799k6848K37065
3588.4D4656094p4917L44429L38405O6052J45325K44525M76609R6340J27457L37028
3598.1D6757347Q6498K31419J17447J89899L85151J48499K19902L40542R8095l6484
3607.7D8538315K40299j3767J50745O94008K47128j81538L76701K25548M44199N37803
3617.4E1259441P7698J37482k1168K26059M03229K96531L95886K93674J46115J20853
3627E3335800N80589L76530q77392K04037M22882P36275M45515j48846K70412L50357
$$ y = [39909565, 39925068, 40114807, 40327808, 40461613, 40599995, 40954548, 41042019, 41262989, 41500645, 41367653, 41618710, 41693321, 41710953, 41851368, 41966900, 42183914, 42426460, 42708115, 42911163, 43099251, 43195889, 43384026, 43625504, 43733860, 43915516, 43955101, 44226078, 44445877, 44419029, 44656094, 44581177, 44925606, 45264011, 45330063, 45475388, 45719913, 46196522, 46292862, 46420319, 46757347, 46843845, 47075264, 47192711, 47382610, 47767761, 47916260, 48136162, 48476704, 48574799, 48538315, 48778614, 48764847, 48915592, 49609600, 49856728, 49675190, 50051891, 50277439, 50721638, 51259441, 51337139, 51474621, 51453453, 51679512, 52082741, 52379272, 52775158, 53068832, 53214947, 53335800, 53916389, 54292919, 53415527, 53619564, 54042446, 54778721, 55224236, 55075390, 55345802, 55696159]
3636.6E5696159L02529J46343K26994J76227J58703M62528J52577L0998L90659P81723
3646.3E8525440J49586k14653O82308m54727l92929M32682N30983M49016N30484O28830
3655.9F0867020o80626m502N62371L96518L33607j0898J38595J38867M7462J91509
3665.6F1979923L55671N27016K12906K87128J74927j088268J54937R51985Q62247p1274
3675.2F4347198j531608K85793P51957L89206j18088o2362K75970L92273K62703J3344
3684.9F5006386j54953M23294R67682o87920p49184Q56499L914l40675K23221J3252
3694.5F5561516J33301J88827L7048l3630j07002L28827M73617m90379k43004N14580
3704.1F6363701J50909r399K02110K59339J62529m65653N61539M09134j362320L78486
$$ y = [55696159, 55998688, 56145031, 56372025, 56548252, 56706955, 57169483, 57322060, 57353058, 57743717, 58525440, 58675026, 58460373, 59142681, 58687954, 58295025, 58727707, 59258690, 59707706, 60238190, 60867020, 60186394, 60181892, 60744263, 61140781, 61474388, 61463490, 61602085, 61740952, 61788414, 61979923, 62335594, 62862610, 63075516, 63362644, 63537571, 62449303, 62604240, 63556225, 64418472, 64347198, 62815590, 63101383, 63853340, 64242546, 64124458, 64062096, 64338066, 64730339, 64993042, 65006386, 64851433, 65274727, 66242409, 65554489, 64805305, 65661804, 65665718, 65325043, 65548264, 65561516, 65694817, 65883644, 65920692, 65887062, 65780060, 66108887, 66582504, 66092125, 65849121, 66363701, 66514610, 66505211, 66707321, 66966660, 67129189, 66663536, 67225075, 67634209, 66271889, 66650375]
3713.8F6650375M40178j33506O5139L44567L23539j34414j48972L10410j37001k24381
3723.4F7355934M97955j2359k33399j0421L03985L38845j25451M02619k39746p51625
3733.1F7526337N33165m17328n06363M40269K66869j7677J56952L95385l14239m0520
3742.7F8022850Q90022p15072j338150J139419N55618L60909o17867j361228R58793
3751.4F7895294o36116l66142J021927N82313J85051p21794L58055P78885q18504k67243
3761F8011726M61365L00812k1698O4293k85683l60458K24151L76381K90757q18047
3770.7F8243599j55785K85149J56776L21000m3580r6244p5303K26555L76427o55479
3780.3F8583115O6505K32155j41518J41396q164p2807Q5182J0132j59416j94847N966
$$ y = [66650375, 67090553, 66957047, 67022186, 67366753, 67690292, 67555878, 67406906, 67717316, 67580315, 67355934, 67853889, 67841530, 67608131, 67597710, 67901695, 68240540, 68115089, 68517708, 68277962, 67526337, 68059502, 67642174, 67135811, 67576080, 67842949, 67825272, 67982224, 68377609, 68063370, 68022850, 68912872, 68197800, 66859650, 67999069, 68554687, 68915596, 68297729, 66936501, 67895294, 67259178, 66893036, 67914963, 68497276, 68682327, 67960533, 68318588, 69097473, 68278969, 68011726, 68473091, 68773903, 68752205, 68816498, 68530815, 68170357, 68394508, 68770889, 69061646, 68243599, 68087814, 68372963, 68529739, 68850739, 68807159, 68710915, 68635612, 68862167, 69238594, 68583115, 68649620, 68881775, 68740257, 68881653, 68873489, 68800682, 68885864, 68895996, 68736580, 68541733, 68547699]
3790.9F8547699Q9409J38840l0587J46729N99167k15988q17154M7775M18678N47272
3800.6F9471840J03325q29109n1140K05902L41064M26781q28224m44367M54605K48383
3810.2F9099060J4046P416J42601Q8592M67712K34849j575699J32949N55008N00115
3819.9F9666649K20878j836921M6783O15647J93275J84685j5907l22960P5592R9105
3829.5F8926826K10251K84394p46231K00210Q16971n47653j16402P20551j115044n02991
3839.2F8130882J109307R7618l89031K10434K2003l10562J05416K19917q9974K33582
3848.8F9339592R605p1495K75315q47184M93134q62740l02276J092842M2374k17736
3858.4F8951431R3193M2847J82632l35838Q3573M61181o58592m98550M71458N79353
$$ y = [68547699, 68637108, 68775948, 68745361, 68892090, 69491257, 69275269, 68458115, 68505890, 68924568, 69471840, 69575165, 68746056, 68694916, 68900818, 69241882, 69668663, 68840439, 68396072, 68850677, 69099060, 69113106, 69120522, 69263123, 69351715, 69819427, 70054276, 68478577, 68611526, 69166534, 69666649, 69887527, 68050606, 68097389, 68713036, 68906311, 69090996, 69075089, 68752129, 68827721, 68926826, 69137077, 69421471, 68675240, 68875450, 69692421, 69144768, 69028366, 69748917, 68633873, 68130882, 69240189, 69337807, 68948776, 69159210, 69181213, 68870651, 68976067, 69195984, 69106010, 69339592, 69349197, 69277702, 69553017, 68705833, 69198967, 68336227, 68033951, 69126793, 69169167, 68951431, 69044624, 69087471, 69270103, 68934265, 69017838, 69479019, 68820427, 68321877, 68793335, 69372688]
3868.1F9372688M04343p24197p05307J58729N24483O07467q54919j80016M66141r437
3877.7F9059975O3469M76394j80290q13248K85500O9054J12121L84995j106270Q1299
3887.4F8432999L80462J97426N44052o8115p65427O9947L82568j3077J0323j79573
3897F8991585n5397L08662o41296K78045J23070m56833N43541j59401l18092M8988
3906.7F8662872J13037R5597j3779J51970L5583J8776J0102l4584J48765K07138l77273
3917.3F9018204m10500N75607J44402o14037P1732K37846J39542j85974l93486J5831
3926.9F8599167J37466K13158N2399j43654Q6250l7689r4719M654j30371N4504J19080
3937.5F8860245o2851Q0910J38542J37199o042o35743k65243K94182K67616J53244
$$ y = [69372688, 69777031, 69052834, 68347527, 68506256, 69030739, 69638206, 68783287, 68603271, 69069412, 69059975, 69123444, 69599838, 69419548, 68606300, 68891800, 68960854, 69072975, 69457970, 68351700, 68432999, 68813461, 69010887, 69554939, 69486824, 68721397, 68791344, 69173912, 69160835, 69171158, 68991585, 68936188, 69244850, 68603554, 68881599, 69004669, 68547836, 69091377, 68931976, 68613884, 68662872, 68775909, 68871506, 68857727, 69009697, 69045280, 69064056, 69074158, 69039574, 69188339, 69395477, 69018204, 68607704, 69183311, 69327713, 68713676, 68785408, 69023254, 69162796, 68976822, 68583336, 68599167, 68736633, 68949791, 69002190, 68858536, 68944786, 68907097, 68812378, 68817032, 68686661, 68741165, 68860245, 68797394, 68878304, 69016846, 69154045, 69148003, 68512260, 68247017, 68541199, 68808815, 68962059]
3947.2F8962059q0788R2057P8949n8052J74079j09535r9518J01197k0279j56616k47406
3957.8F8636147J52420K13722P988n3749j98639Q301L3134q8470j6594L7941R3574
3968.4F8825775o0341j35605J44135K00989k0424p8102n3810r8725K5772J62308q7486
3979F8824486j66687l746O9771Q8806j6030J43029J5197j57707K3995o6819J04332
3989.6F8858627Q9905j5037N4710j06514M9461m3548j82114n8517o1150M1992J37512
4000.2F8765327
$$ y = [68962059, 68881271, 68973328, 69052277, 68994225, 69168304, 69058769, 68959251, 69060448, 69040169, 68883553, 68636147, 68788567, 69002289, 69010277, 68956528, 68757889, 68766190, 68799324, 68710854, 68694260, 68732201, 68825775, 68765434, 68629829, 68773964, 68974953, 68954529, 68876427, 68822617, 68723892, 68749664, 68911972, 68824486, 68657799, 68654053, 68723824, 68812630, 68796600, 68939629, 68954826, 68797119, 68821114, 68754295, 68858627, 68948532, 68933495, 68988205, 68881691, 68931152, 68887604, 68705490, 68646973, 68585823, 68627815, 68765327]
##END=$$ End of the data block
