##TITLE=$$ Begin of the data block
##JCAMP-DX=5.00 $$ ACD/SpecManager v 10.08
##SPECTROMETER/DATA SYSTEM=Varian
##DATE=07 Jan 2013 10:27:20
##DATA TYPE=INFRARED SPECTRUM
##DATA CLASS=XYDATA
##ORIGIN=
##OWNER=
##NPOINTS=3735
##FIRSTX=399.26403809
##LASTX=4000.35498047
##MAXX=4000.35498047
##MINX=399.26403809
##MAXY=144.36572266
##MINY=10.31915188
##XFACTOR=1.0000000000
##YFACTOR=0.000001000000000
##FIRSTY=50.65164948
##DELTAX=0.96440572
##XUNITS=1/CM
##YUNITS=TRANSMITTANCE
##XYDATA=(X++(Y..Y))
399.3E0651649R3714074m9048142l2310356j9943806o099071J0128471J271271j1840595
407C6523495o96350L457298o849636k709719O697527J1453239P039494L255138N174466
415.7F3344952n507584j4234116j5296516P873661J3650585O162777J2166756l079727
423.4F5080788j6292939r289650P754689J0162964n831547o810150j601883O165283
431.1D9337555K340858j772983k292385r004799N6705Q805527L134018P93488l008763
439.8D8389221m973312j649197K173016R48227K321098k80106j389465M082974l584485
448.4D6037971n5763R143280L224716L473637q621361j3093528K845214L902737J816807
457.1D8673710N529049J41693l451260m884159l29193l042560P17403M671802k677650
$$ plain form
399.3 50651649 144365723 95317581 63007225 43063419 36964348 47092819 48364090 36523495
407 36523495 35827145 39284443 32434807 29725088 36422615 47875854 54915348 58170486 63344952
415.7 63344952 57837368 43603252 28306736 36180397 49830982 55993759 68160515 65080788
423.4 65080788 48787849 39498199 47252888 57415852 51584305 44774155 43172272 49337555
431.1 49337555 51678413 49905430 47613045 38608246 38664951 47470478 50604496 51397984 48389221
439.8 48389221 43415909 41766712 43939728 44887955 47209053 46928947 45539482 49622456 46037971
448.4 46037971 45982208 55125488 58350204 61823841 53202480 40108952 42954166 46856903 48673710
457.1 48673710 54202759 54344452 50893192 46009033 45679840 42637280 43354683 48026485 45348835
465.8D5348835k937199j854778L85254K88063L767460J3273102J1439346o112663j1350281
474.5E2247139n456402L884125N897053l362934n743374K904388J02825j558426o1645
483.2D8852749J496334L472553K372990j421387o776878l78727K06161J856129Q649342
491.8E8329266j501503k498585k648754m456436j191739j415519K427971R92527j533879
500.5D6503349K15603J053559m76918j651951N12677J005802M759563J762356o231666
509.2D7452374l694710R32770K088794K054589q15255l417209j008366J016556P72423
517.9D5381966J003872O47872K489869L067962j473591n269367j630131M208146J039367
526.6D9465965o24073L17272l501373k846535P38015J76536J802445L502544M59732
$$ plain form
465.8 45348835 42411636 40556858 40942112 41230175 44997635 58270737 69710083 63597420 52247139
474.5 52247139 46790737 50674862 56571915 53208981 47465607 50369995 50472820 48914394 48852749
483.2 48852749 50349083 53821636 56194626 54773239 47996361 47617634 47823795 49679924 58329266
491.8 58329266 56827763 54329178 51680424 47223988 46032249 44616730 47044701 48037228 46503349
500.5 46503349 46718952 47772511 47295593 45643642 46156319 47162121 51921684 53684040 47452374
509.2 47452374 43757664 44690434 46779228 48833817 48018562 44601353 43592987 44609543 45381966
517.9 45381966 46385838 47033710 49523579 52591541 51117950 45848583 44218452 48426598 49465965
526.6 49465965 48841892 49159164 45657791 42811256 43549271 43725807 45528252 49030796 49490528
535.2D9490528j761623j853405J013401J709358J65142n68062l038963k35134L198532
543.9D8119774m10526k043084J302422J805370L0838r74247j355186O81629J384338
552.6D8541328N10491m87240j833073j428661o5784K114505J590828R60076P30339
561.3E0632809k780869j658329J499241M05365L51410J486736o46618j390834J18095
570D8017006j344311j769363p11315J433426L687240J984539j443439l233956j228382
578.6D5391445J690521K65538j118992J007168J927051j10550j678627p66285j06834
587.3D6500435l99681K470077J910950j950626k60701Q37040m15268k175037r24023
596D5593166J419770q67089p56256M5506k74571j030891j376949J343097K396084J721775
$$ plain form
535.2 49490528 47728905 45875500 46888901 48598259 48763401 48195339 45156376 44921242 48119774
543.9 48119774 47709248 45666164 46968586 48773956 48804794 47830547 46475361 47156990 48541328
552.6 48541328 49051819 48564579 46731506 45302845 45237061 47351566 48942394 49902470 50632809
561.3 50632809 47851940 46193611 47692852 48098217 48449627 49936363 49289745 47898911 48017006
570 48017006 46672695 44903332 44192017 45625443 49312683 51297222 49853783 46619827 45391445
578.6 45391445 47081966 47347504 46228512 47235680 49162731 49052181 47373554 46607269 46500435
587.3 46500435 46100754 48570831 50481781 48531155 48270454 49107494 48692226 46517189 45593166
596 45593166 47012936 46145847 45389591 45435097 45160526 44129635 42752686 44095783 46491867 48213642
605.6D8213642r28966j454453K79472k427505l702549k653446o64482J2066r27689
614.3C5746090K04704O46752q29098j015335J460182J169952k484157l162102j583099
623C0153889J52029M72284O46399J820695K193333J512371J314400P92404J29463P71908
632.7C9959175J438439K68138j120266r38846j444809r56406P24106m20647j37653
641.3C7371231J637062J428009J549511K432812K634857Q91792p71457J270244J884449
650E0328510r51668p98442J875106K119832l65262j249385p7393R27742J385120J31833
659.7E3325993r53122k17868Q4861m49947k05788R71428O40431j056580J232506M79114
669.3E3851028o82300J68171j158577k61231J355618N99693j89880j150788M51809
$$ plain form
605.6 48213642 47284676 45830223 46109695 43682190 39979641 37326195 36661713 36673779 35746090
614.3 35746090 35950794 36597546 35768448 34753113 36213295 37383247 34899090 31736988 30153889
623 30153889 30305918 30778202 31424601 33245296 35438629 36951000 38265400 39057804 39187267 39959175
632.7 39959175 41397614 41665752 40545486 39606640 38161831 37205425 37929531 37508884 37371231
641.3 37371231 39008293 40436302 41985813 44418625 47053482 47945274 47173817 48444061 50328510
650 50328510 49376842 48578400 50453506 52573338 52208076 50958691 50881298 51809040 53194160 53325993
659.7 53325993 52372871 52155003 52239864 51789917 51584129 52555557 53195988 52139408 53371914 53851028
669.3 53851028 53168728 53336899 52178322 51917091 53272709 53872402 53682522 52531734 52983543
678E2983543J457211K78488j103813j578507P45423J087215J83254o80435j104961
686.7E2267418N88146P65270l40225j151687J17645L04214n65899K91363q97335p09373
696.3E0669537K69832j4171N73207K09053K02786M24431k54376j275222n13028J103131
705.9E1395180J95259q7315M81812M8633k99045j34777P95524Q68782J2505j12095
715.6E3164463L60294M71898l12668j52928M47686J57676P26483N12825J3393k4822
725.2E5364300n00454M1096M0832n82554j556267m79652J121773n44358L83313Q32412
734.9E4120441q31321m47418K9373L30135K34684J263233Q58025q03681k89154j2783
744.5E4451534J17825k06665J84913R04816O51764l98945p29599O50662M60460O77395
$$ plain form
678 52983543 54440754 54719242 53615429 52036922 52782345 53869560 54052814 53372379 52267418
686.7 52267418 52855564 53620834 53280609 52128922 52246567 52550781 51984882 52276245 51378910 50669537
696.3 50669537 50939369 50925198 51498405 51707458 51910244 52334675 52080299 50805077 50292049 51395180
705.9 51395180 51590439 51503124 51984936 52033569 51734524 51599747 52395271 53264053 53276558 53164463
715.6 53164463 53524757 53996655 53683987 53531059 53978745 54136421 54862904 55375729 55389122 55364300
725.2 55364300 54863846 54904942 54945774 54363220 52806953 52327301 53449074 52904716 53288029 54120441
734.9 54120441 53289120 52841702 52871075 53201210 53435894 54699127 55557152 54753471 54464317 54451534
744.5 54451534 54569359 54362694 54547607 55452423 56104187 55705242 54975643 55626305 56086765 56764160
754.2E6764160K461p26044R28577K66194M6882P24327R64692R71626m37603l80875
763.8E9124397K35787j68740j8211M52442l44528j197598n21694Q73116J303165l24691
773.5E9413445p91417J72615k45636m87087P63626J501709J075032L98860J02581L37914
783.1F2241642l83850n54100j65997m34604k17297k17304N86174P27081P8816j1872
792.7F1648689k88944L85548j96102n94410M24160m5784j24272O27438j55796j112812
802.4F0567715J8837M88010L09498M17210k41681J02539O42796J58237j193275o25397
812F0644489R99390n3066m32583N05508R12525J95324p87628o7905K63519J56921L57583
822.6F2694077o12500k69886Q42240n86483o60000j77147q09109N59349J13800r07818
$$ plain form
754.2 56764160 56766621 56040577 56969154 57235348 57282230 58006557 58971249 59942875 59505272 59124397
763.8 59124397 59360184 59191444 59173233 59625675 59281147 58083549 57561855 58434971 59738136 59413445
773.5 59413445 58622028 58794643 58549007 58061920 58825546 60327255 61402287 61801147 61903728 62241642
783.1 62241642 61857792 61303692 61137695 60703091 60485794 60268490 60854664 61581745 61660561 61648689
792.7 61648689 61359745 61745293 61549191 60954781 61378941 61333157 61208885 61836323 61680527 60567715
802.4 60567715 60586552 61074562 61384060 61801270 61559589 61662128 62304924 62463161 61269886 60644489
812 60644489 61643879 61590813 61158230 61663738 62576263 62771587 61983959 61916054 62179573 62336494 62694077
822.6 62694077 62081577 61811691 62653931 62067448 61407448 61230301 60421192 60980541 61094341 60186523
832.3F0186523k67990P6985L89023p67449j065460p14554m20456Q2237n36968K43927
841.9E7205818m4983r97516l37113p91343j51036O75873J34407L99807o9962k05055
851.6E5818897N13855L59848O69697O47705j22600n74658m02492R70195J338887N08815
861.2E9728149J17543n81719J9863J113888M01467j73996K5474K67304M8027r3888
870.9F0872112r2567n42504J17913R01642O85604L5446l84361M40387M26262n16578
880.5F1943356k07245L74408j026199j763996L6377N25665L25363n1014o20025N1574
890.2E9588264J27835K20096k87857l62644K02080j44177K66686K12097M33704j27788
899.8F0128296j375988n55767j0052N51140P63023J9711m12895n91725k29271n4508
$$ plain form
832.3 60186523 59918533 59995518 60384541 59617092 58551632 57837078 57416622 57498859 56961891 57205818
841.9 57205818 57160835 56163319 55826206 55034863 54883827 55559700 55694107 56093914 56023952 55818897
851.6 55818897 56332752 56692600 57362297 58010002 57887402 57312744 56910252 57880447 59219334 59728149
861.2 59728149 59845692 59263973 59283836 60397724 60799191 60625195 60650669 60917973 60966000 60872112
870.9 60872112 60779545 60237041 60354954 61256596 61942200 61977646 61593285 62033672 62459934 61943356
880.5 61943356 61736111 62110519 61084320 59320324 59356701 59882366 60207729 60156715 59536690 59588264
890.2 59588264 59716099 59936195 59648338 59285694 59487774 59343597 59610283 59822380 60256084 60128296
899.8 60128296 58752308 58196541 58186489 58737629 59500652 59520363 59107468 58515743 58286472 58231964
909.4E8231964n19943q13366m5994L35224j96716o78730m11060K67139m74689j034302
919.1E4659527p80823k91485j97242o12942L35209N14228q80775r58874J68328l30635
928.7E1624516r33407J79195L17928j6758K1679K58343R35330R71550k27765m94037
938.4E2636574Q96984P39685k81189j48220J156757J219181k61562J87927M83799M25137
948E7055073O84215M80973K03235l29986L64158K47696l26286k48570l23547K02007
957.7E8008968k07206m63444n36511n05924l95325k19234N64629n28462r70478j37508
967.3E4609505J09321K8782l87066J06636o2633l72719O0421j63471n89401k13780
976.9E3125595L31791j36169J59938p7625r41746l52092j89484l30215m22734l25619
$$ plain form
909.4 58231964 57712021 56898655 56852661 57187885 56991169 56312439 55901379 56168518 55693829 54659527
919.1 54659527 53878704 53587219 53389977 52777035 53112244 53626472 52745697 51786823 51955151 51624516
928.7 51624516 50691109 50870304 51188232 51171474 51193153 51451496 52386826 53358376 53130611 52636574
938.4 52636574 53533558 54273243 53992054 53843834 55000591 56219772 55958210 56146137 56629936 57055073
948 57055073 57739288 58220261 58423496 58093510 58457668 58705364 58379078 58130508 57806961 58008968
957.7 58008968 57801762 57338318 56801807 56295883 55900558 55681324 56245953 55717491 54747013 54609505
967.3 54609505 54718826 54747608 54360542 54467178 54404545 54031826 54092247 53928776 53339375 53125595
976.9 53125595 53457386 53321217 53481155 53403530 52461784 52109692 51920208 51589993 51167259 50841640
986.6E0841640q9984j05568p5669m05563j43585o1779j254200k110306j968002j538876
996.2D3088108q156J591831J189839Q95504M86263l18302P9178r941j0575r2159l99017
1006.8D6492573k69772n64998l70213K70515N71984J22192j18000j49162n00698l77270
1016.5D5107151r11213j024361l32706K48497M33224m41891n09010k93045k04876J55090
1026.1D2226860J39355K4563l96054m28791l68408o26060r73610p14646J71845M76574
1035.8C9531628L03245k42565k98458k39857J60874N04711j47373l85418o60542k07088
1045.4C8319157K33413j12651j75892k01184N18559O59195j91071n84823n9693L79238
1055.1C8784248J23761J38919J45108M3918j22791j94443j87649L37033M41570l28537
$$ plain form
986.6 50841640 50751656 50646088 50570419 50164856 50021271 49959492 48705292 46594986 44626984 43088108
996.2 43088108 43079952 44671783 45861622 46757126 47243389 46925087 47004265 46994324 46983749 46891590 46492573
1006.8 46492573 46222801 45657803 45287590 45558105 46130089 46252281 46134281 45985119 45484421 45107151
1016.5 45107151 44195938 43171577 42838871 43087368 43520592 43078701 42569691 42276646 42071770 42226860
1026.1 42226860 42366215 42390778 41994724 41565933 41197525 40571465 39597855 38883209 39055054 39531628
1035.8 39531628 39834873 39592308 39293850 39053993 39214867 39719578 39572205 39186787 38526245 38319157
1045.4 38319157 38552570 38439919 38264027 38062843 38581402 39240597 39049526 38464703 38405010 38784248
1055.1 38784248 38908009 39046928 39192036 39235954 39113163 38918720 38731071 39068104 39509674 39181137
1064.7C9181137k59518m43664l65006K98592J69807q23387q56403N38071J99691l35838
1074.4C7303482R1442K6959n07859m64611J09108j52900O70097M53266r37939j36127
1084C6454918M48242K55211J55174n4672k89955r14505r41975k9949k85683o86050
1093.6C4110756m44943j146286j028320r70487j137713o02560p85694j472752j544565
1102.3B4977436m37649q78229j519060j055729o03800m99584j399568o87363o13247
1111A7283207o57070j65524p42335n50187l97461J50701k65777k67676K89995J05178
1120.6A4783051M37538J53234L0696l35287L38992P97426N1718j0757j02791K25118
1130.3A6368938l9024k7660M5936j31954j20815l77435l71776p22658k48968k91948
$$ plain form
1064.7 39181137 38921619 38477955 38112949 38411541 38581348 37757961 36901558 37439629 37639320 37303482
1074.4 37303482 37394924 37421883 36914024 36449413 36558521 36405621 37075718 37528984 36591045 36454918
1084 36454918 36903160 37158371 37313545 37258873 36968918 36054413 35112438 35082489 34796806 34110756
1093.6 34110756 33665813 32519527 31491207 30520720 29383007 28780447 27994753 26522001 24977436
1102.3 24977436 24539787 23661558 22142498 21086769 20482969 19983385 18583817 17896454 17283207
1111 17283207 16626137 16460613 15718278 15168091 14770630 14921331 14655554 14387878 14677873 14783051
1120.6 14783051 15220589 15373823 15404519 15069232 15408224 16205650 16257368 16246611 16143820 16368938
1130.3 16368938 16329914 16302254 16348190 16216236 16095421 15717986 15346210 14623552 14374584 14082636
1139.9A4082636m93857r7970r6916k14429q77825o72977o24088l14838k8281p3898
1149.6A0587557J76671k12650P1461j95547j08340K00702Q611J88607L34114M35733
1159.2A1486919j05757J39940J34952L76346M93609L021O19063K82658K79865O13670
1168.9A4324286J182019J183614J63782M57649M53714N52052P24811P17945R21973
1177.5B0681845Q91027Q40693L98500N65783R14503Q82427R88230J133684O20205L41444
1187.2B8258341R38671R33866P46058L95908J47044L32508O37283R99390P62947L81946
1196.8C4533962K67296O86497Q97232M96025L17699N53990Q72295O66672J73645j04721
1206.5C9360592L91880Q35918N44579J87614R2133M14631L03951J83308K46418k0272
$$ plain form
1139.9 14082636 13588779 13490809 13393893 13179464 12301639 11628662 11004574 10689736 10661455 10587557
1149.6 10587557 10764228 10551578 10623039 10427492 10319152 10519854 10528465 10717072 11051186 11486919
1159.2 11486919 11381162 11521102 11656054 12032400 12526009 12529030 13148093 13430751 13710616 14324286
1168.9 14324286 15506305 16689919 16853701 17311350 17765064 18317116 19041927 19759872 20681845
1177.5 20681845 21572872 22413565 22812065 23377848 24292351 25174778 26163008 27296692 27916897 28258341
1187.2 28258341 29197012 30130878 30876936 31272844 31419888 31752396 32389679 33389069 34152016 34533962
1196.8 34533962 34801258 35487755 36384987 36881012 37198711 37752701 38624996 39291668 39465313 39360592
1206.5 39360592 39752472 40588390 41132969 41320583 41412716 41827347 42131298 42314606 42561024 42540752
1216.1D2540752P0095J71830K9056P6912K30858L311J01116M18476j17363m40612Q5701
1226.7D3170132M25392n0018j42933L25828M78443J35495m67930o8234L39710R1938
1236.4D4237823J915J6037R1855j32019o4633K09206K09140J31794L8926l8033l2333
1247D4669678L66k93240J3874L55435J68331K04407m3629p1899m677J03412K23969
1257.6D5326027k26704k7046M71417P2948k03693L8936K18991L78959J52287p2209
1267.2D6129913K5803j77204p2033K99076M06990J27876j8226L82721L74622J03855
1276.9D7583393K00638K50664J22741J71074K78050K41050J84460K14337K89157L43636
1286.5D9879200M73331L11112R6420J02509M3941J35647M02065M79321J43822p725
$$ plain form
1216.1 42540752 42610847 42782677 42811733 42888645 43119503 43122814 43223930 43642406 43525043 43084431 43170132
1226.7 43170132 43595524 43545506 43402573 43728401 44206844 44342339 43874409 43806175 44145885 44237823
1236.4 44237823 44239738 44255775 44347630 44215611 44150978 44360184 44569324 44701118 44740044 44702011 44669678
1247 44669678 44670044 44376804 44390678 44746113 44914444 45118851 45075222 45003323 44998646 45102058 45326027
1257.6 45326027 45099323 45072277 45543694 45616642 45412949 45451885 45670876 46049835 46202122 46129913
1267.2 46129913 46155716 45978512 45906479 46205555 46612545 46740421 46722195 47104916 47479538 47583393
1276.9 47583393 47784031 48034695 48157436 48328510 48606560 48847610 49032070 49246407 49535564 49879200
1286.5 49879200 50352531 50663643 50760063 50862572 50906513 51042160 51444225 51923546 52067368 52059643
1296.2E2059643K45300L43380J86108l5202o5476K11350L36391K03495J55670L5237
1305.8E3675896J51863J61915n1667J71402J18210J2329N6164J16753L25081L2321
1315.4E4770267j83395Q9233L09102J90944r4604r3716R1957K06585K59499K17762
1325.1E5763634K22931K03930k16290j54716l9509j05748L41481J47457j7048L9707
1334.7E6185829l52699k04548L43800K35694l20819j37089J11469J79833J20056n4020
1344.4E6107506L54297K46811l7246k62787l04611J55620n3367q7368O2129l3184p4016
1355E6073784j61503j40980k07931P5748J95645k49215l42102J28018J59824k15233
1364.6E5316055M685j37551l71158j02352J37283R4910k20467j23680N1727k91809
$$ plain form
1296.2 52059643 52304943 52648323 52834431 52799229 52733753 52945103 53281494 53484989 53640659 53675896
1305.8 53675896 53827759 53989674 53938007 54109409 54227619 54239948 54296112 54412865 54737946 54770267
1315.4 54770267 54586872 54676105 54985207 55176151 55081547 54987831 55079788 55286373 55545872 55763634
1325.1 55763634 55986565 56190495 55974205 55819489 55779980 55674232 56015713 56163170 56146122 56185829
1334.7 56185829 55833130 55628582 55972382 56208076 55887257 55750168 55861637 56041470 56161526 56107506
1344.4 56107506 56461803 56708614 56671368 56408581 56103970 56259590 56206223 56118855 56180984 56147800 56073784
1355 56073784 55912281 55771301 55563370 55639118 55834763 55585548 55243446 55371464 55531288 55316055
1364.6 55316055 55320740 55183189 54812031 54709679 54846962 54941872 54721405 54597725 54649452 54357643
1374.3E4357643o6845K15538j46366k11613M1855j97014k2205J97060k29039j12453
1383.9E3826561J62018P5374J16692K8606m3674J59801K07406K36473r037l08716l01090
1394.5E4150414j87974J95546K4727l03635P7892J63399o9332k6989J7704j16009o33
1405.1E3925110J52496l2558k23164k95681J8398Q7136J2172j5560j09386m9118k08645
1415.7E3261200j80370K5013l6000l90510l3264L85803L02925K12723L5991r0618J76518
1426.3E3669411K53109J21658J17741l4554j71512P6435K0996J930N1647j64364J19221
1437E4061718L17345J97132K07126K21272J77277L883o9176O4327K52362j9944l597
1447.6E5409725K45762K32262K52338j30054l10849L8060L50029J96613L53863Q8871
$$ plain form
1374.3 54357643 54290798 54506336 54359970 54148357 54190212 53993198 53970993 54168053 53939014 53826561
1383.9 53826561 53988579 54063953 54180645 54209251 54165577 54325378 54532784 54769257 54760220 54451504 54150414
1394.5 54150414 53962440 54157986 54182713 53879078 53956970 54120369 54051037 54024048 54041752 53925743 53925110
1405.1 53925110 54077606 54045048 53821884 53526203 53544601 53631737 53643909 53628349 53518963 53469845 53261200
1415.7 53261200 53080830 53105843 53069843 52679333 52646069 53031872 53334797 53547520 53583511 53492893 53669411
1426.3 53669411 53922520 54044178 54161919 54127365 53955853 54032288 54053284 54055214 54106861 53942497 54061718
1437 54061718 54379063 54576195 54783321 55004593 55181870 55185753 55116577 55180904 55433266 55413322 55409725
1447.6 55409725 55655487 55887749 56140087 56010033 55699184 55737244 56087273 56283886 56637749 56726620
1457.2E6726620j141781K40711M14742M31263L29460J80439J97620l59226J98059M01733
1466.8E7619640K65484L34686K40460J07265j8222M35604M67498J40286K2900R2701
1476.5E9708302L08933J36448K27451J09570k09984J45984L95138R8778m8523J26949
1486.1F0999046L08667K29244M4906k36084n24555K32044K98043j58261j53812j31691
1495.8F0907547k7924K83936q4930l64701k09629K159k06871m93061j04477r5791K25079
1506.4E9831337J04645o11458q5724j72417j07612k48425k45048j89587l28304k52201
1516E7695206m36066j01101J09554K3926j31401N8354o810k4463n1319n57759Q9550
1526.6E6667671K29943k65030k13547n9227j19999j83380l1693j93718k1450m5498
$$ plain form
1457.2 56726620 55584839 55825550 56240292 56671555 57001015 57181454 57379074 57019848 57217907 57619640
1466.8 57619640 57885124 58219810 58460270 58567535 58549313 58984917 59452415 59592701 59615601 59708302
1476.5 59708302 60017235 60153683 60381134 60490704 60280720 60426704 60821842 60920620 60872097 60999046
1486.1 60999046 61307713 61536957 61581863 61345779 60821224 61053268 61351311 61193050 61039238 60907547
1495.8 60907547 60879623 61163559 61078629 60713928 60504299 60506458 60299587 59806526 59702049 59606258 59831337
1506.4 59831337 59935982 59324524 59238800 59066383 58958771 58710346 58465298 58275711 57947407 57695206
1516 57695206 57259140 57158039 57267593 57291519 57160118 57218472 57211662 57187199 57135880 56578121 56667671
1526.6 56667671 56897614 56632584 56419037 56359810 56239811 56056431 56024738 55831020 55809570 55764072
1536.3E5764072k7660R2312J55357M88400n85549k55600o6070j37558j85860k06989
1545.9E5034855J67988Q0089k1827j22811k7126K33925L89404N21420O8916k97661
1555.6E6027172j41392o8218l29716k207878J625325J439308M84604M2400k49287k64744
1565.2E6357574K77333L62266L11909K55230q75729K6116K52376r1808L3989J15501
1574.9E7024757J61450n32814J19163O5358m28601k74483j21189m8389l4969M0420
1584.5E5970703j60133l13015j82083j47023k82219l76270n4977l31757l94646l73752
1594.1E3354828l80329n8457l05271k77862k71260j19335k78354n08050l45047l70742
1603.8E0440121k83734l81656n6118k35283l62389k99351m04129j53698l10424j042
$$ plain form
1536.3 55764072 55736412 55828724 55984081 56472481 55886932 55631332 55565262 55427704 55241844 55034855
1545.9 55034855 55202843 55282932 55261105 55138294 55111168 55345093 55734497 56255917 56324833 56027172
1555.6 56027172 55885780 55817562 55487846 53279968 54905293 56344601 56829205 56871605 56622318 56357574
1565.2 56357574 56634907 56997173 57309082 57564312 56688583 56714699 56967075 56875267 56909256 57024757
1574.9 57024757 57186207 56653393 56772556 56837914 56409313 56134830 56013641 55965252 55930283 55970703
1584.5 55970703 55810570 55497555 55315472 55168449 54886230 54509960 54454983 54123226 53728580 53354828
1594.1 53354828 52974499 52916042 52610771 52332909 52061649 51942314 51663960 51155910 50810863 50440121
1603.8 50440121 50156387 49774731 49718613 49483330 49120941 48821590 48417461 48263763 47953339 47952297
1613.4D7952297k81479l67550l34430j235459J59878P2277n9231k77256N0286J52004
1623.1D5831337l91769l61588n16239k01279k68917k9278j30695k67300o5033j49669
1632.7D3449570Q6605j4282p44080l77937N69111O3472k87029M1809j18713R3330p2529
1643.3D2689327m6631k9296J69918L66050m71271J97956R6771L31131M49146P83913
1653D4537014n60360p06501N41992L94867J41190O9069L08849J79573J60603K06661
1662.6D5272957k32266M39270M11000L62384J19774L3455M58908K83905M49795J79897
1672.3D7779079L70034K75814R0744K32685M08703N94417J02001J37326K70149L55846
1681.9E0616798L92285k95860K18326N76611N29846M19208M79100M24575M25011M00581
$$ plain form
1613.4 47952297 47670818 47303268 46968838 45733379 45893257 45965534 45906303 45629047 45679333 45831337
1623.1 45831337 45439568 45077980 44561741 44360462 44091545 44062267 43931572 43664272 43599239 43449570
1632.7 43449570 43536175 43521893 42777813 42399876 42968987 43032459 42745430 42787239 42668526 42761856 42689327
1643.3 42689327 42642696 42613400 42783318 43149368 42678097 42876053 42972824 43303955 43753101 44537014
1653 44537014 43976654 43270153 43812145 44207012 44348202 44417271 44726120 44905693 45066296 45272957
1662.6 45272957 45040691 45479961 45890961 46253345 46373119 46406574 46865482 47149387 47599182 47779079
1672.3 47779079 48149113 48424927 48515671 48748356 49157059 49751476 49853477 49990803 50260952 50616798
1681.9 50616798 51009083 50713223 50931549 51508160 52038006 52457214 52936314 53360889 53785900 54186481
1691.5E4186481K66377M19579K45773N33165O44726Q4728N14107M34360p812M42009
1701.2E7763493Q93001N50289K82570K35130L89622M15817L44861M59159J98449N7090
1710.8F1589481K85347L38654L17192J75911K60818J86573l38344k62661O18938L53943
1720.5F3525852K54574J97201l53005k16678L51509K64526J50032J29669J68404n7060
1730.1F4415024o7032L52707L76266J81244n16777L9437K97653R9472L34289N16167
1739.8F6028450k40791K2514K4399r2079M53094N00740J63613Q9790K24258K71843
1749.4F7445831M38027J48231j7219K79831J46995K04094L02445K75573M22608M24537
1759G0070953J27747q0208k33963P2563K51923J87889K05223J40968J53595N2788J27754
$$ plain form
1691.5 54186481 54452858 54872437 55118210 55651375 56296101 56380829 56894936 57329296 57321484 57763493
1701.2 57763493 58656494 59206783 59489353 59724483 60114105 60529922 60874783 61333942 61532391 61589481
1710.8 61589481 61874828 62213482 62530674 62706585 62967403 63153976 62815632 62552971 63171909 63525852
1720.5 63525852 63780426 63977627 63624622 63407944 63759453 64023979 64174011 64303680 64472084 64415024
1730.1 64415024 64347992 64700699 65076965 65258209 64741432 64780869 65078522 65177994 65512283 66028450
1739.8 66028450 65787659 65810173 65834572 65742493 66195587 66696327 66859940 66949730 67173988 67445831
1749.4 67445831 67883858 68032089 68014870 68294701 68441696 68645790 68948235 69223808 69646416 70070953
1759 70070953 70198700 70118492 69884529 69957092 70209015 70396904 70602127 70743095 70896690 70949478 71077232
1769.7G1077232L60329P1472n97915j02295L69651K0043J54251L75969j00174J5648
1779.3G1644211J90574n0582L1532K42058K58964k49977k99004J08109J41960J03897
1788.9G2121742J62712N4459M5525L2890j38229J74217K21618M2580L1288O8825n6618
1799.5G2761009j07284P4859l715P3868l022j29272k60M1054J20751J63589J11107
1810.2G3102684k9434O7703N1094j0467R4558J07354K79022J10031j01761r1110j58776
1820.8G3420898J07895J39862O9168J30921j35857j12510J27204J76697l2394l10364
1830.4G3581520J34132K51366J7456k8580M3595L8299q8363j5328J4374n8342J67641
1841G4057770J7448J4839o7947l70682K97966K09938J70182N1956l9360J89087L5965
$$ plain form
1769.7 71077232 71437561 71509033 70911118 70808823 71178474 71198517 71352768 71728737 71628563 71644211
1779.3 71644211 71834785 71784203 71815735 72057793 72316757 72066780 71767776 71875885 72017845 72121742
1788.9 72121742 72284454 72338913 72384438 72417328 72279099 72453316 72674934 72717514 72748802 72817627 72761009
1799.5 72761009 72653725 72728584 72724869 72798737 72795715 72666443 72666183 72707237 72827988 72991577 73102684
1810.2 73102684 73073250 73140953 73192047 73181580 73276138 73383492 73662514 73772545 73670784 73579674 73420898
1820.8 73420898 73528793 73668655 73737823 73868744 73732887 73620377 73747581 73924278 73891884 73581520
1830.4 73581520 73715652 73967018 73984474 73955894 73999489 74037788 73949425 73934097 73948471 73890129 74057770
1841 74057770 74075218 74090057 74022110 73651428 73949394 74159332 74329514 74381470 74342110 74531197 74567162
1851.6G4567162j78261o3896J50703O0120n9693j05324K1378J46912K662k5352j24954
1862.2G4391457M1450l7964k9205L47732J1696r2437n2864k13799P02J51893J35819
1872.8G4654480l2890l5477r4391M1451J45042L1136M0718O0135p1999j43074J75056
1883.4G4770187L9566j15326R9267M8866k4918k17987k09778M5250J76445J18912O1668
1894.1G4792152Q1017j05637r8076L8712K59827l1082k12815J06735J39214L5088k23336
1904.7G4781799R6787K77809j40465j45851j2161j084j77780p6973J19576J07666j7266
1915.3G4812057l1349J33942j67160j35979J35025M5975k5261m0642j04858q8143Q3603
1925.9G4617210O1959J41769M5372j26602K2110l136J1795o7695l2730P5866N2864
$$ plain form
1851.6 74567162 74388901 74325005 74475708 74535828 74476135 74370811 74392189 74539101 74541763 74516411 74391457
1862.2 74391457 74432907 74394943 74365738 74713470 74725166 74632729 74579865 74366066 74366768 74518661 74654480
1872.8 74654480 74621590 74586113 74491722 74533173 74678215 74709351 74750069 74810204 74738205 74595131 74770187
1883.4 74770187 74809753 74694427 74793694 74842560 74817642 74599655 74389877 74435127 74611572 74730484 74792152
1894.1 74792152 74873169 74767532 74669456 74708168 74967995 74936913 74724098 74830833 74970047 75005135 74781799
1904.7 74781799 74878586 75156395 75015930 74870079 74857918 74856834 74679054 74602081 74721657 74829323 74812057
1915.3 74812057 74780708 74914650 74747490 74611511 74746536 74792511 74767250 74726608 74621750 74533607 74617210
1925.9 74617210 74679169 74820938 74866310 74739708 74761818 74758682 74770477 74702782 74670052 74745918 74798782
1936.5G4798782P4334J0292o3637j92970q6113r5581N3222K43012r3109n2880Q3168
1947.1G4678520L8712M3884j0910N8716R9373j03882j50238q972j61164L6873K55173
1957.7G4776085Q9050N1087o1028o8046r6566l0105M4426n5184K7924O4209N0690j40420
1969.3G4652122o5628J94962l5309k48466k19109O0783J79039K0562R9968J4663k41577
1979.9G4412010j95503K9320J28227K6695K6619M2946p3112J3931k0310j48338P660
1990.5G4250145M7577l1433J9661J05491k8854p6965P6271K8305N9646k1621j57135
2001.1G4271088O233j0040j08323n8631k8107P3845J21658N4566j0888j50299r3757
2011.7G4067345P6156l662j01089M501K0165j33439L7613J15029j0872P9040Q5205
$$ plain form
1936.5 74798782 74873116 74883408 74819771 74626801 74540688 74445107 74498329 74741341 74648232 74595352 74678520
1947.1 74678520 74717232 74761116 74750206 74808922 74908295 74804413 74654175 74645203 74484039 74520912 74776085
1957.7 74776085 74865135 74916222 74855194 74787148 74690582 74660477 74704903 74649719 74677643 74741852 74792542 74652122
1969.3 74652122 74586494 74781456 74746147 74497681 74278572 74339355 74518394 74538956 74638924 74653587 74412010
1979.9 74412010 74216507 74245827 74374054 74400749 74427368 74470314 74397202 74411133 74390823 74242485 74250145
1990.5 74250145 74297722 74266289 74285950 74391441 74362587 74285622 74361893 74390198 74449844 74428223 74271088
2001.1 74271088 74277321 74267281 74158958 74100327 74072220 74146065 74267723 74322289 74311401 74161102 74067345
2011.7 74067345 74143501 74139839 74038750 74043251 74063416 73929977 73967590 74082619 74071747 74150787 74235992
2022.3G4235992q2443j71760K4574O7947K2538Q0352j4045p0046j43303l0838q423
2032.9G3910545o7268J4717L3196Q1764r0874p0999m5288m3694J15227k068M7417j03706
2044.5G3778969k47856m9546K0485Q1269J15158l2143j31737O6422Q8707R9029k0675
2055.1G3768082k97669j66343j9440J44432l28j10085N4871J190O4926J12984N249
2065.7G3557869k07275r3010J5083o279J12144n2162n7564j31515j06781P866o6155
2076.3G2972221N2880L0075j0689j85875j30585L9864K0592O4758j03851L9093J9287
2086.9G2807770j64742o1668Q972J10382R7969J31287k0836q7517j144R7152J50498
2097.5G3068123j97144j63681L8941Q8966J7342p7813R2927j1277r9724N6130J81869
$$ plain form
2022.3 74235992 74153549 73981789 74006363 74074310 74096848 74177200 74163155 74093109 73949806 73918968 73910545
2032.9 73910545 73843277 73857994 73891190 73972954 73882080 73811081 73765793 73722099 73837326 73835258 73882675 73778969
2044.5 73778969 73531113 73481567 73502052 73583321 73698479 73666336 73534599 73601021 73689728 73788757 73768082
2055.1 73768082 73470413 73304070 73284630 73429062 73428734 73318649 73373520 73374710 73439636 73552620 73557869
2065.7 73557869 73350594 73257584 73272667 73266388 73378532 73326370 73268806 73137291 73030510 73038376 72972221
2076.3 72972221 73025101 73055176 73044487 72858612 72728027 72767891 72788483 72853241 72749390 72788483 72807770
2086.9 72807770 72643028 72581360 72590332 72700714 72798683 72929970 72909134 72821617 72820473 72917625 73068123
2097.5 73068123 72870979 72707298 72746239 72835205 72852547 72774734 72867661 72856384 72756660 72812790 72994659
2108.1G2994659l3020j30279N7899j7456J30020O6796j4137J15112m5815M8867j0498
2118.7G3162148n6420R5139n2147k5948R255p5157N2612J0589k52182j65626J26999
2129.4G2829262J89026L6422q3534J2787O4987M990r8541j62247L952J60332J19278
2140G3076714p2701j32454K2812J02661K05170J57821j09809j10947N6045O0021j40274
2150.6G3115059j18973J43303R8030L9932j3221p4860J22566Q3443n4916j05965j03317
2161.2G3131081J09932R2216N4360J30683k3552q8577o1165l7628j9386r16L0800r7946
2172.8G3219902l4340R1759k6245q9630m6654m6066p2388K21092K06246k31484j9409
2183.4G3172783K01172q8982j92634J4724J85799J45424K7511Q759L1219k1331K3597
$$ plain form
2108.1 72994659 72961639 72831360 72889259 72871803 73001823 73068619 73054482 73169594 73123779 73172646 73162148
2118.7 73162148 73105728 73200867 73148720 73122772 73132027 73056870 73109482 73120071 72867889 72702263 72829262
2129.4 72829262 73018288 73054710 72971176 72983963 73048950 73053940 72955399 72793152 72797104 72957436 73076714
2140 73076714 73004013 72871559 72894371 72997032 73202202 73360023 73250214 73139267 73195312 73255333 73115059
2150.6 73115059 72996086 73139389 73237419 73277351 73264130 73189270 73311836 73395279 73340363 73234398 73131081
2161.2 73131081 73241013 73333229 73387589 73518272 73494720 73406143 73344978 73307350 73287964 73287048 73317848 73219902
2172.8 73219902 73185562 73277321 73251076 73161446 73114792 73068726 72996338 73217430 73423676 73192192 73172783
2183.4 73172783 73373955 73284973 73092339 73107063 73292862 73438286 73465797 73474556 73505775 73484444 73508041
2194G3508041K5345l8528o058K9068J3802j3756J28860M3968n9036N1247L9009J29257
2205.5G3851219N379q5907N1948J03600J6342j49093k114p7484j43570J29326J56082
2216.1G3855728J12389M135p6119m4403j7028M3510J46362J08422o5361q9890j18339
2226.8G3859406M3548J18233r0676m0008k7023j00686k3475l8l5881O5719P0595l6934
2238.3G3802780N9082J26526P6958q6029j44829j7471k4163n1017j8746P4143P1693
2248.9G3868927n5740K266Q0551n11q7922j30081K1538J26846o759N4397J7235n4001
2260.5G3836746J10024L4240r9128j8189J27457K2049m1260J07178P9185j0353q5785
2271.1G4062164P0412N0301k42615j46401O485J1086O5254J31630k8931k18299r2621
$$ plain form
2194 73508041 73533386 73494858 73488800 73517868 73531670 73517914 73646774 73690742 73631706 73682953 73721962 73851219
2205.5 73851219 73856598 73770691 73822639 73926239 73942581 73793488 73791374 73713890 73570320 73699646 73855728
2216.1 73855728 73968117 73972252 73896133 73851730 73834702 73878212 74024574 74132996 74067635 73977745 73859406
2226.8 73859406 73902954 74021187 73930511 73890503 73863480 73762794 73739319 73739281 73703400 73769119 73839714 73802780
2238.3 73802780 73861862 73988388 74065346 73979317 73834488 73817017 73792854 73741837 73723091 73797234 73868927
2248.9 73868927 73813187 73815453 73896004 73895493 73807571 73677490 73699028 73825874 73819115 73873512 73890747 73836746
2260.5 73836746 73946770 73981010 73881882 73863693 73991150 74013199 73971939 74079117 74158302 74147949 74062164
2271.1 74062164 74132576 74182877 73940262 73793861 73800346 73811432 73876686 74008316 73979385 73761086 73668465
2281.7G3668465K06474K24579q7776q5526M1710J23360J27128r3170q0330R6321R8206
2292.3G4239441r6489j7136N143j20110J95641J07307j44852R5322J83388j8936k7794
2302.9G4400925P1815q9767n9853L7666R3392K32857J17500q354j33599j68365m9996
2313.5G4444221O5987L34335M63540J41052k57927j63452K19742K69836J07780n2002
2323.2G5573112j94412K3751K23053o073J99760L60344k12235k89642K4162K15950
2332.8G5917770J06980j23574N29068N76317j21200k75177p83676k72553K23534j24070
2342.5G5653419M62517N21035k64344p41195l46627K35504L18490K28355R0340K97073
2352.1G6454567K00905K98736M56910j20545p2143l62053J99752R83513L31581n24589
$$ plain form
2281.7 73668465 73874939 74099518 74011742 73926216 73967926 74091286 74218414 74125244 74044914 74141235 74239441
2292.3 74239441 74142952 74125816 74130959 74010849 74206490 74313797 74168945 74264267 74447655 74428719 74400925
2302.9 74400925 74472740 74382973 74323120 74360786 74454178 74687035 74804535 74796181 74662582 74494217 74444221
2313.5 74444221 74510208 74844543 75308083 75449135 75191208 75027756 75247498 75517334 75625114 75573112
2323.2 75573112 75378700 75402451 75625504 75619431 75819191 76179535 75967300 75677658 75701820 75917770
2332.8 75917770 76024750 75901176 76430244 77006561 76885361 76610184 75826508 75553955 75777489 75653419
2342.5 75653419 76115936 76636971 76372627 75631432 75284805 75520309 75838799 76067154 76157494 76454567
2352.1 76454567 76655472 76954208 77411118 77290573 77218430 76856377 77056129 78039642 78371223 77846634
2361.8G7846634j016007m96231R5940P87796L20488m76173j49506m01817l87856j61156
2371.4G5962112m5486P1625j63079j01326j58851l44597q0040R8633k6474j44051j99783
2382G4868683j37421j19644j34514N4001O6284q9653k418R8007j3870r5024k8359N1407
2393.6G4517479O8832m5715j28120L4591J77750o9595j68381J24946J5061j66954K1675
2404.2G4381569J06033J5961m5853N6969J00487n9967j18561q4282r0714L3600P0015
2414.8G4365257n0567m3656k9075P0663J64307N2337r1980j23275k5338j7776j28983
2425.4G4141914l5125K22953J15151m7028o0417j71699o7070p8751m7035K41813J81519
2436G4396225j76102k04841J13929J5381r2178N7968J47965J86477j12755k66967j12725
$$ plain form
2361.8 77846634 76830627 76334396 76430336 77218132 77538620 77062447 76912941 76511124 76123268 75962112
2371.4 75962112 75916626 75988251 75825172 75723846 75564995 75220398 75140358 75238991 75212517 75068466 74868683
2382 74868683 74731262 74611618 74477104 74531105 74597389 74507736 74505318 74603325 74589455 74494431 74466072 74517479
2393.6 74517479 74586311 74540596 74412476 74447067 74624817 74555222 74386841 74511787 74526848 74359894 74381569
2404.2 74381569 74487602 74503563 74457710 74514679 74615166 74555199 74436638 74352356 74261642 74295242 74365257
2414.8 74365257 74314690 74271034 74241959 74312622 74476929 74529266 74437286 74314011 74288673 74270897 74141914
2425.4 74141914 74106789 74329742 74444893 74397865 74337448 74165749 74098679 74019928 73972893 74214706 74396225
2436 74396225 74220123 74015282 74129211 74144592 74052414 74110382 74258347 74444824 74332069 74065102 73952377
2446.6G3952377N7091M906r1034Q850n0667N8403R2384m1313o4491j00182L4554J2032
2458.2G3872910p370L1379m5761N081m2556m1672N8693o439r1027p9613k5939j4290
2469.8G3613396n0164o294L97o1569L1166P6881K7733M5128N6763m9088q2565O8832
2481.3G3670616K9175r6542j58181r5192R5231J25831N8357j9333P3227R4162j90528
2492G3586823k23801N0056N5222j03935n013l7765j64887j87042j24062K41661L53890
2502.6G3441147N0186j22139q0818k7573J8051Q126p8919p7034n8792J17287J35986
2513.2G3325508j15265p1342J0628L242K060r682j41250k63626o981J32331R8679J14838
2524.7G3079140J3237n1285j16654n7731O4155p0274j04042J01807J68289L0067q3938
$$ plain form
2446.6 73952377 74009468 74014374 73923340 73932190 73881523 73939926 74032310 73990997 73926506 73826324 73860878 73872910
2458.2 73872910 73865540 73896919 73851158 73856239 73813683 73772011 73830704 73824265 73733238 73653625 73627686 73613396
2469.8 73613396 73563232 73556938 73557335 73495766 73526932 73603813 73631546 73676674 73733437 73684349 73601784 73670616
2481.3 73670616 73699791 73603249 73445068 73349876 73445107 73570938 73629295 73609962 73683189 73777351 73586823
2492 73586823 73363022 73413078 73468300 73364365 73359352 73321587 73156700 72969658 72845596 73087257 73441147
2502.6 73441147 73491333 73369194 73288376 73260803 73278854 73286980 73208061 73131027 73072235 73189522 73325508
2513.2 73325508 73210243 73138901 73149529 73152771 73154831 73145149 73003899 72740273 72733292 72865623 72964302 73079140
2524.7 73079140 73092377 73041092 72924438 72866707 72930862 72860588 72756546 72858353 73026642 73056709 72972771
2535.4G2972771r3277n2483j7090m0123J8334O3385l5721k4674k7534q1574M151M6524
2546.9G2732689l8742r9838q1833m5517M5799J20155J04363O2111K7107p8690j08017
2557.5G2639587P5562l3264j11939M654j22955l7636N3650M4647L4630j31454p4768
2568.1G2340714j900q591O5392Q7181p7713j96328M6143J34979j1413j07361j36536
2578.7G2134567N5962J14746j3168N615k6718m7150k1622n9745m2313m5761O7200R8281
2590.3G2219894p0381j03111n0217R5352M9691l1258N2109j60813l12263p3242J97716
2600.9G1813477J52778R354k5147p2517k541j3000j31897o9588j9859M1382J80046
2611.5G1862488p7477k95288n1849J44211J22108j41914j33858j7525l4279J17539
$$ plain form
2535.4 72972771 72879494 72827011 72809921 72769798 72788132 72851517 72815796 72791122 72763588 72682014 72686165 72732689
2546.9 72732689 72693947 72594109 72512276 72466759 72512558 72632713 72737076 72799187 72826294 72747604 72639587
2557.5 72639587 72715149 72681885 72569946 72574600 72451645 72414009 72467659 72512306 72546936 72415482 72340714
2568.1 72340714 72338814 72330223 72395615 72482796 72405083 72208755 72254898 72389877 72378464 72271103 72134567
2578.7 72134567 72190529 72305275 72292107 72297722 72271004 72223854 72202232 72142487 72100174 72054413 72121613 72219894
2590.3 72219894 72149513 72046402 71996185 72091537 72141228 72109970 72162079 72001266 71689003 71615761 71813477
2600.9 71813477 71966255 71975609 71950462 71877945 71875404 71862404 71730507 71660919 71641060 71682442 71862488
2611.5 71862488 71785011 71489723 71437874 71582085 71704193 71562279 71428421 71410896 71376617 71494156
2621.2G1494156j5122r6687k7412Q8470M4159k28500j23207j47904l9772J86722O9954
2631.8G1204857L387n2124L0747n2361j63345l2097P1281O4217j36375j58753o0745
2642.4G0718689L2158J02577N2712m6219r8969k4910n9631p10L5637q4686L6652J16333
2654G0779633j35048l00225j12037O0547J47796M9179o8252N706j02241l0342M4281
2664.6G0338997l9414R7558n6023k10114l6079o6124L3852J52435l8719k1370j02226
2675.2G0052773p4059J81465l0907j89353q8784R583m7562q8951K1606o652J24443
2685.8F9863602J06643j19186j15952l4278m2504j01356N4077M4723j16233K6474R9945
2696.4F9665955j18943j05636J28883J1986o4659j3909j7204k685j38413j82281o2203
$$ plain form
2621.2 71494156 71479034 71382347 71354935 71443405 71487564 71259064 71135857 70987953 70948181 71134903 71204857
2631.8 71204857 71208244 71156120 71186867 71134506 70971161 70939064 71010345 71074562 70938187 70779434 70718689
2642.4 70718689 70750847 70853424 70906136 70859917 70760948 70736038 70676407 70675697 70711334 70626648 70663300 70779633
2654 70779633 70644585 70344360 70232323 70292870 70440666 70489845 70421593 70427299 70325058 70294716 70338997
2664.6 70338997 70299583 70397141 70341118 70131004 70094925 70028801 70062653 70215088 70176369 70154999 70052773
2675.2 70052773 69978714 70160179 70129272 69939919 69851135 69860718 69813156 69724205 69745811 69739159 69863602
2685.8 69863602 69970245 69851059 69735107 69700829 69658325 69556969 69611046 69655769 69539536 69566010 69665955
2696.4 69665955 69547012 69441376 69570259 69582245 69517586 69503677 69486473 69483788 69345375 69163094 69100891
2707F9100891J34064P0381j08467R476J6067j0109J7304o1608m6600k4147j20087q4549
2718.6F8892616O2874N943j30157j2100Q0139r9304r4178j05354j11099P5401P927
2729.2F8572708O9145O5575j23810p0480l0632k457j08276r3209J26259R301j12320
2739.8F8301804O3537P1724j04339m9241L4897k7313n3200J183l0762r5497k3712n150
2751.4F8083931o6292o5285Q4023L6819o9961J9585j34133j74843n096N5572o3224
2762F7701096q0956N3078r0988R582J03111p7179m6249L975L4370j0948r8678j29753
2773.5F7370461k3041k0684J3825J08078k09610j68190p2693j49628Q9020P0946p7477
2784.2F6931007j92413k1927R1667j30890p1937m662M8867m4770j17897P0015n7983
$$ plain form
2707 69100891 69234955 69305336 69196869 69206345 69222412 69212303 69229607 69167999 69121399 69097252 68977165 68892616
2718.6 68892616 68955490 68961433 68831276 68819176 68899315 68800011 68705833 68600479 68489380 68564781 68572708
2729.2 68572708 68641853 68707428 68583618 68513138 68482506 68480049 68371773 68278564 68404823 68414124 68301804
2739.8 68301804 68365341 68437065 68332726 68283485 68318382 68291069 68237869 68239052 68208290 68112793 68089081 68083931
2751.4 68083931 68017639 67952354 68036377 68073196 68003235 68022820 67888687 67713844 67708748 67764320 67701096
2762 67701096 67620140 67673218 67582230 67591812 67694923 67617744 67571495 67575470 67609840 67598892 67500214 67370461
2773.5 67370461 67347420 67326736 67340561 67448639 67239029 67070839 66998146 66848518 66937538 67008484 66931007
2784.2 66931007 66738594 66716667 66808334 66677444 66605507 66600845 66649712 66604942 66487045 66557060 66499077
2794.8F6499077j23490N3238L2311j22612j18248m8576o5133j7288q6677j08078J5228
2805.4F5909752q6372j43822J5175J6098r2629o6948n0209K0516M4799j85897k38991
2816F5141472p6042J1970L2433L296r7054j97098j06887j4740o905l3196j36947o5033
2827.6F4455269n8693j26564J2855K1195j2245J068o9390q9294j85860k81952k09632
2838.2F3456757j77643j86115j82087j51307k3803j18027l05016k13630j63475k40582
2847.8F1695072l33885l37128j82342r0790M2610Q8532j36879j37246j8547o1672M5216
2858.4F0572941J32927N5115o8158j79443n8575q373j46782j66065j02432J0879o7085
2869E9974949k11887p3517N9070N7160j24031k32655k8984p9338j45104K9091k5188
$$ plain form
2794.8 66499077 66375587 66428825 66461136 66338524 66220276 66171700 66106567 66089279 66002602 65894524 65909752
2805.4 65909752 65823380 65679558 65694733 65710831 65618202 65551254 65501045 65521561 65566360 65380463 65141472
2816 65141472 65065430 65077400 65109833 65113129 65016075 64818977 64712090 64697350 64690445 64657249 64520302 64455269
2827.6 64455269 64396576 64270012 64282867 64304062 64291817 64292885 64223495 64134201 63948341 63666389 63456757
2838.2 63456757 63279114 63092999 62910912 62759605 62735802 62617775 62312759 62099129 61935654 61695072
2847.8 61695072 61361187 61024059 60841717 60750927 60793537 60882069 60745190 60607944 60589397 60527725 60572941
2858.4 60572941 60705868 60760983 60692825 60513382 60454807 60446434 60299652 60133587 60031155 60042034 59974949
2869 59974949 59763062 59689545 59748615 59805775 59681744 59449089 59420105 59340767 59195663 59224754 59199566
2879.6E9199566M1294O2286k19059k02297m7565l0453j20491k45205j25313N1769r19
2890.2E8363613j05488q2973j8833p9125k10750j37719k7332j30539j00998O7295J4138
2900.8E7551289j93222k38438l5843N0350r4234j13686r5722j68289j23596l6030l0060
2911.4E6472519r9846m2755M768k66426l28735r0706K3323Q8165K2728j87103k35115
2922.1E5360817j73317L1532J90522n8804p5882l7300j01433P7404q8055n6011J51467
2932.7E5220940J00475J70441R1350P084l2352K1751M2797j5064P5882j2932J27995
2943.3E5798367K42878k320p5439m5113l1898p9163L7144J64402O2858j8917k4795
2953.9E6028004j40541k98085m4101K05005N8094j72905j03943J55892P1224o7253
$$ plain form
2879.6 59199566 59240860 59303146 59084087 58881790 58834225 58803772 58683281 58438076 58312763 58364532 58363613
2890.2 58363613 58258125 58175152 58156319 58077194 57866444 57728725 57701393 57570854 57469856 57537151 57551289
2900.8 57551289 57358067 57119629 57083786 57134136 57039902 56926216 56830494 56662205 56538609 56502579 56472519
2911.4 56472519 56372673 56329918 56334686 56068260 55739525 55648819 55672142 55760307 55783035 55595932 55360817
2922.1 55360817 55187500 55219032 55409554 55350750 55274868 55237568 55136135 55213539 55125484 55069473 55220940
2932.7 55220940 55321415 55491856 55583206 55590290 55557938 55579689 55622486 55607422 55683304 55670372 55798367
2943.3 55798367 56041245 56038925 55963486 55918373 55886475 55807312 55844456 56008858 56071716 56052799 56028004
2953.9 56028004 55887463 55589378 55545277 55750282 55808376 55635471 55531528 55687420 55758644 55691391
2963.5E5691391n7476Q0151J92981N3467q7486j7479K75593K92785P6050l1155j3004
2974.1E6455818J13037J26763J84139J84750J42639J66385O6643K3739L5038R7942
2983.8E7596893J44463Q8512N8277N5443O2084M9080O6471J47709J46763p252n2471
2994.4E8355972l7033l341J40140K5543r1297M2957J19908J27922P156j18736j04656
3005E8464535l9593Q3282L7606j8429J44943O3526j08368j45820j24989Q8688J59561
3015.6E8604942K9251j36051k35988j10218J09592K6875k35428j8544J22029o3572
3025.2E8092888p7240j23772j14906l632K4372n0003j4660k9247n6957J23348j22295
3035.9E7647896k76470p6939q7318J3801K3110j56102j44504P477J4026r3345j38371
$$ plain form
2963.5 55691391 55633915 55714066 55907047 55960514 55873028 55855549 56131142 56423927 56499977 56468822 56455818
2974.1 56455818 56568855 56695618 56879757 57064507 57207146 57373531 57440174 57463913 57498951 57596893
2983.8 57596893 57741356 57829868 57888145 57943588 58005672 58054752 58121223 58268932 58415695 58408443 58355972
2994.4 58355972 58318939 58315598 58455738 58481281 58389984 58432941 58552849 58680771 58687927 58569191 58464535
3005 58464535 58424942 58508224 58545830 58527401 58672344 58735870 58627502 58481682 58356693 58445381 58604942
3015.6 58604942 58634193 58498142 58262154 58151936 58261528 58288403 58052975 58034431 58156460 58092888
3025.2 58092888 58015648 57891876 57776970 57773338 57797710 57747707 57733047 57703800 57646843 57770191 57647896
3035.9 57647896 57371426 57294487 57207169 57220970 57244080 57087978 56943474 56950951 56964977 56871632 56733261
3046.5E6733261r3899M0760m192o7253j27163k70271o3454K02137Q2047j96633k06779
3057.1E6028561m8661n7289j28696j98647j28422O3900J04043K5222r5276j38755l1559
3067.7E5394421k6955k2778Q9043l6606j62689j06182p8430j6972o2752j08886l1357
3078.3E4829857l0422q0155j14605N2937P6145j18561l9692n0087j40655j80462q8585
3088.9E4115715J44955n5172j59943m2313j38389j20834j0014K6356P568J980j32855
3099.5E3637054j31099m5731l8978O5761j82831j94709k1962j77604j30844j5130O7532
3110.1E2831459j6178q3832o3869j13682r6127q6227K6382j25145k38884n7479o104
3120.7E1970314m1744q6018j9798j37882j70987j12396r4406M2229l1971k9377j78707
$$ plain form
3046.5 56733261 56639362 56680122 56675930 56608677 56481514 56211243 56147789 56349926 56431973 56235340 56028561
3057.1 56028561 55979900 55922611 55793915 55595268 55466846 55530746 55634789 55660011 55564735 55425980 55394421
3067.7 55394421 55367466 55344688 55433731 55397125 55234436 55128254 55049824 55032852 54970100 54861214 54829857
3078.3 54829857 54799435 54719280 54604675 54657612 54733757 54615196 54575504 54525417 54384762 54204300 54115715
3088.9 54115715 54260670 54205498 54045555 54003242 53864853 53744019 53734005 53760361 53767929 53769909 53637054
3099.5 53637054 53505955 53460224 53421246 53487007 53304176 53109467 53087505 52909901 52779057 52763927 52831459
3110.1 52831459 52815281 52731449 52667580 52553898 52457771 52371544 52397926 52272781 52033897 51976418 51970314
3120.7 51970314 51928570 51842552 51822754 51684872 51513885 51401489 51307083 51349312 51317341 51287964 51109257
3131.3E1109257j73474J2539j95080n3691P3372j14663k26600j56433R845r4570j68346
3141.9E0022156l1433j1200k30919k06558j1670j11202j21479J6174O2287n1384j65157
3152.5D9159615j34850r1545q0616j79688k51392q5812J8136r8740r6855j08887p5787
3163.1D7973579L2277j02963j00403q6899j69181j46172q9210K3914o2779j44294p0073
3173.8D7057796j08337j98101j16634m7242j08814p1678j83777j90838k6230n2852
3183.4D5953293n5092j02062j36898j17871j10591o2111m9332j06064j47251l9040
3193D5026981k3143r4220j10466o3243k5403o1649k0874j44558k10693j79726k00981
3203.6D3892025M8210Q9840q5625j69517j89304k8119j7784j39728j43112o5377o9679
$$ plain form
3131.3 51109257 50935783 50948322 50753242 50699551 50772923 50658260 50431660 50275227 50285072 50190502 50022156
3141.9 50022156 49990723 49979523 49748604 49542046 49530376 49419174 49297695 49313869 49376156 49324772 49159615
3152.5 49159615 49024765 48933220 48852604 48672916 48421524 48335712 48353848 48255108 48158253 48049366 47973579
3163.1 47973579 48005856 47902893 47802490 47715591 47546410 47400238 47311028 47334942 47272163 47127869 47057796
3173.8 47057796 46949459 46751358 46634724 46587482 46478668 46406990 46223213 46032375 46006145 45953293
3183.4 45953293 45898201 45796139 45659241 45541370 45430779 45368668 45319336 45213272 45066021 45026981
3193 45026981 45003838 44909618 44799152 44735909 44710506 44648857 44627983 44483425 44272732 44093006 43892025
3203.6 43892025 43940235 44030075 43944450 43774933 43585629 43557510 43539726 43399998 43256886 43191509 43121830
3214.3D3121830j61549r3586q2714l7346L9063j65554j87565n6286j12549j67644j25374
3224.9D1970726K247J9943l6796K6741l3246k12932j31325L3199J9093p0492k05555
3235.5D1381603k43397j33163N3623L3428j04236q8429k25631p0374J46221n5389r9117
3246.1D0595139j10581j23978j66389r2873K9393j03611j8979q4537j74713p794j2382
3256.7C9728695Q556r9094j70353k8172L6377O7524q3870k84397j46763M4278P6507
3267.3C9149288r6824k20253P9006J9592k37530j08177n4245K0569l0205p1991L3623
3277.9C8482853P080j11031k11750k9125J5053j02051j12095k3636J07525n7232j84204
3288.5C7781387j74472k3915J69937Q6254q5193j19293Q831o9062j33403j26809j41388
$$ plain form
3214.3 43121830 42960281 42866695 42783981 42746635 42785698 42620144 42432579 42376293 42263744 42096100 41970726
3224.9 41970726 41972973 41992916 41956120 41982861 41949615 41736683 41605358 41638557 41657650 41587158 41381603
3235.5 41381603 41138206 41005043 41058666 41092094 40987858 40899429 40673798 40603424 40749645 40694256 40595139
3246.1 40595139 40484558 40360580 40194191 40101318 40130711 40027100 40008121 39923584 39748871 39741077 39728695
3256.7 39728695 39737251 39638157 39467804 39439632 39476009 39543533 39459663 39175266 39028503 39072781 39149288
3267.3 39149288 39052464 38832211 38911217 38930809 38693279 38585102 38530857 38551426 38521221 38449230 38482853
3277.9 38482853 38489933 38378902 38167152 38138027 38153080 38051029 37938934 37915298 38022823 37965591 37781387
3288.5 37781387 37606915 37583000 37752937 37839191 37753998 37634705 37643536 37574474 37441071 37314262 37172874
3299.1C7172874M8417M6241k4868q2138j86065j24024K8671N8785m8195q6571j52778
3309.7C6650349j01181m6650n7667k4670j55288j34137l017M4731k9518j28780l8567
3320.3C5975605N3886j0395j99199p2090M2011j79302j50200k1984o9203k25426j74552
3330.9C4969151O3552N7919m12j3046q5938r1392k8099m1829j54209k02205r3232p423
3342.5C4372837m5551m2378J904q7158j35430K5414j00151k91233j33133r3075o3000
3353.1C3409046n7514j00582K1343K7371O118q8150k04372j04263p1293j03592l4523
3363.7C2699589j595j11614k23904j63940j1860J5522r2529r2373L2436j0135r6074
3374.3C1943523n1498r2754j09517j31773j34256L2831k9649j61183O2353J70765j05396
$$ plain form
3299.1 37172874 37221291 37267532 37242664 37160526 36974461 36850437 36879108 36937893 36889698 36803127 36650349
3309.7 36650349 36549168 36502518 36444851 36420181 36264893 36130756 36127739 36172470 36142952 36014172 35975605
3320.3 35975605 36029491 36019096 35819897 35747807 35789818 35610516 35460316 35438332 35369129 35143703 34969151
3330.9 34969151 35032703 35090622 35090210 35077164 34991226 34899834 34871735 34829906 34675697 34473492 34380260 34372837
3342.5 34372837 34327286 34284908 34286812 34199654 34064224 34089638 33989487 33698254 33565121 33472046 33409046
3353.1 33409046 33351532 33250950 33272293 33299664 33305782 33217632 33013260 32908997 32837704 32734112 32699589
3363.7 32699589 32697994 32586380 32362476 32198536 32186676 32202198 32109669 32017296 32049732 32039597 31943523
3374.3 31943523 31892025 31799271 31689754 31557981 31423725 31456556 31426907 31265724 31328077 31498842 31393446
3384.9C1393446j42532n711p2912j09886j03049M4567J62272J2976k35825k83468j5019
3395.6C0644859J25737m633j45487q7237q333n4167o9816o8871J33806Q1885j38014
3406.2C0409729M648j4942k9545K1307p7802K1410P7581j15358n0963J07342j70771
3416.8C0182636k47596O9597J67541Q6729P0580J8528j33598p6848N7648M0928r6624
3427.4C0139521j55167Q5365R9047l8874J0002p2305k3319O1563L172J30739k0696
3438C0219048j38186K04924J41637q4369q803J19370L8944j73120l4064L3453L0978
3448.6C0349812J73044J16110J24698N1977o1771K1410O4705M4733K098O9271J39608
3459.2C1095695M0331k8242J5486L0163N4558P5893J43219K54042J3271j29225j440
$$ plain form
3384.9 31393446 31250914 31245203 31172291 31062405 30959356 31003923 31166195 31179171 30943346 30659878 30644859
3395.6 30644859 30770596 30765963 30620476 30533239 30524906 30470739 30400923 30332052 30465858 30547743 30409729
3406.2 30409729 30414377 30399435 30369890 30391197 30313395 30334805 30412386 30297028 30246065 30353407 30182636
3416.8 30182636 29935040 30004637 30172178 30258907 30329487 30348015 30214417 30137569 30195217 30236145 30139521
3427.4 30139521 29984354 30069719 30168766 30129892 30139894 30067589 30044270 30105833 30109005 30239744 30219048
3438 30219048 30080862 30285786 30427423 30343054 30334251 30453621 30492565 30319445 30285381 30318834 30349812
3448.6 30349812 30522856 30638966 30763664 30815641 30753870 30775280 30839985 30884718 30886816 30956087 31095695
3459.2 31095695 31136026 31107784 31123270 31153433 31207991 31283884 31427103 31681145 31694416 31565191 31563751
3469.8C1563751r6613M3755K68589J22576M3718R2741J18435N0415N4699J49460j04489
3480.4C2307037j46320J75865J40476M3087J28224K08488Q7841j8005j4526n1285J32328
3491C2993210K41936P9196j4648J61312K68910R2792L7247l1361j0280J22486J01417
3501.6C4042217M2393p713J3405O9633K36748K07084O8688j770j17111J42727K45716
3512.2C4942017R2575P0701Q9226O5617m917R0476Q5507Q9134K22592J05785r2304
3522.9C5756409l7365K14790K20036L8662K5096J50551J77258K18639J11580j5213
3532.5C6860443J27525N6767L2120N3142R0908K34986J45492J57616J01955O2218p957
3543.1C7915215L574K11216O2790J63715R5421K6485J88286K26170L60348J98749J13472
$$ plain form
3469.8 31563751 31467138 31510893 31779482 31902058 31945776 32038517 32156952 32207367 32262066 32411526 32307037
3480.4 32307037 32160717 32336582 32477058 32520145 32648369 32856857 32944698 32926693 32912167 32860882 32993210
3491 32993210 33235146 33314342 33299694 33461006 33729916 33822708 33859955 33828594 33818314 33940800 34042217
3501.6 34042217 34084610 34076897 34090302 34159935 34396683 34603767 34672455 34670685 34553574 34696301 34942017
3512.2 34942017 35034592 35105293 35194519 35260136 35255219 35345695 35431202 35520336 35742928 35848713 35756409
3522.9 35756409 35719044 35933834 36153870 36192532 36217628 36368179 36545437 36764076 36875656 36860443
3532.5 36860443 36987968 37044735 37076855 37129997 37220905 37455891 37601383 37758999 37860954 37923172 37915215
3543.1 37915215 37918789 38130005 38192795 38356510 38451931 38478416 38666702 38892872 39253220 39451969 39565441
3553.7C9565441M3770N6522J96942K6870N4532J38759J60099P8423K18956K94769K14985
3564.3D1050068L97068R7744M2984p3982k16999K04300O0432J42746K67261K85874
3574D2257496L37654K13276O9366J12137L60790P2846r640K89826L55068L90426J43685
3584.6D4592930J28639l7514J053K75936j70456K61475M70547L25855J40758P4097
3594.2D6063320M65393J85276J11004K76516N4245K47822K22557K06718L38143K24220
3603.9D8395214J36040J25915P5302K7222N26852J72928j18401N82825K53837L8811
3613.5E0216545L81027j4457L01262L39489O5040M09866K50779L6754L51876M92107
3623.1E2830288L40748J82178P0938K03682N63794K10445m44496L12515M03389M50371
$$ plain form
3553.7 39565441 39609211 39665733 39862675 39889545 39944077 40082836 40242935 40321358 40540314 40835083 41050068
3564.3 41050068 41447136 41544880 41587864 41513882 41296883 41501183 41561615 41704361 41971622 42257496
3574 42257496 42595150 42808426 42877792 42989929 43350719 43423565 43413925 43703751 44058819 44449245 44592930
3584.6 44592930 44721569 44684055 44685108 44961044 44790588 45052063 45522610 45848465 45989223 46063320
3594.2 46063320 46528713 46713989 46824993 47101509 47155754 47403576 47626133 47832851 48170994 48395214
3603.9 48395214 48531254 48657169 48732471 48759693 49286545 49459473 49341072 49923897 50177734 50216545
3613.5 50216545 50597572 50583115 50884377 51223866 51288906 51698772 51949551 51986305 52338181 52830288
3623.1 52830288 53171036 53353214 53424152 53627834 54191628 54402073 53957577 54270092 54673481 55123852
3632.8E5123852K78431K1160K80784M75129M10846J74290J98898J53843J30314K69062
3642.4E7516609J40488K37232M86954O41197J40842N928P87873j22853m96955M1343
3652.1E9378658L91671L84616N00862O83880o28067k0961M25605Q5484L24001L04913
3661.7F1830662K58865J01669K39491L18947K6085K82989K60803L69751J71441j029416
3671.4F2831287J70166R05976R15889J62278j360409j04904O16680M86610j79176L6789
3681F4481186L00659K66579K29698R1598M8241L46642R48509j92917q76930P01591
3690.6F6344856k05192n20272K90177J85150K14233J90720J9875j00655k04987J47156
3700.3F6361061K96677l28911Q3443N53321K4170q3091O4689L14217N31196n73913
$$ plain form
3632.8 55123852 55402283 55423443 55704227 56179356 56590202 56764492 56963390 57117233 57247547 57516609
3642.4 57516609 57657097 57894329 58381283 59022480 59163322 59169250 59957123 59834270 59337315 59378658
3652.1 59378658 59770329 60154945 60655807 61339687 60711620 60690659 61116264 61201748 61525749 61830662
3661.7 61830662 62089527 62191196 62430687 62749634 62775719 63058708 63319511 63689262 63860703 62831287
3671.4 62831287 63001453 63907429 64823318 64985596 63625187 63520283 64136963 64623573 64444397 64481186
3681 64481186 64781845 65048424 65278122 65369720 65417961 65764603 66713112 66520195 65643265 66344856
3690.6 66344856 66139664 65619392 65909569 66094719 66308952 66499672 66519547 66418892 66213905 66361061
3700.3 66361061 66657738 66328827 66412270 66965591 66989761 66906670 66971359 67285576 67816772 67242859
3709.9F7242859K75871Q48404j068069j33225K91824L7812j2100K16659K42371k55249
3719.6F7687157l3303L74070k85431k21550O10443K09526q0544k67852J16836M46312
3729.2F8555664j28502M10858J09116o89507O53946n8181p69722J89056K81509j64116
3738.9F8390121m9011L52692l64685L0533J114845p87209j669525J016724O38985N81024
3748.5F9254494m41429j057320J050529m73945m71207O74584L03276K76764n33150
3757.2F8582596Q0063O60820n82115l26622L76197K35222k7580J42677j45981l03398
3766.8F8691879J22742L91235M21540o69472k05994N9281J45088L82652m4861r8427
3776.5F9195663k60314J65351L53852q55118J23314M66835P9552N1383k37106p8255
$$ plain form
3709.9 67242859 67518730 68367134 67299065 67165840 67457664 67495476 67483376 67700035 67942406 67687157
3719.6 67687157 67653854 68027924 67742493 67520943 68131386 68340912 68260368 67992516 68109352 68555664
3729.2 68555664 68427162 68838020 68947136 68257629 68911575 68853394 68083672 68272728 68554237 68390121
3738.9 68390121 68341110 68693802 68329117 68359650 69474495 68687286 67017761 68034485 68673470 69254494
3748.5 69254494 68813065 67755745 68806274 68332329 67861122 68535706 68838982 69115746 68582596
3757.2 68582596 68662659 69323479 68741364 68414742 68790939 69026161 68998581 69141258 68995277 68691879
3766.8 68691879 68814621 69205856 69627396 68957924 68751930 68811211 68956299 69338951 69294090 69195663
3776.5 69195663 68935349 69100700 69454552 68599434 68722748 69189583 69269135 69320518 69083412 69005157
3786.1F9005157R7771J19965J09268o8825k9938P8324N8876q1284l35K96829o4705
3796.7F9521103n51613L4012L90648M85824J8837r00375J01692K46544L05069O07643
3806.4G0259384o76178o90254L34839L79600N4436j10351L9115q9134M61449L25371
3816G0288277j572975K14279N42495N92179O13769j664589j47804M75700J01983K42355
3825.7F9685669R2041m66789j57440K8640K61803L42026n92469J99753O95557n20516
3835.3F9568275j96388P03339o22818l92288O85295m35066J63543Q22891m39094p76787
3844.9F9080902J52382K83783J3535R7686j21643o6589K70080n22796R42764k83195
3854.6F9846909q93280P03895q1596l81233J22772J84410L77418l83598j83884O44081
$$ plain form
3786.1 69005157 69102928 69222893 69332161 69263336 69233398 69311722 69370598 69289314 69288979 69585808 69521103
3796.7 69521103 68969490 69003502 69394150 69879974 69898811 68998436 69100128 69346672 69651741 70259384
3806.4 70259384 69583206 68892952 69227791 69607391 69661827 69551476 69590591 69501457 69962906 70288277
3816 70288277 68715302 68929581 69472076 70064255 70678024 69013435 68865631 69341331 69443314 69685669
3825.7 69685669 69777710 69310921 69153481 69182121 69443924 69785950 69193481 69393234 70088791 69568275
3835.3 69568275 69371887 70075226 69452408 69060120 69745415 69310349 69473892 70296783 69857689 69080902
3844.9 69080902 69233284 69517067 69530602 69628288 69506645 69440056 69710136 69187340 70130104 69846909
3854.6 69846909 68953629 69657524 69575928 69194695 69317467 69501877 69879295 69495697 69311813 69955894
3864.2F9955894o17736p74544L95454N99076O56074o71753q64052L02376O25572N41901
3873.9G0148262q40599k14050K63343q712R2186M61250J8143q22136J83372P6615K77557
3884.5F9635231N84015j004288M8271K40944J5740N99151J98052j008141k15431M59946
3894.1F9553490R3193q8150k76940N387M28932n29152K10419J96617k54471M04816
3903.8F9744141l18108l40378K4430J77192J73012j75262l1769J49620J14517N4237
3913.4F9571632j1207J28883K76985m09591n68146M31358K04308m57962n0270J73278
3923.1F9289268K58019j29868n09933j24413J54793L91457K42897J1276J45691k34848
3932.7F9494339k26479J16845o7017r6809J1680N6114Q2993l2181L5752l9513n27100
$$ plain form
3864.2 69955894 69338158 68563614 68959068 69558144 70214218 69542465 68678413 68980789 69606361 70148262
3873.9 70148262 69307663 69093613 69356956 69348244 69440430 69901680 69919823 69097687 69281059 69357674 69635231
3884.5 69635231 70219246 69214958 69263229 69504173 69519913 70119064 70317116 69308975 69093544 69553490
3894.1 69553490 69646683 69558533 69281593 69286980 69715912 69186760 69397179 69593796 69339325 69744141
3903.8 69744141 69426033 69085655 69110085 69287277 69460289 69285027 69253258 69402878 69517395 69571632
3913.4 69571632 69560425 69689308 69966293 69556702 68988556 69419914 69624222 69166260 69115990 69289268
3923.1 69289268 69547287 69417419 68907486 68783073 68937866 69329323 69572220 69583496 69729187 69494339
3932.7 69494339 69267860 69384705 69317688 69220879 69232559 69288673 69371666 69339485 69375237 69335724 68808624
3943.3F8808624o2439L54836K19368J55082k57530j14456K09679q9432r163L4805J2543
3953.9F9261917K3399Q393o874j49514K2034J27815J93512J76300k01889j46888o4041
3964.5F9244164j39489K1530N9891R5703L4088r5619J37795J52069p6416r6329m4090
3975.1F9293297m2572l2334K0699m2221l273p5462J0665J83899j31393L7361J65123
3985.7F9383789j2573q9997k37777Q7410J31851o3896m2519L945J24656m9965p9582
3996.3F9155342L5553j7105q057K11518
4000.2F9377251
$$ plain form
3943.3 68808624 68746185 69101021 69320389 69475471 69217941 69103485 69313164 69223732 69214569 69249374 69261917
3953.9 69261917 69285316 69293709 69286835 69137321 69159355 69287170 69480682 69656982 69455093 69308205 69244164
3964.5 69244164 69104675 69126205 69186096 69281799 69315887 69220268 69358063 69510132 69433716 69337387 69293297
3975.1 69293297 69250725 69218391 69239090 69196869 69193596 69118134 69128799 69312698 69181305 69218666 69383789
3985.7 69383789 69371216 69281219 69043442 69130852 69262703 69198807 69156288 69160233 69284889 69234924 69155342
3996.3 69155342 69190895 69173790 69165733 69377251
4000.2 69377251
##END=$$ End of the data block
