##TITLE=$$ Begin of the data block
##JCAMP-DX=5.00 $$ ACD/SpecManager v 10.08
##SPECTROMETER/DATA SYSTEM=Varian
##DATE=07 Jan 2013 10:27:16
##DATA TYPE=INFRARED SPECTRUM
##DATA CLASS=XYDATA
##ORIGIN=
##OWNER=
##NPOINTS=3735
##FIRSTX=399.26403809
##LASTX=4000.35498047
##MAXX=4000.35498047
##MINX=399.26403809
##MAXY=119.22890472
##MINY=9.94349766
##XFACTOR=1.0000000000
##YFACTOR=0.000001000000000
##FIRSTY=62.69683075
##DELTAX=0.96440572
##XUNITS=1/CM
##YUNITS=TRANSMITTANCE
##XYDATA=(X++(Y..Y))
399.3 62696831 119228905 89686958 67394798 65277840 51903484 42942383 46892769 50796261
407 50796261 56241547 57854340 58495445 67168877 62733688 49480312 56173264 62386913 56186687
415.7 56186687 64117256 65284340 41900883 28729046 37047199 39927620 52070648 65969551
423.4 65969551 51345360 43888245 51681606 55189594 52478870 47850597 49435070 52833061
431.1 52833061 48674889 41002811 35490395 37259724 46157658 50220882 45399097 49929867 55948368
439.8 55948368 48267319 43209019 48983421 51862900 50572723 51634571 48981602 48980183 50580376
448.4 50580376 55203564 56201973 50175949 51210773 47560268 46979015 47625595 43923149 50112423
457.1 50112423 49446491 43771126 44290249 42888283 38046719 40691311 51980034 57721813 50640079
465.8 50640079 43353580 47774792 49794811 47372952 47648407 48671440 58513401 57799580 50250187
474.5 50250187 42747547 43011341 51264091 53557121 55287170 53647942 50274910 48891228 47302628
483.2 47302628 50978607 54769413 53031696 43177788 40696724 48091373 48495426 49285828 57011093
491.8 57011093 61045635 58755493 55193729 54034843 52876064 48812050 47585659 48236958 48727406
500.5 48727406 50434387 50187771 49643215 48583019 49412140 48880169 45753536 49410709 50950436
509.2 50950436 49245487 49765297 49268227 48394363 48758720 49846313 49243378 47596004 48575962
517.9 48575962 47494793 42274891 45545162 51999374 48510742 44684181 45774487 49752544 49266052
526.6 49266052 44686420 44705296 47289665 48789806 49423241 49469994 48229988 46310513 45600845
535.2 45600845 45959549 46882267 46670349 46665272 46762024 47142464 48315651 46174313 44950729 47731789
544.9 47731789 48269753 46524860 45615967 46354237 47706604 46938007 46884735 47979099 49143387
553.6 49143387 48269489 45683594 47706501 48677010 47165630 46787880 45158375 45547401 45676128
562.3 45676128 45405464 46754917 48331203 49377941 49889973 51554951 50601608 49609879 49739464
570.9 49739464 47699059 46943066 47670990 50232494 51430393 49420334 48818901 48448151 47668106
579.6 47668106 47272434 46788246 46977325 48526302 48826969 47837261 47090927 45907547 44712635
588.3 44712635 44976215 46608227 45537670 44920719 47479111 49132263 48694305 46190670 46350430
597 46350430 47568218 45841702 44986664 46584503 46845135 44650314 43710300 44273720 45827103
605.6 45827103 46555698 45212852 44885220 44754917 43210331 40277443 38672661 37550797 35452713
614.3 35452713 35191799 34956772 34843552 35258556 35291382 36294258 35028111 32327240 32283257 32212502
624 32212502 30838547 30487755 32141151 35122623 36627739 38161392 39546570 38980255 39680237
632.7 39680237 41609707 41574299 39511444 38231365 37721458 37732231 38166744 37442543 37640335 38666798
642.3 38666798 39872738 41986172 44940800 47325237 47617077 48417194 50312447 51008991 50288540
651 50288540 49336571 49074669 49685158 50795853 51424782 51510086 50918354 51475491 52374043 50868198
660.6 50868198 50726032 51966732 51596474 51828197 53569187 54412346 55121101 55489880 53434826
669.3 53434826 54139271 54605560 53551987 52554096 52054249 52392975 52630363 52419430 52962818 53748722
678.9 53748722 53340061 52946770 52916050 53062584 53414330 52845478 53836151 54612309 53477741 53684597
688.6 53684597 54224567 53904629 52474503 51339542 51511356 52338146 53086708 52547981 52223717 51555256
698.2 51555256 50423725 50718472 51351555 51410797 51304199 50854839 50183071 50778652 52195305 53257946
707.9 53257946 53178974 52222122 52365417 52747261 53125164 54132790 54385723 53376129 52726978 53257130
717.5 53257130 53203068 53003628 53168568 53469131 54137085 54057217 54266056 54866848 54862476 55189125 55537643
728.1 55537643 55122658 54434464 54432243 54936691 55131306 54480385 53114174 52932053 53999931 54155933
737.8 54155933 53922260 54224030 54538971 54652214 54360825 54023777 53765221 53931690 54310040 54364780
747.4 54364780 55387180 56404961 55935940 55612991 55729824 55776375 56276714 56721973 57172165 57572952
757.1 57572952 56924919 56649479 57470112 58553852 58606518 57476357 57840584 58680149 58834728 59278202
766.7 59278202 58936310 58905685 59533234 59322670 59177490 59735767 59057976 57898922 58779980 59406719
776.4 59406719 59071262 59419807 60231758 61442757 61605446 61079376 61298729 61269657 60666054 60553307
786 60553307 61159859 61431038 61003212 60583584 61352356 62680004 62350304 61384914 61656380 61819248
795.6 61819248 61004749 60896164 61261372 61067837 61126358 61840256 62398098 62412090 62366024 61973663
805.3 61973663 62203815 62973274 62224125 61897072 62889854 63107933 62416237 61747593 61290535 60703148
814.9 60703148 60640938 61175465 61651291 61936062 62182899 62461315 62633938 63178829 62692307 61897633
824.6 61897633 62250721 61441086 60791210 60762493 60427116 61231621 61119469 60423473 60865349 60783562
834.2 60783562 59710434 58252171 57727276 57586487 57190338 57471317 57346706 56645054 55823730 55439354
843.9 55439354 56034012 55612926 54563866 54272411 54582439 56033833 56922207 56399502 55762856 55580460
853.5 55580460 56161514 56904655 57534908 57644222 57518749 58390842 59400814 59565907 59565807 59616180
863.1 59616180 59908829 60910900 61421768 61350594 61242931 60147026 59484848 60233013 60747028 61015884
872.8 61015884 61372154 61465309 61859573 62313667 62274364 62190918 62169182 61839863 61066395 60657181 60026337
883.4 60026337 58884270 59100399 59662910 59859348 60442204 60268845 59840630 60041046 59993652 59616486
893 59616486 59871376 60032215 59528831 59238911 59260647 59472733 59353256 58956085 58687077 58897507
902.7 58897507 59356441 58684158 57951527 58081104 58152386 58256325 58369186 57645050 56691067 56849491
912.3 56849491 57104092 56444336 55792767 55875530 55623955 54905182 54859367 54524017 53913788 53404617
922 53404617 53100319 53535503 53842144 53740166 52962879 51934082 51332241 50855053 50621811 50883518
931.6 50883518 51509243 51773594 51640789 51817204 52885429 53576481 53374187 53572796 53871525 54220734
941.3 54220734 54371643 54913799 55902050 55941822 56142456 56629765 56824574 56935280 57299545 57948338
950.9 57948338 58145046 58388809 58535568 58323860 58219555 58475094 58521549 57929695 57724323 57285709
960.6 57285709 56641838 56037998 55392521 55600906 55473679 54962860 54669956 54347824 54309601 54190876
970.2 54190876 54119053 54057480 53729649 53593235 53634220 53464355 53326130 53439007 53374496 53043377 52775227
980.8 52775227 52677361 52165703 51673840 52010368 51886330 50964428 50513176 50724838 50836853 50356503
990.5 50356503 49694508 49216984 48572170 47068039 44793640 43109810 43134918 44315258 45452698
999.1 45452698 46338634 47006302 47119255 46979851 47094452 47612476 47597675 47169495 47063244 46706795
1008.8 46706795 46535767 46661873 46370655 46019066 45807545 45372295 45233177 45196796 44313900 43600273
1018.4 43600273 43375526 43419823 43489033 43118835 42761814 41955025 41910263 42613453 42479137 42261246
1028.1 42261246 41730328 41098949 41035461 40942600 40394234 40163982 40211750 39959351 39728840 39186749
1037.7 39186749 39082642 38820461 38508087 38945572 38633907 38360893 38397709 38315041 38003391 37851151
1047.4 37851151 38227062 38241676 38637451 39073601 38966431 38809036 39179913 39789120 39606007 39295807
1057 39295807 39063457 38828121 38830257 39070873 39030846 38865654 38659756 38044838 38099304 38275867 38311317
1067.6 38311317 38399410 38508121 38667118 38122307 37843063 38078827 38311005 37720062 37074780 37670692
1077.2 37670692 38095539 38023262 37746693 37826412 37860676 37347775 36920872 36342102 36320641 36782715
1086.9 36782715 36662899 36207012 35849072 35271584 34853432 34282490 33588745 33483192 32606850 31690895
1096.5 31690895 30886808 29681896 28892998 27786695 26637566 25625233 24899647 23696512 22160999
1105.2 22160999 21476437 20782688 19871418 18501942 17271379 16451033 15928318 15456557 15104163
1113.9 15104163 15043749 14655285 14881801 14823825 14753197 14793654 14335650 14478747 14768045 15230356
1123.5 15230356 15438755 16017799 16362270 15824160 16093290 16588537 16778795 16675653 16269958 15578732
1133.2 15578732 15323493 15251429 14952823 15031107 14714746 14470807 14107832 13634008 12998837 12127951
1142.8 12127951 11794317 11527453 11620659 11290887 10908718 10798030 10637848 10968649 11027533 10703966
1152.5 10703966 10090534 9943498 10106287 10478391 10813363 10896474 11471110 11759792 11962323 11902955
1162.1 11902955 12107761 12554788 12931428 13622375 13591367 13666535 14041917 14852379 15528913 16009153
1171.8 16009153 17037485 17716856 18523975 18888449 19384737 20518671 21457378 22397573 23409721
1180.4 23409721 24471004 24965195 25622488 26537756 27357279 28105387 28593353 29189505 29739174 30562481
1190.1 30562481 31241671 31774462 32247608 32484840 33096493 33840481 34590816 35222393 35912445 36297554
1199.7 36297554 36655190 37601299 38151718 38407684 38864388 39489491 39790886 40030338 40717960 41247616
1209.4 41247616 41582027 41746120 41863079 41971592 41943310 42080990 42492992 42905888 43202549 43415848
1219 43415848 43287277 43027767 42940903 43249458 43449482 43155266 43042496 43121246 43261234 43355186 43694332
1229.6 43694332 43989086 43938705 44122261 44031544 43824631 43978355 44283302 44370945 44366734 44484112 44265778
1240.2 44265778 44243702 44493370 44561531 44489510 44341118 44356327 44639442 44830448 44713665 44844627
1249.9 44844627 44820347 44757374 45015961 44935871 44880775 45039024 45099724 44977818 45157608 45553528 45660267
1260.5 45660267 45530609 45251923 45313232 45497597 45700962 45948231 46160812 46325306 46324078 46475220
1270.1 46475220 46500019 46705906 46793251 46662224 46910992 47076405 47423573 47754074 47905949 48157204
1279.8 48157204 48474422 48706711 48798325 49157917 49481884 49756889 50055412 50266087 50356575 50463589
1289.4 50463589 50714520 50712074 50893032 51265038 51544472 51845886 52193768 52549835 52619301 52763802
1299 52763802 52986633 52962624 52869804 53090961 53393890 53421959 53596657 53645973 53806602 54337753 54512184
1309.7 54512184 54398201 54335220 54421303 54632511 54788887 54687000 54668324 54908501 54922348 54789433
1319.3 54789433 54836025 55009144 55027454 55147926 55566116 55941158 56105530 55954494 55861523 55874519
1328.9 55874519 55741463 55814846 55992340 56021221 56086952 56136780 56040718 56009956 56116848 56188217 56090298
1339.6 56090298 55842484 55821121 56071880 56240738 56136478 56099087 56287952 56512100 56408173 56067211
1349.2 56067211 56099628 56169731 56163406 56314835 56115494 55823811 55801933 55661156 55514896 55527618 55474995
1359.8 55474995 55302628 55382477 55727699 55760448 55652958 55623451 55443546 55374763 55376190 55238846 55060276
1370.4 55060276 54824863 54761806 54775749 54618118 54504677 54352505 54226856 54286232 54305157 54242393 54169643
1381 54169643 54137562 54218933 54028126 53865856 54127010 54283634 54218529 54273289 54325558 54264580 54552929
1391.6 54552929 54809639 54455341 53974766 53896248 54307796 54405518 54033997 53996128 54100410 54127537
1401.3 54127537 54130882 54046650 53914341 53969421 54057953 53997196 53938793 53715939 53575405 53385841 53258156
1411.9 53258156 53464691 53614048 53833954 53851631 53536808 53342266 53285873 52828777 52962528 53332527
1421.5 53332527 53268375 53226494 53592426 53867821 53840702 53683418 53778858 54006222 54055336 53851833 54015930
1432.1 54015930 54275734 54266937 54301010 54185806 54081863 54435772 54720348 54907188 55094910 55095856 55038086
1442.7 55038086 55269730 55442345 55607349 55675911 55846943 55937347 55771286 55789761 55658901 55771980
1452.4 55771980 56062275 56091316 55965500 56068073 56042255 55623394 56154385 56470676 56923069 57341682
1462 57341682 57367435 57535870 57511116 57536869 57732605 58010941 58278275 58431709 58453571 58139156 58362568
1472.6 58362568 58849609 59425533 59920345 59973122 60103542 60265385 60431892 60640404 60710808 60724354
1482.3 60724354 60955387 61269474 61183472 60991287 61185093 61523006 61460686 61045513 61090538 61336056
1491.9 61336056 61433163 61305939 61099617 61055580 61055016 61090008 60928673 60677261 60485790 60550053 60783772
1502.5 60783772 60405338 60063976 59823181 59269283 59295864 58778454 58951756 59192307 59010841 58536339
1512.2 58536339 58247856 58247753 57942383 57487282 57176285 57172562 57398335 57602077 57261810 57095486 56998848
1522.8 56998848 56907475 56897778 56422924 56641075 57008583 57021839 56938366 56677818 56512241 56501774 55956295
1533.4 55956295 55508354 56014088 56148388 56044395 55947617 54765877 54782768 55583969 55760448 55686447
1543 55686447 55577206 55465031 55416252 55529446 55489914 55647419 55713387 55246975 55433956 55861797 56158787
1553.6 56158787 56176018 55932323 55900509 56099594 56064438 55283726 56098328 56392937 56426353 56522373 56816086
1564.2 56816086 57000874 56946453 56982124 57092293 57248920 56922203 56971729 57290379 57367027 57097221
1573.9 57097221 56740826 56365334 56069515 56563278 56671570 56559483 56529865 56264687 56079941 55996910
1583.5 55996910 55925606 55770908 55570217 55318016 55035793 54992268 54930908 54746395 54268661 53994556
1593.2 53994556 53749001 53244709 53036659 52689171 52259548 51908634 51878853 51730545 51290085 50875694
1602.8 50875694 50455914 50234489 49853161 49635918 49403858 49190468 48880020 48399979 48261429 48012901
1612.5 48012901 47897797 47536312 47373871 47269119 45792351 45942989 46117706 45950214 45539730 45396835
1622.1 45396835 45259979 45109802 44914528 44546841 44606869 44357323 44032745 43774200 43683025 43768345
1631.7 43768345 43534927 43485561 43417580 43176441 42752384 42691650 42543129 42618698 42869549 42754311
1641.4 42754311 42888165 42760380 42751953 42684242 42462597 42843498 42691959 43093716 43130844 43453197
1651 43453197 43956291 43733807 43993687 43755901 44017765 44159893 44405807 44685955 44961113 45006454
1660.7 45006454 45034363 45472313 45398678 45514980 45787502 46252068 46631287 46973961 47284088 47012333
1670.3 47012333 47419888 47749672 47988857 48275444 48715836 49076450 49361496 49839405 49830761 49826294
1680 49826294 50165337 50674458 51124065 51207005 52061928 51923714 52197075 52527225 52850338 53478527
1689.6 53478527 53871296 54039120 54349770 54856209 55431210 56036072 55812531 56281895 57061531 57606621
1699.3 57606621 58033173 57985401 58485970 58999191 59387581 59648300 59975876 60313313 60788338 61350018
1708.9 61350018 61561356 61602921 62015945 62478565 62570442 62438465 62657497 62953636 62850376 62625248
1718.5 62625248 63209019 63565449 63797497 63910061 63546780 63364761 63729023 64070633 64250755 64385651
1728.2 64385651 64569038 64576027 64551682 64940361 65452469 65352669 64590935 64914337 65211349 65185295 65366188
1738.8 65366188 65629555 65542007 65666206 65799667 65923004 66191505 66601082 66891273 66962074 66978302
1748.4 66978302 67183937 67752029 68025284 68175491 68561737 68791588 69126015 69581696 69627647 69577950
1758.1 69577950 69811798 69965118 70015190 69882912 70105011 70404068 70372437 70589409 70939445 71042206
1767.7 71042206 71027748 71227409 71464462 71542824 71321007 70943512 71289162 71456184 71417168 71636238
1777.4 71636238 71657524 71808357 71810074 71688889 71961571 72258377 72348404 71976494 71780960 71992424
1787 71992424 72291267 72472031 72535393 72593292 72565445 72258766 72205193 72472054 72591446 72720345 72861511
1797.6 72861511 72946594 72956078 72847900 72972641 72966385 72906746 72887985 72888191 73062576 73219292 73291794 73330299
1809.2 73330299 73296852 72989082 72980667 73172073 73303284 73471863 73534042 73652435 73583862 73568993 73614578
1819.8 73614578 73445343 73523476 73691757 73914131 74025452 73717911 73643578 73828583 74016510 73952370
1829.4 73952370 73679726 73758247 74019798 74129692 74085800 74019051 73905586 73829216 73964439 74174133
1839.1 74174133 74180496 74248184 74334198 74418625 74420555 73945518 74042839 74323166 74496262 74383804 74328514
1849.7 74328514 74532829 74571213 74392563 74232864 74352280 74466743 74573288 74612160 74369102 74270721
1859.3 74270721 74414833 74714241 74751976 74627457 74633644 74711983 74827110 74694435 74697098 74767410 74541092
1869.9 74541092 74403374 74445900 74571243 74631477 74779335 74869606 74863121 74805428 74742516 74769882 74857986
1880.6 74857986 74878487 74741234 74779297 74776825 74751602 74943871 75102287 75103828 74902557 74792595 74753517
1891.2 74753517 74776817 74880264 74888748 74793892 74704208 74810516 74905815 75016136 74954605 74832924 74961784
1901.8 74961784 75153786 75223053 74924835 74871765 75033653 74911629 74805061 74791344 74841934 74824692 74830376
1912.4 74830376 74892204 74985825 74985413 74938293 74994789 74780487 74733452 74879028 74889404 74842903 74759544 74690514
1923.9 74690514 74692741 74797981 74854866 74971703 75032265 74926910 74844574 74846664 74864525 74774551 74801254
1934.6 74801254 74754807 74736450 74910118 75014801 75037727 74922874 74912506 74737595 74453033 74604401
1944.2 74604401 74788109 74836693 74807365 74825157 74794518 74800514 74875877 74985672 75009293 74879120 74829987
1954.8 74829987 74675911 74671455 74847000 74964195 75008095 74877022 74822487 74739922 74665741 74685143 74772408
1965.4 74772408 74867081 74797264 74720886 74626228 74712585 74777786 74601242 74499886 74477234 74548241 74687714
1976 74687714 74785446 74715508 74646507 74611374 74504395 74536713 74591118 74571968 74609314 74627998 74490883 74466339
1987.6 74466339 74588135 74594307 74589195 74612679 74579704 74455063 74529228 74586411 74442604 74465538 74524002
1998.2 74524002 74588005 74512253 74344704 74362259 74267113 74128693 74180954 74285568 74380219 74464645 74439178
2008.8 74439178 74340607 74182549 74155533 74335724 74288887 74124382 74094162 74150063 74234756 74215988 74213142
2019.4 74213142 74301376 74357025 74370575 74233803 73941628 73994179 74199509 74198006 74168015 74035210 73967064
2030 73967064 74024948 74030373 73872566 73773598 73849930 73910126 74126823 74222923 74089058 73919411 73847496
2040.6 73847496 73930397 73827934 73731590 73733635 73756767 73822174 73770477 73623215 73631393 73674232 73532158
2051.2 73532158 73629662 73765038 73820831 73814827 73537689 73517715 73601456 73566200 73467354 73372375 73501762
2061.9 73501762 73564957 73534912 73527382 73513435 73503136 73547745 73548805 73398361 73237846 73200775 73206100 73074860
2073.4 73074860 73113808 73229218 73188049 73137070 73125443 73209068 73119934 73003853 72883499 72718605 72846985
2084 72846985 73024239 73015938 72894379 72863731 72831291 72752495 72790535 72897720 72959496 72863976 72817818 72774551
2095.6 72774551 72809532 72958572 72976173 72935410 72823097 72812546 72859764 72847382 72850975 72868538 72833549
2106.2 72833549 72806351 73015350 73080040 73058479 73140617 73167549 73316963 73374756 73291779 73205101 73198837
2116.8 73198837 73262573 73208786 73139923 73163910 73231094 73203941 73141159 73187325 73340599 73318283 73048744
2127.4 73048744 73011032 73122200 73114471 73112793 73024239 72870949 72955254 73146210 73182022 73120331 73067467
2138 73067467 73130981 73172577 73096169 73073692 73203758 73261734 73172501 73235420 73333580 73388077 73424927 73299927
2149.6 73299927 73150284 73257515 73444481 73442841 73520790 73454536 73247314 73268257 73413307 73600136 73462486
2160.2 73462486 73242714 73302673 73379768 73407333 73385651 73353790 73359802 73465546 73420486 73374580 73615265
2170.8 73615265 73653877 73410690 73195572 73224503 73292641 73291260 73455429 73466728 73363075 73492630 73553574
2181.4 73553574 73325356 73244110 73352600 73235756 73177994 73411499 73582733 73570862 73562019 73576721 73576889
2192 73576889 73686699 73752541 73659027 73659737 73710953 73736496 73749290 73687454 73721878 73796982 73894066 73974998
2203.6 73974998 73927643 73962280 73947456 73894135 73910828 73986855 74066933 73975655 73964233 73887741 73773041
2214.2 73773041 73914726 74007072 74006386 73976669 74017921 74085159 74056534 74166481 74193413 74024704 73999992
2224.8 73999992 73904510 73728600 73826088 73981987 74013374 73968773 73978836 74006592 73985863 74051949 73951340
2235.4 73951340 73895126 74051460 74018082 73976913 74005646 73941818 73948410 74061836 74103294 74045998 73920036
2246 73920036 73822975 73890373 74016006 74031425 73996315 74085297 74101631 74028374 74005646 74033333 74113533 74034081
2257.6 74034081 74010666 74135559 74239761 74163818 73986885 74064270 74076698 74096542 74205414 74232758 74291161
2268.2 74291161 74219666 74159477 74177643 74253868 74253967 74096169 74050774 74079811 74003098 73907372 74082565 74230591
2279.8 74230591 74153419 74075203 74105690 74215561 74177734 74185204 74168739 74055611 74079147 74203850 74356346
2290.4 74356346 74406250 74457733 74434334 74323387 74300674 74345779 74465927 74504677 74376930 74239548 74294418
2301 74294418 74375351 74445580 74506828 74549843 74665459 74632629 74752632 74929871 74940277 74956856 74906013
2311.6 74906013 74884026 74754921 74741882 74921272 75242195 75450195 75163010 75075333 75267738 75566063
2321.3 75566063 75879433 75837502 75794296 75870483 75697937 75671913 76191422 76183899 75785461 75960007 76227654
2331.9 76227654 76352158 76203438 76028229 76334145 76567932 76369873 76267822 76124939 76052155 76177254
2341.5 76177254 76140984 76371048 76711388 76487488 75995483 75899353 75858513 75810913 75999786 76159431
2351.2 76159431 76395111 76475945 76629311 77167030 77461960 77485199 76989449 77438530 78260101 78026596
2360.8 78026596 77576805 77134590 76931725 77183998 77709587 77044579 76688324 77137024 76606468 76413933
2370.4 76413933 76351326 76067711 76174721 76185783 76061760 75813202 75439842 75279099 75356979 75332916
2380.1 75332916 75274872 75160271 74875755 74681557 74633682 74691589 74770683 74792778 74775909 74696175 74557129
2390.7 74557129 74516853 74584221 74610809 74624794 74575424 74539200 74595245 74722107 74760750 74686752 74736008
2401.3 74736008 74659760 74476715 74439934 74570580 74674332 74666451 74831627 74846138 74584641 74456070 74542175
2411.9 74542175 74615082 74626717 74585747 74398956 74363029 74369186 74381950 74533684 74668846 74703896 74488739
2422.5 74488739 74425972 74468864 74337067 74313728 74421806 74559990 74512207 74319176 74213303 74225166 74143181
2433.1 74143181 74052895 74254669 74424904 74347183 74260544 74307747 74236076 74120369 74205917 74303291 74440697
2443.7 74440697 74480568 74248619 74035568 74041252 74002991 73968185 74134583 74176788 74113617 74051018 74002396
2454.3 74002396 74000458 74017021 74040222 73969772 73887611 73757332 73714996 73820923 73903305 73968727 74006012
2465 74006012 74006393 73848297 73795410 73918129 73935982 73862167 73785332 73818100 73749229 73661545 73690163 73726006
2476.5 73726006 73854630 73875595 73831841 73875397 73854805 73781075 73723671 73690727 73665329 73622017 73610626
2487.1 73610626 73629669 73644974 73671028 73655121 73632896 73632492 73639557 73568176 73513779 73582382 73533371 73510559
2498.7 73510559 73435173 73287621 73371246 73458603 73468185 73409943 73316841 73177940 73153206 73345650 73348839
2509.3 73348839 73288849 73333641 73431335 73532196 73521881 73491341 73428139 73281898 73136963 73069130 72999809
2519.9 72999809 73013138 73060921 73071083 73200813 73363480 73416153 73211632 73018555 73001846 72964691 72900841
2530.5 72900841 72901405 73023903 73047783 73102943 73137001 73045189 73018936 72914139 72861359 72880348 72890297 72857246
2542.1 72857246 72912163 72996613 72897026 72972336 72955414 72829521 72833611 72767517 72768150 72723709 72728043 72843513
2553.7 72843513 72852028 72809036 72788033 72821533 72838730 72753815 72633698 72616623 72603020 72639153 72721489 72651558
2565.2 72651558 72583740 72547279 72500435 72456589 72429977 72492950 72603333 72627464 72521355 72516495 72605057
2575.9 72605057 72481865 72267784 72311150 72386177 72340172 72388466 72436676 72498566 72565689 72535912 72454376
2586.5 72454376 72279854 72078430 72096252 72272400 72313255 72231407 72098763 72126129 72215912 72206848 72308556
2597.1 72308556 72194313 71935394 71856499 71911995 72032242 72017769 71995438 71936562 71854248 71907158 71864143
2607.7 71864143 71758942 71758156 71798134 71828499 71777840 71674088 71680855 71680710 71609543 71565178 71549377 71579666
2619.3 71579666 71598671 71629242 71637917 71660912 71708755 71714699 71667686 71438850 71283165 71240379 71155235 71199928
2630.8 71199928 71346924 71412300 71361023 71393028 71333359 71134064 71068527 71088341 71187431 71150108 70993149
2641.4 70993149 70949516 70904411 70991348 71139610 71005692 70784325 70745949 70834839 70856468 70723969 70683975
2652 70683975 70809219 70951401 70924065 70682083 70511635 70423843 70400848 70465988 70525810 70561050 70500732
2662.6 70500732 70456879 70442581 70447334 70511986 70454292 70355438 70328568 70227676 70184631 70297607 70342804
2673.3 70342804 70340393 70304138 70221283 70212585 70251907 70244255 70116096 70050377 70050529 69990929 69990067 70002472 69954849
2685.8 69954849 69837227 69722397 69779671 69926270 69840378 69676483 69753319 69906219 69966782 69894325 69773605
2696.4 69773605 69634232 69612183 69699959 69602692 69435898 69373749 69499443 69567299 69503441 69520668 69509079
2707 69509079 69538025 69510345 69471138 69488693 69403839 69379211 69368423 69253296 69191422 69226692 69107765 68951851
2718.6 68951851 69012238 69182518 69232162 69078629 68989250 68898079 68797928 68657356 68455193 68517380 68627449
2729.2 68627449 68710815 68849930 68959564 68936203 68790642 68669716 68487564 68431305 68529922 68622940 68644203
2739.8 68644203 68694695 68747055 68526421 68372269 68252190 68123238 68269264 68417389 68399391 68266968
2749.4 68266968 68232910 68257614 68151009 68058548 68047462 68091713 68181450 68110558 67930840 67945999 67881035
2760 67881035 67801598 67895943 67945839 68003311 67978127 67953430 67856255 67611092 67527954 67568649 67651039 67627510
2771.6 67627510 67469055 67448647 67505257 67349449 67240677 67344559 67336273 67244080 67084793 67036072 67149673
2782.2 67149673 67125885 67085060 67036804 66973022 66954956 66953995 67007805 67004425 66886337 66719749 66633125 66658569
2793.8 66658569 66636772 66578751 66608612 66609016 66505959 66416321 66347847 66269608 66222206 66139854 66007690 66017494
2805.4 66017494 66025421 65909958 65860847 65826218 65762642 65666641 65627472 65715477 65672562 65444214 65284195
2816 65284195 65255203 65280457 65347626 65350288 65294785 65245636 65140053 64945671 64825966 64765877 64497726
2826.6 64497726 64390610 64502686 64531937 64568153 64434265 64274788 64198128 64143089 64206276 64108505 63809422
2837.2 63809422 63578373 63508953 63466892 63294392 63029243 62867741 62794624 62589352 62256016 61980827
2846.8 61980827 61856937 61611423 61285900 61099682 61024197 61146118 61197151 61065933 60977032 60909992
2856.5 60909992 60852219 60892143 60929329 60860039 60775589 60648930 60594471 60615192 60620201 60499260 60212700
2867.1 60212700 60115074 60079372 59985386 59905308 59832516 59846634 59751766 59585842 59430016 59314442 59275856
2877.7 59275856 59246235 59249821 59267456 59249996 59136879 59042980 58975811 58915493 58794182 58535797 58445675
2888.3 58445675 58457710 58354458 58252140 58256924 58277843 58271191 58218578 57969040 57714813 57628998 57609886
2898.9 57609886 57540031 57543213 57556202 57364326 57276497 57251640 57189163 57137829 57051250 57008808 56820518
2909.5 56820518 56627823 56635002 56716270 56692223 56486298 56264160 56007725 55764351 55666367 55678913 55676674
2920.1 55676674 55643284 55691467 55671261 55557579 55463200 55360184 55331043 55323597 55340939 55417328 55360970
2930.7 55360970 55380100 55457623 55502621 55628963 55542351 55544502 55685093 55732784 55802975 55725342 55753151
2941.3 55753151 55828533 55837044 55967827 56087727 56110538 55973576 55955914 56076797 56159241 56194115 56068336
2952 56068336 55894787 55800526 55766163 55705666 55776390 55898277 55873760 55735538 55613579 55775150 55913586
2962.6 55913586 55875027 55790600 55803455 55947498 55981197 56118515 56278851 56402691 56569775 56623413 56648659
2973.2 56648659 56653599 56740971 56834518 56857128 56965172 57145309 57324314 57440792 57503967 57493530 57553368
2983.8 57553368 57786301 58053913 58198212 58144066 58031815 58096581 58350063 58567684 58667336 58510910
2993.4 58510910 58394661 58567398 58559380 58526642 58584938 58602867 58701679 58741211 58774334 58793331 58746346
3004 58746346 58712879 58611687 58505161 58462532 58515163 58728764 58873474 58826733 58780529 58719765 58675949
3014.6 58675949 58721912 58714844 58574207 58451668 58504616 58546017 58418659 58271923 58207706 58152191 58177345
3025.2 58177345 58253658 58116829 57947609 57912628 57889549 57901005 57968273 57981556 57930202 57885529 57710934
3035.9 57710934 57507851 57423893 57439194 57562462 57511288 57301525 57190723 57182343 57153217 56990101 56871254
3046.5 56871254 56911491 56986950 56872459 56630615 56616871 56604103 56460964 56528530 56596298 56432980 56217186
3057.1 56217186 56013287 55926613 56008423 56066002 56030682 55961636 55879730 55891579 55875404 55702000 55617401
3067.7 55617401 55610149 55586826 55530457 55444958 55439804 55351643 55239353 55171455 55035389 55002506 55002064 54966240
3079.2 54966240 55001064 54909023 54749893 54767479 54725796 54569321 54486530 54435055 54421124 54426067 54472965
3089.9 54472965 54513588 54361309 54127537 54055992 54079662 54004177 53900070 53870682 53883663 53749100 53560387
3100.5 53560387 53568966 53526119 53406166 53411282 53470551 53455070 53359406 53182053 53027985 53014153 52929535
3111.1 52929535 52860516 52804638 52628246 52498631 52368382 52281681 52261353 52228100 52214184 52296677 52324413
3121.7 52324413 52130199 51949402 51866257 51787521 51590702 51479561 51486633 51403351 51367275 51199924 50985359
3132.3 50985359 50894630 50928158 51011723 50884510 50770679 50707355 50559963 50400879 50358898 50329823 50225327
3142.9 50225327 50255581 50174648 50040253 49938549 49748062 49616215 49483810 49413715 49331112 49226585
3152.5 49226585 49083858 48851242 48799438 48757637 48596329 48482021 48422588 48350773 48219006 48207996 48299629
3163.1 48299629 48203861 48102142 48042564 47800026 47626122 47561348 47555214 47512077 47305550 47171253 47054321
3173.8 47054321 46965157 46843410 46619949 46545212 46616566 46651211 46436844 46240341 46257557 46196869 46166462
3184.4 46166462 46192413 45986847 45677765 45492546 45450123 45499756 45438824 45336288 45221840 45054665
3194 45054665 45011341 44998219 45024864 44953529 44765156 44635483 44528080 44490295 44308517 44121712 43991043
3204.6 43991043 43882103 43925041 43796951 43699749 43757111 43749802 43635822 43474575 43498718 43457184 43272411
3215.2 43272411 43177788 43007553 42788361 42794811 42873898 42734512 42540459 42413841 42425739 42459187 42303490
3225.8 42303490 42137115 42002827 42002083 42108532 42030037 41863243 41644562 41542580 41564262 41430763 41399506
3236.4 41399506 41320969 41181156 41254665 41226002 41116066 40992565 40923698 40873039 40770027 40827335 40755478
3247 40755478 40525494 40367844 40404224 40445999 40239742 40102978 40072083 40060699 39963158 39875576 39877113
3257.7 39877113 39773209 39734375 39620579 39498711 39544788 39596367 39554676 39298321 39185211 39253429 39124271
3268.3 39124271 38972404 38988373 38958401 38882236 38895336 38826447 38645832 38483765 38521210 38623383 38566334
3278.9 38566334 38487629 38435101 38376381 38237564 38138256 38171024 38247707 38202858 38024685 38018738 38007507
3289.5 38007507 37887650 37811890 37760254 37719318 37668591 37691982 37681953 37588238 37397354 37241158 37268330
3300.1 37268330 37235165 37174503 37101368 36986973 36987511 37035480 36984638 36894463 36866596 36782516 36675247 36641445
3311.7 36641445 36615707 36547066 36435268 36287235 36170391 36136311 36143173 36186939 36124485 36097290 36181015
3322.3 36181015 36076656 35948261 35900398 35769314 35645397 35626060 35451897 35230438 35226524 35152157 35158386
3332.9 35158386 35279305 35247765 35119186 34929245 34791847 34640896 34541584 34579590 34513187 34345482
3342.5 34345482 34274960 34300396 34223904 34074757 34012466 34003288 33989326 33966858 33843212 33698738 33619465
3353.1 33619465 33464844 33317673 33239143 33257622 33260891 33194851 33164886 32994244 32854309 32786327 32676891
3363.7 32676891 32601952 32471661 32397736 32365658 32352467 32358673 32270451 32108837 31949083 31897642 31927401
3374.3 31927401 31987890 31974419 31822372 31621382 31541298 31630266 31635862 31478876 31345407 31344391 31370562
3384.9 31370562 31461233 31487810 31229179 31070654 31091856 30970493 30833200 30907898 30926151 30806347 30800140
3395.6 30800140 30771141 30652447 30549532 30576363 30626356 30539757 30464808 30439589 30485094 30590944 30636061
3406.2 30636061 30503719 30430634 30421089 30216732 30134172 30157915 30222872 30296099 30210232 30187897 30258440
3416.8 30258440 30349152 30337450 30250036 30143831 30044729 30072233 30058723 30081520 30210665 30253408 30150578
3427.4 30150578 30009462 29975256 30094778 30148714 30022318 30016657 30015732 30026857 30233234 30394650 30396111
3438 30396111 30280947 30235491 30248158 30273712 30309547 30379784 30493683 30453485 30416311 30483326 30587465
3448.6 30587465 30579975 30585264 30755812 30716919 30691149 30786037 30820189 30919764 31024725 31058123 31011314 31015121
3460.2 31015121 31100485 31206676 31163862 31132849 31343365 31447010 31499182 31586260 31550886 31536652 31639700
3470.8 31639700 31750118 31823214 31937111 32038319 32125046 32242596 32350018 32304478 32248619 32274746 32284046
3481.4 32284046 32443527 32598171 32808586 32951546 32849529 32824615 32818012 32936661 33040730 32997234
3491 32997234 33022652 33223728 33490952 33574356 33742329 33812263 33724316 33822643 33879719 33874733 33899788 34073959
3502.6 34073959 34248814 34255943 34236214 34232376 34432713 34700085 34818104 34847076 34867783 34928993 35065025
3513.2 35065025 35144592 35131203 35157238 35271374 35550453 35784874 35860939 35961044 36119339 36161915 36092163
3523.8 36092163 36226494 36316395 36309689 36324104 36337040 36536785 36820263 36990406 36981560 37008614 37075531
3534.4 37075531 37195351 37367138 37403961 37555294 37741566 37896400 37956749 37931812 38026577 38126545 38301266
3545 38301266 38511250 38667141 38673016 38712265 38905716 39131615 39393017 39437996 39552647 39702717 39761047
3555.6 39761047 39907692 40110996 40403252 40446171 40423607 40471748 40600807 40880405 41005322 41273876
3565.3 41273876 41386063 41333431 41418030 41495747 41776859 41946598 42192909 42351200 42360306 42558434 42754539
3575.9 42754539 42999268 43254398 43448360 43531082 43525330 43690739 44090206 44357700 44396137 44732010
3585.5 44732010 45090061 45430275 45582928 45165890 45436684 45929001 46104774 46041721 46159397 46700359
3595.2 46700359 46802540 46915157 47334812 47589527 47808449 47853683 48076416 48389553 48531879 48738304
3604.8 48738304 49034382 49356628 49218231 49257996 49397865 49462971 50065815 50333515 50413349 50901196
3614.5 50901196 50945282 51231571 51551254 51515900 51766968 52169849 52469376 52677029 52980827 53400295
3624.1 53400295 53725876 53740444 53883331 54665352 54829411 54254669 54588230 54911648 55520565 55773106
3633.8 55773106 55628796 55995865 56408192 56688782 56842068 57042828 57192032 57449562 57916054 58109234
3643.4 58109234 58247978 58484325 59077492 59582973 59679638 60301308 59892025 59424351 59697163 60219330
3653 60219330 60680309 61056076 61598156 60992115 60923615 61389507 61688580 62058060 62221607 62528790
3662.7 62528790 62655773 62744713 63064621 63200218 63524162 63705444 63833691 63900143 63179321 63511951
3672.3 63511951 64329544 65161949 65638374 64325592 63851101 64442078 65038277 64905762 64972786 65251312
3682 65251312 65367195 65499527 65569763 65582169 66019440 67039696 66526566 65628494 66339806 66053276
3691.6 66053276 65819115 66201897 66166191 66377502 66757645 66813644 66867187 66779755 66812317 67080750 66591431
3702.2 66591431 66485023 67066490 67193878 67302383 67375542 67576889 68040787 67377724 67801323 68372940
3711.9 68372940 66970268 67407722 67934891 67850609 67796387 68029732 68494179 68487762 68231812 68492020
3721.5 68492020 68386757 67872643 68303429 68757690 68872398 68585579 68629288 69048111 68848839 69059914
3731.2 69059914 68735466 68014687 68952301 69023453 68118225 68109108 68399200 68428879 68497276 69021454 68812859
3741.8 68812859 68772789 69857239 68937103 67319870 68516685 69061249 69677742 69380981 67754593
3750.4 67754593 68744987 68451660 67871338 68491730 68849266 69200737 68776772 69126945 69915344 69203392
3760.1 69203392 68823051 69178169 69357994 69244308 69480980 69381859 68985992 69179878 69489288 69624626
3769.7 69624626 68888985 68933571 69225075 69400139 69630592 69384262 69244164 69164330 69546646 69958351
3779.4 69958351 69015045 69083618 69513840 69539528 69560127 69392685 69424385 69588966 69598701 69562408 69428886
3790 69428886 69375595 69540077 69661186 69560783 69551750 69907806 69801414 69235596 69319145 69637665 70175568
3800.6 70175568 69963036 68951881 69341637 69621193 69899078 70344269 69643524 69309860 69715919 69909836
3810.2 69909836 69884071 69805840 69811195 69935226 70441299 70475204 68892593 69094017 69657173 69981064
3819.9 69981064 70196037 68936646 68942261 69424377 69652687 70017250 70099823 69625740 69440857 69529549
3829.5 69529549 69763214 69920731 69352966 69447998 70152458 69793404 69556702 70269928 69574089 69206039
3839.2 69206039 70024521 69680267 69464088 70070526 70190590 69648308 69581024 69819084 69919548 70041962
3848.8 70041962 69890755 69828529 70141350 69941238 70802757 69708244 68906540 69674271 69721703 69445282
3858.4 69445282 69517868 69700607 69805626 69282669 69482994 70240822 69588699 68846581 69296341 69848076
3868.1 69848076 70548088 70257202 69092178 69292381 69910583 70436485 69617050 69330460 69705383 69678726
3877.7 69678726 69829170 70255386 69722145 69147049 69594330 69628326 69889488 70545738 69344948 69264107
3887.4 69264107 69686302 69806152 70309883 70215668 69347755 69535172 69931679 69772507 69714897 69645401
3897 69645401 69698715 70086479 69361908 69465866 69745148 69260452 69607750 69488846 69280174 69420547
3906.7 69420547 69412949 69522087 69581131 69662666 69738380 69758263 69826706 69739624 69683380 69982262 69850891
3917.3 69850891 69520851 69977905 69938133 69329308 69473305 69839333 70117409 69914879 69364449 69272995
3926.9 69272995 69489944 69753075 69645157 69576630 69765610 69570488 69535973 69665184 69491615 69411102
3936.6 69411102 69627167 69710213 69550941 69565155 69677315 69630867 69277153 69194397 69339905 69392769 69637390
3947.2 69637390 69506691 69318794 69527008 69585022 69698753 69720505 69646736 69524246 69488022 69503387 69345352
3957.8 69345352 69484428 69518517 69548813 69704079 69492958 69461571 69589600 69672340 69734612 69678734 69601463
3968.4 69601463 69474586 69370102 69513550 69745026 69665840 69602440 69716995 69649017 69622124 69664452 69528603
3979 69528603 69463783 69440140 69418152 69516212 69436508 69378227 69409500 69387985 69395874 69407120 69583580 69586319
3990.6 69586319 69507118 69601692 69614517 69723404 69652992 69405678 69381966 69445389 69472435 69538956
4000.2 69538956
##END=$$ End of the data block
