##TITLE=$$ Begin of the data block
##JCAMP-DX=5.00 $$ ACD/SpecManager v 10.08
##SPECTROMETER/DATA SYSTEM=Varian
##DATE=07 Jan 2013 10:07:32
##DATA TYPE=INFRARED SPECTRUM
##DATA CLASS=XYDATA
##ORIGIN=
##OWNER=
##NPOINTS=3735
##FIRSTX=399.26403809
##LASTX=4000.35498047
##MAXX=4000.35498047
##MINX=399.26403809
##MAXY=94.03685760
##MINY=14.00580406
##XFACTOR=1.0000000000
##YFACTOR=0.000000100000000
##FIRSTY=94.03685760
##DELTAX=0.96440572
##XUNITS=1/CM
##YUNITS=TRANSMITTANCE
##XYDATA=(X++(Y..Y))
$$ plain form
399.3 940368576 781754837 844560089 795934601 590852852 575145302 740193100 820474396
406 820474396 585161934 473836861 741469574 803386307 662136765 695642853 664474182
412.8 664474182 534589615 558444519 634146118 592031631 580264626 623568573 577561073
419.5 577561073 585466461 453583641 289410648 363824081 551056900 664444427 667380371
426.3 667380371 617004128 596917648 591014519 561990356 521380043 491668205 551344032 633878937
434 633878937 596812439 562295570 659987411 709637146 656011276 631169090 708378601 741757126
441.7 741757126 570531998 585264397 849273758 910493088 726769333 465965271 462708817
448.4 462708817 605870361 583121185 543225784 566584320 582206879 611534042 600797005
$$ packed form
399.3I40368576j58613739O2805252m8625488k05081749j5707550J65047798Q0281296
406H20474396k35312462j11325073K67632713O1916733j41249542L3506088l1168671
412.8F64474182j29884567K3854904P5701599m2114487j1767005M3303947m6007500
419.5E77561073P905388j31882820j64172993P4413433J87232819J13387527K935944
426.3F67380371n0376243k0086480n903129k9024163m0610313k9711838N9675827Q2534905
434F33878937l7066498l4516869R7691841M9649735n3625870k4842186P7209511L3378525
441.7G41757126j71225128J4732399K64009361O1219330j83723755k60804062l256454
448.4D62708817J43161544k2749176l9895401K3358536J5622559K9327163j0737037
$$ plain form
455.2 600797005 545364304 502598877 589787636 630336342 612502441 640003128 600395889
462 600395889 529473724 588899841 711438293 656525116 449056854 372699890 498377991
468.7 498377991 645182266 669571991 631077156 490986443 511583099 589055557 597619591
475.5 597619591 662211990 678336563 609224396 588710709 606256676 570410004 545015488
482.2 545015488 548180466 497569466 534575691 658850250 670414124 531772003 454648437
489 454648437 526100845 560830688 587462845 601790352 603415718 618867226 569887009 566656647
496.7 566656647 599791145 577420921 615405502 668759766 626006241 598695374 623583565
503.4 623583565 585105324 505867653 520709953 614830093 658828278 660855179 617620964 542852478
$$ packed form
455.2F00797005n5432701m2765427Q7188759M0548706j7833901K7500687l9607239
462F00395889p0922165N9426117J22538452n4913177k07468262p6356964J25678101
468.7D98377991J46804275K4389725l8494835j40090713K0596656P7472458Q564034
475.5E97619591O4592399J6124573o9112167k0513687J7545967l5846672k5394516
482.2E45015488L164978n0611000L7006225J24274559J1563874j38642121p7123566
489D54648437P1452408L4729843K6632157J4327507J625366J5451508m8980217l230362
496.7E66656647L3134498k2370224L7984581N3354264m2753525k7310867K4888191
503.4F23583565l8478241p9237671J4842300R4120140M3998185K026901m3234215p4768486
$$ plain form
511.1 542852478 529026375 581585503 649607315 631029358 584468536 626450996 664912872
517.9 664912872 676619339 677665787 613733063 558037224 559324913 599308701 600410233 570966530
525.6 570966530 584239998 589823799 563251152 561025810 589892006 588535576 573279877 572981949
533.3 572981949 565649261 576949272 572300377 577422218 608168869 568130913 528342209 555648270
541 555648270 618444328 631668663 600890656 603421211 601539345 618569794 611797676 578364983
548.7 578364983 608301697 638501282 642964783 612324333 568039017 575493889 582689171 577866364
556.5 577866364 597913322 586824303 539531517 552719231 585098877 592551918 607654915 597777786
564.2 597777786 582041626 580387611 596143684 614854889 608524055 601164017 588832741 584373627
$$ packed form
511.1E42852478j3826103N2559128O8021812j8577957m6560822M1982460L8461876
517.9F64912872J1706467J046448o3932724n5695839J287689L9983788J101532k9443703
525.6E70966530J3273468N583801k6572647k225342K8866196j356430j5255699k97928
533.3E72981949p332688J1300011m648895N121841L0746651m0037956l9788704K7306061
541E55648270O2796058J3224335l0778007K530555j881866J7030449o772118l3432693
548.7E78364983K9936714L0199585M463501l0640450m4285316P454872P195282m822807
556.5E77866364K0046958j1089019m7292786J3187714L2379646P453041J5102997r877129
564.2E97777786j5736160j654015J5756073J8711205o330834p360038j2331276m459114
$$ plain form
571.9 584373627 602886429 597440529 566417885 569684067 582603493 575443535 572251282 557725906
579.6 557725906 547208786 554173279 569856110 583702049 580938950 572161674 566101074 575181808
587.3 575181808 583287888 579706993 569417343 569386635 585257988 585387955 588309937 588680687 586989746
596 586989746 596694908 600555687 604816093 601599884 587897110 565511665 549421806 555038223
603.7 555038223 558826828 556175919 554549332 542219925 517384682 511313133 512858086 497978783
611.4 497978783 478777428 451188660 427057762 414871826 433361893 470319481 469378395 467398033
619.2 467398033 469395332 432601318 415042610 423241348 418659668 420682907 420409203 430702629
626.9 430702629 441201782 444633369 477437172 492851219 499771729 523893929 524594154 496203613
$$ packed form
571.9E84373627J8512802n445900l1022644L266182J2919426p159958l192253j4525376
579.6E57725906j0517120O964493J5682831J3845939k763099q777276o060600R080734
587.3E75181808Q106080l580895j0289650l0708J5871353J29967K921982L70750j690941
596E86989746R705162L860779M260406l216209j3702774k2385445j6089859N616417
603.7E55038223L788605k650909j626587j2329407k4835243o071549J544953j4879303
611.4D97978783j9201355k7588768k4130898j2185936J8490067L6957588r41086j980362
619.2D67398033J997299l6794014j7558708Q198738m581680K023239k73704J0293426
626.9D30702629J0499153L431587L2803803J5414047O920510K4122200P00225k8390541
$$ plain form
634.6 496203613 466582108 460295486 459848709 456001091 442323723 434710426 446581726 463462105
642.3 463462105 495997963 518055382 537095222 571030159 592640762 589427338 587747459 596723213
650 596723213 602848587 615224953 612675591 610247002 609487114 602521210 604824944 600944557 616584549
658.7 616584549 625893478 619966621 627559700 620762138 615718575 608477707 595670738 606915550
666.4 606915550 617458191 571187096 590987701 607077827 610485878 616226654 603874435 611173477
674.1 611173477 628017159 622945137 629669456 628948975 621913528 612960091 610453949 634482536
681.8 634482536 638790474 616586761 607617149 613841400 618758163 617447624 610927887 613173943
689.6 613173943 626329994 634204559 633003159 633022041 631514397 615099564 606859360 616506157
$$ packed form
634.6D96203613k9621505o286622m46777l847618j3677368p613297J1871300J6880379
642.3D63462105L2535858K2057419J9039840L3934937K1610603l213424j679879Q975754
650E96723213O125374J2376366k549362k428589p59888o965904K303734l880387J5639992
658.7F16584549R308929n926857P593079o797562n043563p240868j2806969J1244812
666.4F06915550J0542641m6271095J9800605J6090126L408051N740776j2352219P299042
674.1F11173477J6843682n072022O724319p20481p035447q953437k506142K4028587
681.8F34482536M307938k2203713q969612O224251M916763j310539o519737K246056
689.6F13173943J3156051P874565j201400J8882j507644j6414833q240204R646797
$$ plain form
697.3 616506157 637959938 649893494 631140900 619072113 620993881 625226402 621924324 611369896
705 611369896 616213264 625917435 629356308 621365700 620752983 624554672 621418571 634768028 638459702
713.7 638459702 622608337 618275070 635993347 643330994 634042931 645966949 651451263 642441406
721.4 642441406 638088760 635830956 645004883 645455933 633082237 623257484 622710457 635843964
729.1 635843964 641526718 626466484 618134270 633065605 647398682 644957428 637508316 635868645
736.8 635868645 632468033 635133362 646100388 646058121 642736206 634279327 624872932 627381973 635263824
745.5 635263824 643728180 639743996 634154053 636312408 643542252 650483932 639695816 643039246
753.2 643039246 667531509 675558701 671594620 666634979 668719482 681794434 691846924 686548004
$$ packed form
697.3F16506157K1453781J1933556j8752594j2068787J921768M232521l302078j0554428
705F11369896M843368R704171L438873p990608o12717L801689l136101J3349457L691674
713.7F38459702j5851365m333267J7718277P337647r288063J1924018N484314r009857
721.4F42441406m352646k257804R173927M51050j2373696r824753n47027J3133507
729.1F35843964N682754j5060234q332214J4931335J4333077k441254p449112j639671
736.8F35868645l400612K665329J0967026m2267l321915q456879r406395K509041P881851
745.5F35263824Q464356l984184n589943K158355P229844O941680j0788116L343430
753.2F43039246K4492263Q027192l964081m959641K084503J3074952J0052490n298920
$$ plain form
760.9 686548004 676245728 680820694 693176346 688983917 674500351 678003845 684146957 670352631
768.6 670352631 658344955 665929565 673468552 671776123 680169067 681653290 675651398 676519241
776.4 676519241 666996002 663632660 669123230 673435211 681627731 686448517 693450851 700192947
784.1 700192947 703126678 703019638 699309464 694948730 694416656 700207367 697907410 690606842 693315659
792.7 693315659 699667053 695665359 699656754 720420685 719825516 706986771 700817490 694959564
800.5 694959564 699469833 707466431 712502975 714555283 709076309 704699936 708044052 711775665
808.2 711775665 718065338 719777908 699376602 677705460 673378830 688056870 709674301 716609955
815.9 716609955 717767258 713048172 706554108 713361053 717659225 712845612 709905472 705741425
$$ packed form
760.9F86548004j0302276M574966J2355652m192429j4483566L503494O143112j3794326
768.6F70352631j2007676P584610P538987j692429Q392944J484223o001892Q67843
776.4F76519241r523239l363342N490570M311981Q192520M820786P002334O742096
784.1G00192947K933731j07040l710174m360734n32074N790711k299957p300568K708817
792.7F93315659O351394m001694L991395K0763931n95169j2838745o169281n857926
800.5F94959564M510269P996598N036544K052308n478974m376373L344116L731613
808.2G11775665O289673J712570k0401306k1671142m326630J4678040K1617431O935654
815.9G16609955J157303m719086o494064O806945M298172m813613k940140m164047
$$ plain form
823.6 705741425 700354462 700802002 694339752 685992813 689932861 693117218 695834961 702642365 706047287
832.3 706047287 696783524 683256454 682714005 685983429 679920425 676656418 684232101 677611923
840 677611923 667045746 666900406 661807785 663042526 660424347 654489365 659185562 661960602 658824692
848.7 658824692 657340927 668925171 668953552 653804932 647097702 647508621 659542618 671202240
856.4 671202240 677227478 680658340 684857254 691489410 683543625 675276642 675091934 674049835 682414398
865.1 682414398 705064926 714769058 702126923 697581787 698317642 696064148 690452347 692604294
872.8 692604294 707345810 704583740 693505020 687911072 688046188 686504364 678255310 677653275
880.5 677653275 679671021 682249069 675809631 670235138 676650314 679024811 684196320 686896515
$$ packed form
823.6G05741425n386963M47540o462250q346939L940048L184357K717743O807404L404922
832.3G06047287r263763j3527070n42449L269424o063004l264007P575683o620178
840F77611923j0566177j45340n092621J234741k618179n934982M696197K775040l135910
848.7F58824692j483765J1584244K8381j5148620o707230M10919J2033997J1659622
856.4F71202240O025238L430862M198914O632156p945785q266983j84708j042099Q364563
865.1F82414398K2650528R704132j2642135m545136P35855k253494n611801K151947
872.8F92604294J4741516k762070j1078720n593948J35116j541824q249054o02035
880.5F77653275K017746K578048o439438n574493O415176K374497N171509K700195
$$ plain form
888.2 686896515 692711639 702450027 693456192 675853043 670359955 677771988 684950867 691177826
895.9 691177826 691929626 688347855 685388260 676708603 673999939 678465500 685862274 690324860 684265518
904.6 684265518 680600815 676930389 672243042 673928299 669512253 665046310 668547897 661741180
912.3 661741180 652452469 655522156 661247406 656566086 645923767 644766159 642360077 638669319
920 638669319 639027367 635286140 635029755 633503380 633470078 636705475 631496429 626149063 628531075
928.7 628531075 634206963 633352928 625785255 619337425 620425911 620369987 613306732 613134918 617858734
937.4 617858734 625313072 634715385 644351349 654422150 657338867 655560760 656088181 660120010
945.1 660120010 658041229 658702469 664667664 661790543 664914780 672383575 671933060 670898056 670380325
$$ packed form
888.2F86896515N815124R738388q993835j7603149n493088P412033P178879O226959
895.9F91177826P51800l581771k959595q679657k708664M465561P396774M462586o059342
904.6F84265518l664703l670426m687347J685257m416046m465943L501587o806717
912.3F61741180r288711L069687N725250m681320j0642319j157608k406082l690758
920F38669319L58048l741227k56385j526375l3302L235397n209046n347366K382012
928.7F28531075N675888q54035p567673o447830J088486n5924p063255j71814M723816
937.4F17858734P454338R402313R635964J0070801K916717j778107N27421M031829
945.1F60120010k078781O61240N965195k877121L124237P468795m50515j035004n17731
$$ plain form
953.8 670380325 667766724 666114578 664456177 660264053 660954437 662370911 659878998 658852844 656173401
962.5 656173401 651082382 647942123 642281418 632453766 632665405 637238121 632626343 626635246 625662880
971.2 625662880 628395615 630255165 628090210 620098076 618747711 621810074 619364090 622822952
978.9 622822952 620619736 616362114 618574409 617850113 622713242 626206017 622142410 614617500 604784279
987.6 604784279 597577591 595193481 596541634 591628532 584281349 579714127 565851097 542952232
995.3 542952232 525983047 522161484 531703682 550374870 561532593 565912971 569352608 565508347
1003 565508347 562958450 566362190 568875580 569890480 567570496 564762192 563549118 559015846 555910645
1011.7 555910645 556677208 559969521 565255051 565677338 557416992 547950325 544098740 540385361 538682137
$$ packed form
953.8F70380325k613601j652146j658401m192124O90384J416474k491913j026154k679443
962.5F56173401n091019l140259n660705r827652K11639M572716m611778n991097r72366
971.2F25662880K732735J859550k164955p992134j350365L062363k445984L458862
978.9F22822952k203216m257622K212295p24296M863129L492775m063607p524910r833221
987.6F04784279p206688k384110J348153m913102p347183m567222j3863030k2898865
995.3E42952232j6969185l821563R542198J8671188J1157723M380378L439637l844261
1003E65508347k549897L403740K513390J014900k319984k808304j213074m533272l105201
1011.7E55910645P66563L292313N285530M22287q260346r466667l851585l713379j703224
$$ plain form
1020.3 538682137 535613441 530691681 530540848 529646416 532889633 532204018 528883476 525357552 514354782
1029 514354782 512105103 515355072 519277115 518682938 517717896 519710388 511247330 508856583 512919998
1037.7 512919998 515740929 512074051 501763382 495841675 492234688 495232010 497947388 498306656
1045.4 498306656 500622444 504991302 504184494 501054916 506038971 503480301 497590599 496821251 505021820
1054.1 505021820 509582214 504571495 511006622 514459000 512201576 510504417 512804985 509931374
1061.8 509931374 501136856 505775833 503999252 504915581 508714104 503273888 504111824 504501877 502452736
1070.5 502452736 496211395 492107506 494699707 498044662 497886009 498018761 502877731 498635139 489693260
1079.2 489693260 486975899 493324356 494500732 488188896 491533737 497022324 502256126 499802933
$$ packed form
1020.3E38682137l068696m921760j50833q94432L243217o85615l320542l525924j1002770
1029E14354782k249679L249969L922043n94177r65042J992492q463058k390747M063415
1037.7E12919998K820931l666878j0310669n921707l606987K997322K715378L59268
1045.4D98306656K315788M368858q06808l129578M984055k558670n889702p69348Q200569
1054.1E05021820M560394n010719O435127L452378k257424j697159K300568k873611
1061.8E09931374q794518M638977j776581R16329L798523n440216Q37936L90053k049141
1070.5E02452736o241341m103889K592201L344955j58653J32752M858970m242592q941879
1079.2D89693260k717361O348457J176376o311836L344841N488587N233802k453193
$$ plain form
1086.9 499802933 486094398 477550659 480315628 478673363 465810890 457671700 448427315 437803688
1094.6 437803688 428363457 416308594 404850426 392047539 378319740 369239998 364632874 339780273
1102.3 339780273 316130810 315956364 308638725 292375126 278839970 264265747 243779716 233315868
1110 233315868 229049320 215084229 204369125 202062740 199303417 193587551 191700134 187260246
1117.7 187260246 189363499 191471539 184342728 185127220 187584438 193315048 199423447 204059200
1125.5 204059200 206659164 204614353 207715397 209860229 208280563 205952187 201051445 190906086
1133.2 190906086 188192806 191426544 189010048 184870663 177878952 180670052 182864742 179579411
1140.9 179579411 178666248 167724838 158354998 158052063 159162960 156815481 154107752 150325470
$$ packed form
1086.9D99802933j3708535q543739K764969j642265j2862473q139190r244385j0623627
1094.6D37803688r440231j2054863j1458168j2802887j3727799r079742m607124k4852601
1102.3C39780273k3649463j74446p317639j6263599j3535156j4574223k0486031j0463848
1110B33315868m266548j3965091j0715104k306385k759323n715866j887417m439888
1117.7A87260246K103253K108040p128811P84492K457218N730610O108399M635753
1125.5B04059200K599964k044811L101044K144832j579666k328376m900742j0145359
1133.2A90906086k713280L233738k416496m139385o991711K791100K194690l285331
1140.9A79579411r13163j0941410r369840l02935J110897k347479k707729l782282
$$ plain form
1148.6 150325470 147783165 146586866 140938768 140058041 142971735 149141741 151238289 146835527
1156.3 146835527 146163187 152650394 159075480 159582748 166471844 170811634 171356277 169684906 170326405
1165 170326405 183812408 189799728 193716240 201917534 206963120 213250656 223375950 230533981
1172.7 230533981 235089188 249496632 258736820 260916882 271024952 283918037 293800087 305755424
1180.4 305755424 318394680 326022377 336113091 348461189 358896904 367298813 378082047 388612061
1188.1 388612061 392387123 396413040 404512520 413386803 418644295 425696335 433126755 438689537
1195.9 438689537 445300407 448349152 452004318 457411690 464113846 471639900 481416321 490170059
1203.6 490170059 495646248 503546257 506798706 506858063 507573013 510867653 512913094 513761749 518815155
$$ packed form
1148.6A50325470k542305j196299n648098q80727K913694O170006K096548m402762
1156.3A46835527o72340O487207O425086N07268O889096M339790N44643j671371O41499
1165A70326405J3486003N987320L916512Q201294N045586O287536J0125294P158031
1172.7B30533981M555207J4407444R240188K180062J0108070J2893085R882050J1955337
1180.4C05755424J2639256P627697J0090714J2348098J0435715Q401909J0783234J0530014
1188.1C88612061L775062M025917Q099480Q874283N257492P052040P430420N562782
1195.9D38689537O610870L048745L655166N407372O702156P526054R776421Q753738
1203.6D90170059N476189P900009L252449N9357P14950L294640K045441Q48655N053406
$$ plain form
1212.3 518815155 519939079 526835823 533729668 532596130 535113144 538635941 541301575 540194435
1220 540194435 537731133 537208595 539230843 541325684 540879440 541486320 541770782 545753670 549675751
1228.6 549675751 549415169 546663933 547063065 550378609 548174210 549578209 549881477 547177544 549878273
1237.3 549878273 553626785 555170784 551645393 548582802 549204102 555247993 558352394 555432625
1245 555432625 558842010 562612572 563378754 561988869 560357285 560543098 562372360 565664062 564553757
1253.7 564553757 563549690 563287849 563446693 565613708 566069717 567178459 569073257 567088852 562124367
1262.4 562124367 565940857 574498672 573670311 570462608 573042221 576056099 576788940 578001289 578237228
1271.1 578237228 578202324 578595314 579860535 581465759 583509293 589015541 593551445 596404762 596123581
$$ packed form
1212.3E18815155J123924O896744O893845j133538K517014L522797K665634j107140
1220E40194435k463302n22538K022248K094841m46244O06880K84462L982888L922081
1228.6E49675751k60582k751236L99132L315544k204399J403999L03268k703933K700729
1237.3E49878273L748512J543999l525391l062591O21300O043891L104401k919769
1245E55432625L409385L770562P66182j389885j631584J85813J829262L291702j110305
1253.7E64553757j004067k61841J58844K167015M56009J108742J894798j984405m964485
1262.4E62124367L816490Q557815q28361l207703K579613L013878P32841J212349K35939
1271.1E78237228l4904L92990J265221J605224K043534N506248M535904K853317k81181
$$ plain form
1279.8 596123581 595770836 600225983 601087799 600058594 603296356 605909576 605262756 606831131 609518394
1288.4 609518394 611987381 617084770 619568176 620679321 622878761 622484856 621303711 623110695
1296.2 623110695 625779686 628180580 630834618 631388817 632789879 634444618 636094513 638227043
1303.9 638227043 638336754 639448547 640974350 641503983 640094070 639883957 641313324 640334625 641494522
1312.5 641494522 641938782 640363770 641645889 643339005 643255386 644274139 647329788 647162781 645419464
1321.2 645419464 646058197 650375061 651830521 648287964 647112198 646565475 648880692 650461884 649478149
1329.9 649478149 650545349 649278870 650774460 654230042 654928513 654083481 652849274 653147888 652698746
1338.6 652698746 654410477 653224182 651221313 652824554 652142029 652198257 653694229 655575638 654279785
$$ packed form
1279.8E96123581l52745M455147Q61816j029205L237762K613220o46820J568375K687263
1288.4F09518394K468987N097389K483406J111145K199440l93905j181145J806984
1296.2F23110695K668991K400894K654038N54199J401062J654739J649895K132530
1303.9F38227043J09711J111793J525803N29633j409913k10113J429367r78699J159897
1312.5F41494522M44260j575012J282119J693116q3619J018753L055649j67007j743317
1321.2F45419464O38733M316864J455460l542557j175766n46723K315217J581192r83735
1329.9F49478149J067200j266479J495590L455582O98471q45032j234207K98614m49142
1338.6F52698746J711731j186295k002869J603241o82525N6228J495972J881409j295853
$$ plain form
1347.3 654279785 648342361 644387131 646219635 651412048 651580200 649232712 649091949 649642334 650651321
1355.9 650651321 648384857 644372635 643785782 646109772 646880417 646347427 646536102 646215210 646390686
1364.6 646390686 647068710 646760712 643162766 639710617 639911499 641122818 641839218 642082901 642236176
1373.3 642236176 639812775 638014565 635592651 632724190 631693764 628297615 625789680 626719475
1381 626719475 628368149 629145317 629753609 629850464 630903816 636070557 636801682 631784859 628473358
1389.7 628473358 628838730 630575714 630268593 632269821 629633904 627314758 628210526 624582100 624973030
1398.4 624973030 621581650 617240067 618351212 616648483 613620720 611125641 609523201 611227570
1406.1 611227570 612979355 611174812 609519005 609103508 606864204 605143661 602481422 601208420
$$ packed form
1347.3F54279785n937424l955230J832504N192413J68152k347488j40763N50385J008987
1355.9F50651321k266464m012222n86853K323990P70645n32990J88675l20892J75476
1364.6F46390686O78024l07998l597946l452149K00882J211319P16400K43683J53275
1373.3F42236176k423401j798210k421914k868461j030426l396149k507935R29795
1381F26719475J648674P77168O08292R6855J053352N166741P31125n016823l311501
1389.7F28473358L65372J736984l07121K001228k635917k319146Q95768l628426L90930
1398.4F24973030l391380m341583J111145j702729l027763k495079j602440J704369
1406.1F11227570J751785j804543j655807m15497k239304j720543k662239j273002
$$ plain form
1413.8 601208420 602188683 604947853 606382294 601976662 602004433 600969772 595490990 592351303 588770332
1422.5 588770332 591671524 597187424 597349205 593989258 590205231 590584564 591757126 591184883 586547089
1431.2 586547089 583877373 584143715 583382988 585880089 591710014 590112991 585576057 587532883 588162346
1439.8 588162346 587926674 588070869 587027435 585845375 583615532 583210068 586892128 591687813 588564110
1448.5 588564110 590394974 595093460 590615578 589813576 589535408 587162781 591275864 594122772 595501404
1457.2 595501404 597127342 597127113 596338844 599663811 603403549 602094498 603210640 609541283 614070778
1465.9 614070778 612190933 610371552 612706184 614044800 614675293 617981148 625712891 624767685 623639793
1474.6 623639793 626695518 629864655 631311493 632276764 634711571 636855011 637904243 637586975 639001350
$$ packed form
1413.8F01208420R80263K759170J434441m405632K7771j034661n478782l139687l580971
1422.5E88770332K901192N515900J61781l359947l784027L79333J172562n72243m637794
1431.2E86547089k669716K66342p60727K497101N829925j597023m536934J956826O29463
1439.8E88162346k35672J44195j043434j182060k229843m05464L682060M795685l123703
1448.5E88564110J830864M698486m477882q02002k78168k372627M113083K846908J378632
1457.2E95501404J625938k29p88269L324967L739738j309051J116142O330643M529495
1465.9F14070778j879845j819381K334632J338616O30493L305855P731743r45206j127892
1474.6F23639793L055725L169137J446838R65271K434807K143440J049232l17268J414375
$$ plain form
1483.2 639001350 643608170 644383316 645361252 648964691 646885147 646725693 652266083 655567474 652694168
1491.9 652694168 650620270 649321823 648422089 648632126 646600647 646865311 645904465 645255432 647009964
1500.6 647009964 648532410 649432373 646087341 644135437 645439529 636219940 633186493 641669617
1508.3 641669617 646349869 645577545 642816696 640859070 642168732 644049835 643279648 644738846 646111832
1517 646111832 639517059 640497665 642722168 641627502 639936142 640575104 645051117 645086899 638578529
1525.7 638578529 641366730 642667694 637793465 637194557 638992119 640264130 640231934 639400978 637549896
1534.3 637549896 638597565 638015289 634996567 635971031 642678757 639154854 642167206 644978180 641639709
1543 641639709 645036926 646169281 636478844 634926147 637898598 641077423 640153809 637052536 640087814
$$ packed form
1483.2F39001350M606820P75146R77936L603439k079544j59454N540390L301391k873306
1491.9F52694168k073898j298447q99734K10037k031479K64664r60846o49033J754532
1500.6F47009964J522446Q99963l345032j951904J304092r219589l033447Q483124
1508.3F41669617M680252p72324k760849j957626J309662J881103p70187J459198J372986
1517F46111832o594773R80606K224503j094666j691360O38962M476013L5782o508370
1525.7F38578529K788201J300964m874229n98908J797562J272011l2196q30956j851082
1534.3F37549896J047669n82276l018722R74464O707726l523903L012352K810974l338471
1543F41639709L397217J132355r690437j552697K972451L178825r23614l101273L035278
$$ plain form
1551.7 640087814 641883011 640253220 639787407 641271286 641858444 642377396 635346832 642846069 654657898
1560.4 654657898 649710159 649542542 650900192 648980408 647762299 651587524 653222961 654106598 657104645
1569.1 657104645 650924301 649766083 651226196 650560303 651750717 651822357 648222122 641473007 643362503
1577.7 643362503 643907547 642282867 641182861 641078873 641507263 640034790 638973999 636732903 635002480
1586.4 635002480 633819695 629318237 625821228 625517654 625797462 621304665 618396492 616617851 614478073
1595.1 614478073 614888496 612844620 610863152 606385231 603553238 603093948 602001915 600809059 595587349
1603.8 595587349 591083717 587310295 586461945 586106491 584017220 580340233 576833000 575735855 571445503
1612.5 571445503 568970108 566677895 566956711 567184372 561090050 559698219 553788109 553281708 554529572
$$ packed form
1551.7F40087814J795197j629791m65813J483879N87158N18952p030564P499237J1811829
1560.4F54657898m947739j67617J357650j919784j218109L825225J635437Q83637K998047
1569.1F57104645o180344j158218J460113o65893J190414P1640l600235o749115J889496
1577.7F43362503N45044j624680j100006j03988M28390j472473j060791k241096j730423
1586.4F35002480j182785m501458l497009l03574K79808m492797k908173j778641k139778
1595.1F14478073M10423k043876j981468m477921k831993m59290j092033j192856n221710
1603.8E95587349m503632l773422q48350l55454k089271l676987l507233j097145m290352
1612.5E71445503k475395k292213K78816K27661o094322j391831n910110n06401J247864
$$ plain form
1621.1 554529572 555013237 552408638 544185448 546236839 546821175 547164459 545067863 544871483 544423027
1629.8 544423027 540684471 538285904 535835838 537065544 539923248 540009918 531020699 530963249 534301796
1638.5 534301796 532887878 532696648 531946716 533597832 535119591 535034065 536563339 536654320 531443825
1647.2 531443825 525699196 531604805 536273880 538172150 540850258 542571297 532796936 541469536
1654.9 541469536 548801537 549403839 550710411 552686806 552432213 552863731 558685379 565184708 561138573
1663.6 561138573 560966721 561747513 563392792 565762024 567711525 572607651 577788811 583747940 582546654
1672.3 582546654 581393471 584043770 588983994 593427010 593174133 594757347 599573898 602036514
1680 602036514 599272346 604756203 611008186 607288284 614447365 616472893 618524857 619859619 621409302
$$ packed form
1621.1E54529572M83665k604599q223190K051391N84336L43284k096596j96380m48456
1629.8E44423027l738556k398567k450066J229706K857704Q6670q989219n7450L338547
1638.5E34301796j413918j91230p49932J651116J521759q5526J529274R0981n210495
1647.2E31443825n744629N905609M669075J898270K678108J721039r774361Q672600
1654.9E41469536P332001O02302J306572J976395k54593M31518N821648O499329m046135
1663.6E61138573j71852P80792J645279K369232J949501M896126N181160N959129j201286
1672.3E82546654j153183K650299M940224M443016k52877J583214M816551K462616
1680F02036514k764168N483857O251983l719902P159081K025528K051964J334762J549683
$$ plain form
1688.6 621409302 626397552 628889160 632184753 636765633 640787125 645901642 652643280 650192108
1696.4 650192108 650326462 654475937 658200684 662451935 662199249 665863190 670676498 674101486 674988708
1705 674988708 676313171 679183121 683679581 685757446 685267334 688589020 692946701 697632980 702829361
1713.7 702829361 699904251 696624908 703397598 712745132 705270386 700437851 704429703 707642822
1721.4 707642822 708531570 709225159 711261444 713657303 711493225 709487915 712601852 717041779 717146454
1730.1 717146454 714502945 718179855 722062073 720822220 720225601 722039871 724624939 723514862
1737.8 723514862 723338165 722552185 718491211 721044159 722957230 725862427 731176147 734596558 737977142
1746.5 737977142 737422256 733213730 732888565 734433594 734517822 738698883 743155670 745167770 746806488
$$ packed form
1688.6F21409302M988250K491608L295593M580880M021492N114517O741638k451172
1696.4F50192108J34354M149475L724747M251251k52686L663941M813308L424988Q87222
1705F74988708J324463K869950M496460K077865m90112L321686M357681M686279N196381
1713.7G02829361k925110l279343O772690R347534p474746m832535L991852L213119
1721.4G07642822Q88748O93589K036285K395859k164078k005310L113937M439927J04675
1730.1G17146454k643509L676910L882218j239853n96619J814270K585068j110077
1737.8G23514862j76697p85980m060974K552948J913071K905197N313720L420411L380584
1746.5G37977142n54886m208526l25165J545029Q4228M181061M456787K012100J638718
$$ plain form
1755.2 746806488 748756790 745823288 744795990 748735657 751122589 753242035 752536697 748839111
1762.9 748839111 751114807 754504623 755484619 757245407 760165787 757236328 756073151 759722900
1770.6 759722900 761137543 755517349 753951416 758208084 759656296 758748016 760615463 762658386
1778.3 762658386 763534012 762996979 762055435 762712555 764848480 766513290 764735260 763113708 765003815
1787 765003815 765884476 765631638 766541977 765061264 766380463 766930695 763110580 765239258 767551422
1795.7 767551422 767784271 769016037 772276535 773168564 769979401 768505402 767411804 769808578 772933807
1804.4 772933807 773389206 771645889 772927475 774277725 770360794 769289246 770227356 771422882 772550354
1813 772550354 772795029 772877274 771367874 772680054 773344269 772293854 772369003 774018555 774733353 770858231
$$ packed form
1755.2G46806488J950302k933502j027298L939667K386932K119446p05338l697586
1762.9G48839111K275696L389816R79996J760788K920380k929459j163177L649749
1770.6G59722900J414643n620194j565933M256668J448212r08280J867447K042923
1778.3G62658386Q75626n37033r41544O57120K135925J664810j778030j621552J890107
1787G65003815Q80661k52838R10339j480713J319199N50232l820115K128678K312164
1795.7G67551422K32849J231766L260498Q92029l189163j473999j093598K396774L125229
1804.4G72933807M55399j743317J281586J350250l916931j071548R38110J195526J127472
1813G72550354K44675Q2245j509400J312180O64215j050415P5149J649552P14798l875122
$$ plain form
1822.7 770858231 771707153 775175476 773455582 772609558 775514069 779242935 778770447 775359497 774813690
1831.4 774813690 776883774 779092636 778761368 775442657 773223953 776005630 777476120 777473907 777621918
1840.1 777621918 778877487 780601883 780080032 780326691 777986679 779110413 782115936 781984940 779989395
1848.7 779989395 779138031 780527496 779317627 778783493 780664673 779921570 778563004 776999893 778278275
1857.4 778278275 780895004 780172424 781134491 782250366 780586777 780414276 780439453 779663544 780050659
1866.1 780050659 780962067 781922989 780860214 779577866 780709839 782142868 782781982 781273727 780892792
1874.8 780892792 783893585 784299622 781520615 781818390 783822784 784795456 784658127 782668991 782350922
1883.4 782350922 783148804 782127762 781365509 782240372 783169098 780898209 779308853 781993103 783179626
$$ packed form
1822.7G70858231Q48922L468323j719894q46024K904511L728866m72488l410950n45807
1831.4G74813690K070084K208862l31268l318711k218704K781677J470490k213J48011
1840.1G77621918J255569J724396n21851K46659k340012J123734L005523j30996j995545
1848.7G79989395q51364J389465j209869n34134J881180p43103j358566j563111J278382
1857.4G78278275K616729p22580R62067J115875j663589j72501K5177p75909L87115
1866.1G80050659R11408R60922j062775j282348J131973J433029O39114j508255l80935
1874.8G80892792L000793M06037k779007K97775K004394R72672j37329j989136l18069
1883.4G82350922P97882j021042p62253Q74863R28726k270889j589356K684250J186523
$$ plain form
1892.1 783179626 783652420 786228409 786777267 783565063 781399307 781306534 782428818 782032700 780042114
1900.8 780042114 779582443 779842758 779923935 780583649 781112518 782089310 783506317 784187622 784500275 783194046
1910.4 783194046 782405548 783400574 783618927 782383728 780029755 781102676 784752197 783805618 781406708
1919.1 781406708 782762070 784169540 784263535 783988876 781506271 780860519 782635651 782639465 783039932
1927.8 783039932 784426727 783396225 781357727 782110596 782508621 783007050 785733337 784842072 782419891
1936.5 782419891 781700668 781699371 781920013 781144562 780465698 780194473 780451431 779833603 777915726 777081909
1946.1 777081909 779222107 781380157 782756500 783199234 780662689 780963058 782238617 782063980 783117828
1954.8 783117828 781998138 781839447 783486328 784020004 783254547 782565994 781985779 780612564 780740128
$$ packed form
1892.1G83179626M72794K575989N48858l212204k165756r2773J122284l96118j990586
1900.8G80042114m59671K60315Q1177O59714N28869R76792J417007O81305L12653j306229
1910.4G83194046p88498R95026K18353j235199k353973J072921L649521r46579k398910
1919.1G81406708J355362J407470R3995k74659k482605o45752J775132L814M00467
1927.8G83039932J386795j030502k038498P52869L98025M98429K726287q91265k422181
1936.5G82419891p19223j297K20642p75451o78864k71225K56958o17828j917877q33817
1946.1G77081909K140198K158050J376343M42734k536545L00369J275559j74637J053848
1954.8G83117828j119690j58691J646881N33676p65457o88553n80215j373215J27564
$$ plain form
1963.5 780740128 780677032 781151657 782079086 782329178 783557358 781852188 779209595 779400940 780103455
1972.2 780103455 780990601 781945877 781336365 781115875 781314087 780698242 780103531 779092178 778821335
1980.8 778821335 778746338 779953079 780938492 779784851 780446625 780505142 779232559 777966843 778234711
1989.5 778234711 779881973 779163284 777574768 775998154 776267395 778104782 778252792 778820496 780545807
1998.2 780545807 780043793 776713638 775843735 778100586 779202576 777534714 776651382 777502670 777105560
2006.9 777105560 777324448 776864090 776317902 778381500 779218750 776712646 774731216 776337204 777901993
2015.6 777901993 777662506 776396179 776365662 779103165 780132599 778717499 778377991 777274628 774128342
2024.2 774128342 773384552 773295746 773768692 775686798 774857025 774803467 776013184 776919632 777287903 775036697
$$ packed form
1963.5G80740128o3096M74625R27429K50092J228180j705170k642593J91345P02515
1972.2G80103455Q87146R55276o09512k20490J98212o15845n94711j011353k70843
1980.8G78821335p4997J206741R85413j153641O61774N8517j272583j265716K67868
1989.5G78234711J647262p18689j588516j576614K69241J837387J48010N67704J725311
1998.2G80545807n02014l330155q69903K256851J101990j667862q83332Q51288l97110
2006.9G77105560K18888m60358n46188K063598Q37250k506104j981430J605988J564789
2015.6G77901993k39487j266327l0517K737503J029434j415100l39508j103363l146286
2024.2G74128342p43790q8806M72946J918106q29773n3558J209717R06448L68271k251206
$$ plain form
2033.9 775036697 773521957 773788605 772987442 771804047 772592621 772995377 773527603 775078278 774072571
2042.6 774072571 772907639 773310623 773826447 773885345 773803635 772949600 772945328 774760742 775447998 775532303
2052.2 775532303 773930054 771972504 771697769 771831512 772056427 771480789 771778717 772841263 773920746
2060.9 773920746 773869476 773262787 772285233 769838181 770361938 770460892 768787308 770852814 772533798
2069.6 772533798 769060211 767045593 769745712 770174866 767310410 763739014 763181763 764284363 763881836
2078.2 763881836 765301971 765970230 767175980 769204712 768617401 767801666 766697693 765551453 764188156
2086.9 764188156 764023437 765673828 766154633 765974503 765362930 764136887 763705368 764362488 765467377
2095.6 765467377 765381546 764900894 765802917 765365067 766678696 770043411 770101700 769532852 767814789
$$ packed form
2033.9G75036697j514740K66648q01163j183395P88574M02756N32226J550675j005707
2042.6G74072571j164932M02984N15824N8898q1710q54035m272J815414O87256Q4305
2052.2G75532303j602249j957550k74735J33743K24915n75638K97928J062546J079483
2060.9G73920746n1270o06689r77554k447052N23757R8954j673584K065506J680984
2069.6G72533798l473587k014618K700119M29154k864456l571396n57251J102600m02527
2078.2G63881836J420135O68259J205750K028732n87311q15735j103973j146240j363297
2086.9G64188156j64719J650391M80805j80130o11573j226043m31519O57120J104889
2095.6G65467377q5831m80652R02023m37850J313629L364715N8289n68848j718063
$$ plain form
2104.3 767814789 766798553 767673416 766569595 764661713 764456329 766686859 767205734 768312988 769937668
2113 769937668 768370819 767028732 767393112 769922562 769024811 768167114 770031433 767864304 766847229
2121.6 766847229 766563110 766218109 766738663 766265793 768490906 769926758 767983704 765719070 765438538
2130.3 765438538 768186569 770374985 770094528 770128708 770412369 769781876 769724884 769480896 768817062 768623734
2140 768623734 768288956 767840347 767902603 768557358 768671417 768732224 770757980 772218246 771347809 771753235
2149.6 771753235 771186752 769604034 770301743 769890747 770180588 771869354 772394028 772163696 770872116
2158.3 770872116 770165863 771084137 773064728 772804031 770918274 772179184 773597946 772135620 770621872
2167 770621872 769784851 768849564 768621521 768784256 769247665 768710480 768081360 769309082 770128098 769742203
$$ packed form
2104.3G67814789j016236Q74863j103821j907882k05384K230530N18875J107254J624680
2113G69937668j566849j342087L64380K529450q97751q57697J864319k167129j017075
2121.6G66847229k84119l45001N20554m72870K225113J435852j943054k264634k80532
2130.3G65438538K748031K188416k80457L4180K83661o30493n6992k43988o63834j93328
2140G68623734l34778m48609O2256O54755J14059O0807K025756J460266q70437M05426
2149.6G71753235n66483j582718O97709m10996K89841J688766N24674k30332j291580
2158.3G70872116p06253R18274J980591k60697j885757J260910J418762j462326j513748
2167G70621872q37021r35287k28043J62735M63409n37185o29120J227722Q19016l85895
$$ plain form
2176.6 769742203 768469620 768789597 770421066 771844940 772495956 771212769 771176376 770512390 769260941
2185.3 769260941 769205475 768319626 767936325 769814682 773107605 772442627 770217743 770304718 771477737
2194 771477737 772668457 772168808 772367706 771551819 772063980 774295654 773274994 772771835 773649979
2202.6 773649979 774174271 772258606 771344299 773751602 773314896 770698013 770960922 773898544 774698944
2211.3 774698944 774578934 773430634 771509247 772674332 773545685 774235382 773792572 773020706 773912354
2220 773912354 773694611 774361038 773465042 770118942 768894196 771075821 773986588 774720917 775306549
2228.7 775306549 775395203 774158554 773115616 772191315 771916428 773393173 774804459 773996811 773167267
2237.4 773167267 773437271 773866043 773761215 773132172 772536316 772396545 773499298 773619308 772568588
$$ packed form
2176.6G69742203j272583L19977J631469J423874O51016j283187l6393o63986j251449
2185.3G69260941n5466q85849l83301J878357L292923o64978k224884Q6975J173019
2194G71477737J190720m99649J98898q15887N12161K231674j020660n03159Q78144
2202.6G73649979N24292j915665r14307K407303m36706k616883K62909K937622Q00400
2211.3G74698944j20010j148300j921387J165085Q71353O89697m42810p71866Q91648
2220G73912354k17743O66427q95996l346100j224746K181625K910767P34329N85632
2228.7G75306549Q8654j236649j042938r24301k74887J476745J411286q07648q29544
2237.4G73167267K70004M28772j04828o29043n95856j39771J102753J20010j050720
$$ plain form
2246 772568588 772496033 772113647 772130966 774682465 776531448 773577118 770045471 770079803 771603165 773497467
2255.7 773497467 775195694 776150742 774632111 772126160 773120499 775510559 776372147 774946671 773695755
2264.4 773695755 774806595 774768524 773781128 773445206 773226318 772906189 772797928 773002930 773322906 774052811
2274 774052811 773187637 771589127 769802246 769768143 773048401 774487762 775467834 776233368 775477371
2282.7 775477371 774831390 773829269 773945389 772972717 770890198 771465759 774033356 774344711 773776245
2291.4 773776245 775070648 775092468 775430603 775637894 775631866 775884094 774505310 773140793 771996994
2300 771996994 774029846 775114517 773727188 772885590 769790268 769694901 772930756 775098953 774030991
2308.7 774030991 772439041 771856537 769193573 769850159 770382690 770467911 772848053 770795593 768097153
$$ packed form
2246G72568588p2555l82386J7319K551499J848983k954330l531647L4332J523362J894302
2255.7G73497467J698227R55048j518631k505951R94339K390060Q61588j425476j250916
2264.4G73695755J110840l8071r87396l35922k18888l20129j08261K05002L19976P29905
2274G74052811q65174j598510j786881l4103L280258J439361R80072P65534p55997
2282.7G75477371o45981j002121J16120r72672k082519N75561K567597L11355n68466
2291.4G73776245J294403K1820L38135K07291o028K52228j378784j364517j143799
2300G71996994K032852J084671j387329q41598l095322r5367L235855K168197j067962
2308.7G74030991j591950n82504k662964O56586N32531Q5221K380142k052460k698440
$$ plain form
2317.4 768097153 768436432 770593185 772234268 771403198 769644928 766880951 764584961 765604324 768319397
2326.1 768319397 769011078 767616730 767249527 771089478 773663864 773040161 772431183 770587692 768335419
2334.8 768335419 765318985 766684036 769552078 768525391 771152267 773399200 769776382 766008301
2342.5 766008301 766999054 770114288 769915085 767656860 768463593 770391693 770521317 772475128 774376068
2351.2 774376068 771386337 769516373 773266907 774679642 769252777 767806168 769944382 767845535
2358.9 767845535 763939514 763197174 761936188 759274063 764475327 768451920 763592072 761421967
2366.6 761421967 763547821 763205185 761940765 765095749 770764008 773077316 773313828 773559265 771476974
2375.3 771476974 771334152 773120956 773296967 774411926 776338348 777860184 777135773 775630341 776178207
$$ packed form
2317.4G68097153L39279K156753J641083q31070j758270k763977k295990J019363K715073
2326.1G68319397O91681j394348l67203L839951K574386o23703o08978j843491k252273
2334.8G68335419l016434J365051K868042j026687K626876K246933l622818l768081
2342.5G66008301R90753L115234j99203k258225Q06733J928100J29624J953811J900940
2351.2G74376068k989731j869964L750534J412735n426865j446609K138214k098847
2358.9G67845535l906021p42340j260986k662125N201264L976593m859848k170105
2366.6G61421967K125854l42636j264420L154984N668259K313308K36512K45437k082291
2375.3G71476974j42822J786804J76011J114959J926422J521836p24411j505432N47866
$$ plain form
2383.9 776178207 776763840 777470322 778322601 778418427 778790970 778725433 777655945 777218399 776873474 776977615
2393.6 776977615 778014984 777435303 776859055 776614227 776444321 777840347 777710419 776630325 777539444
2402.3 777539444 778211288 777071762 776452942 776612396 777416153 778519974 778156891 777932434 777420578
2410.9 777420578 776292267 775714417 775811234 776539841 776820679 777360382 777208481 776935577 777474289 777747955
2420.6 777747955 778536987 777363815 774433594 773742752 775457230 777818756 778408966 776873856 776385651
2429.3 776385651 776697311 776179581 775952454 775218735 774121094 773875961 774802017 775421982 775047073
2438 775047073 775493546 775724869 775056915 774232178 774573364 774928818 775530930 777035828 776006393 774745026
2447.6 774745026 773619919 773407516 774454880 773443222 772806396 772637558 772935791 772461777 772543411
$$ packed form
2383.9G76178207N85633P06482Q52279R5826L72543o5537j069488m37546l44925J04141
2393.6G76977615J037369n79681n76248k44828j69906J396026j29928j080094R09119
2402.3G77539444O71844j139526o18820J59454Q03757J103821l63083k24457n11856
2410.9G77420578j128311n77850R6817P28607K80838N39703j51901k72904N38712K73666
2420.6G77747955P89032j173172k930221o90842J714478K361526N90210j535110m88205
2429.3G76385651L11660n17730k27127p33719j097641k45133R26056O19965l74909
2438G75047073M46473K31323o67954q24737L41186L55454O02112J504898j029435j261367
2447.6G74745026j125107k12403J047364j011658o36826j68838K98233m74014Q1634
$$ plain form
2456.3 772543411 774818954 774569855 773037872 771727982 771128387 771707535 773149567 773489151 772164536
2465 772164536 773265305 774071884 771710205 769039230 770349960 772571411 771991043 771619644 771014786
2473.6 771014786 772094193 772267609 770923691 773182068 774664917 772763901 769801788 767733154
2481.3 767733154 767281113 768053818 768369675 769312134 771303787 771020050 770675125 770291290 770096359
2490 770096359 770242691 768306503 767883377 769811630 770687561 769421539 768258133 767813492 768616714
2498.7 768616714 769426498 767688370 768080978 769266052 768280563 768887405 769042892 766818237 766679687
2507.4 766679687 768300095 767694778 766357651 766270599 767677307 767862778 766446457 765359039 762993546
2516.1 762993546 763024139 765046921 764669113 764955139 766296158 766017914 765904312 766384277 765180969
$$ packed form
2456.3G72543411K275543k49099j531983j309890n99595N79148J442032L39584j324615
2465G72164536J100769Q06579k361679k670975J310730K221451n80368l71399o04858
2473.6G71014786J079407J73416j343918K258377J482849j901016k962113k068634
2481.3G67733154m52041P72705L15857R42459J991653k83737l44925l83835j94931
2490G70096359J46332j936188m23126J928253Q75931j266022j163406m44641Q03222
2498.7G68616714Q09784j738128L92608J185074r85489O06842J55487k224655j38550
2507.4G66679687J620408o05317j337127q7052J406708J85471j416321j087418k365493
2516.1G62993546L0593K022782l77808K86026J341019k78244j13602M79965j203308
$$ plain form
2524.7 765180969 764876251 765648499 765184479 764883652 764790878 764786987 765083694 764509506 763809357 764958954
2534.4 764958954 765424118 765805283 766516342 763984070 762338715 762253571 762643814 764552994 765599823
2543.1 765599823 765042191 762674789 761919022 763028717 763878250 764425201 763331985 762967987 763272324
2551.7 763272324 762728806 762019958 761576920 761953506 762396545 763103790 763971405 763882980 763253937 763137970
2561.4 763137970 763236237 764003983 764489441 761784515 759362488 761011124 762471695 760772018 760007706
2570.1 760007706 761235199 760929108 759685211 760306473 762120056 761933975 760896683 761515961 761868744
2578.7 761868744 761059875 760536652 760134583 759676361 760710754 760818481 758808212 758892212 759189606
2587.4 759189606 757774048 758440323 759639359 759509888 759981003 760106964 759593811 758724976 758225784
$$ packed form
2524.7G65180969l04718P72248m64020l00827r2774l891K96707n74188p00149J149597
2534.4G64958954M65164L81165P11059k532272j645355q5144L90243J909180J046829
2543.1G65599823n57632k367402p55767J109695Q49533N46951j093216l63998L04337
2551.7G63272324n43518p08848m43038L76586M43039P07245Q67615q8425o29043j15967
2561.4G63137970R8267P67746M85458k704926k422027J648636J460571j699677p64312
2570.1G60007706J227493l06091j243897O21262J813583j86081j037292O19278L52783
2578.7G61868744q08869n23223m02069m58222J034393J07727k010269Q4000K97394
2587.4G59189606j415558O66275J199036j29471M71115J25961n13153q68835m99192
$$ plain form
2596.1 758225784 758962784 758696365 757854462 757336578 756727066 756564789 756351395 756076126 756394806 757743530
2605.7 757743530 758379745 757964783 758120804 758138046 758168793 758270340 758604660 759481277 758560638 756906586
2615.4 756906586 757927170 758371506 755767365 754218903 754257507 753865356 754367371 754975281 753579407
2624.1 753579407 753153381 754239349 754221725 754621887 755429840 755852127 754990997 753075790 753706741
2632.8 753706741 754992523 753321075 750946045 751635361 753315659 752029572 750573730 751179428 750852890
2641.4 750852890 750035324 751569061 751394043 748473816 747834625 749023056 751193695 752883911 751847610
2650.1 751847610 749897690 749041519 749646072 748182144 745535660 746649933 748161316 748760986 749407806
2658.8 749407806 748186264 747365570 747050552 747411957 747520370 745057983 744586182 745572739 746289749
$$ packed form
2596.1G58225784P37000k66419q41903n17884o09512j62277k13394k75269L18680J348724
2605.7G57743530O36215m14962J56021J7242L0747J01547L34320Q76617r20639j654052
2615.4G56906586J020584M44336k604141j548462L8604l92151N02015O07910j395874
2624.1G53579407m26026J085968j7624M00162Q07953M22287q61130j915207O30951
2632.8G53706741J285782j671448k375030O89316J680298j286087j455842O05698l26538
2641.4G50852890q17566J533737j75018k920227o39191J188431K170639J690216j036301
2650.1G51847610j949920q56171O04553j463928k646484J114273J511383N99670O46820
2658.8G49407806j221542q20694l15018L61405J08413k462387m71801R86557P17010
$$ plain form
2667.5 746289749 747618942 747950974 748744125 749165268 748880539 748310852 746935959 746728287 746956100
2676.1 746956100 746721802 746385956 746711349 747223053 746447754 744984741 743064651 742600021 743724442
2684.8 743724442 743787079 744787750 747159500 746045227 742734604 742297363 742941589 743272324 744124908
2693.5 744124908 744872513 745026169 743329163 742753296 743996964 743410416 742012558 740266342 739417038
2702.2 739417038 739370270 738569107 739378662 741038284 741569595 739826813 738785019 740347366 740274124
2710.9 740274124 740270538 741480331 741563873 739866943 737846832 737558517 738028030 739539490 740870056
2719.5 740870056 740674896 738662567 736875839 737363358 736927414 736968002 737598953 737050705 736309204
2728.2 736309204 735694656 735985336 736305542 736637573 734922562 733008575 734143143 733622589 732520065
$$ packed form
2667.5G46289749J329193L32032P93151M21143k84729n69687j374893k07672K27813
2676.1G46956100k34298l35846L25393N11704p75299j463013j920090m64630J124421
2684.8G43724442O2637J000671K371750j114273l310623m37241O44226L30735Q52584
2693.5G44124908P47605J53656j697006n75867J243668n86548j397858j746216q49304
2702.2G39417038m6768q01163Q09555J659622N31311j742782j041794J562347p3242
2710.9G40274124l586J209793Q3542j696930k020111k88315M69513J511460J330566
2719.5G40870056j95160k012329j786728M87519m35944M0588O30951n48248p41501
2728.2G36309204o14548K90680L20206L32031j715011j913987J134568n20554j102524
$$ plain form
2736.9 732520065 735076218 736619263 733777847 732200089 732586060 732339096 732411346 732929993 734344025
2745.6 734344025 734107513 733163757 733394318 732814484 731922379 732046890 732170334 730460968 730695038
2754.3 730695038 731630783 730411530 729696045 729541931 730774231 730274353 728586349 729466553 730608292
2762.9 730608292 730990677 729627762 728080978 728574982 729016876 729208145 730248337 729152222 726779938
2771.6 726779938 726564713 726351547 724856873 723969727 726359787 728156433 727384415 726746597 724484024
2780.3 724484024 723093796 722981262 722898712 723861542 724290009 723078308 722062073 722364807 720492935
2789 720492935 720001450 722189102 722521820 722046661 721200485 720961227 720880356 720274963 719703369 720161438
2798.6 720161438 719856491 717117157 715725708 714781189 714649582 715294876 716228638 717042160 714365540
$$ packed form
2736.9G32520065K556153J543045k841416j577758L85971k46964P2250N18647J414032
2745.6G34344025k36512r43756K30561n79834q92105J24511J23444j709366K34070
2754.3G30695038R35745j219253p15485j54114J232300m99878j688004Q80204J141739
2762.9G30608292L82385j362915j546784M94004M41894J91269J040192j096115k372284
2771.6G26779938k15225k13166j494674q87146K390060J796646p72018o37818k262573
2780.3G24484024j390228j12534q2550R62830M28467j211701j016235L02734j871872
2789G20492935m91485K187652L32718m75159q46176k39258q0871o05393n71594M58069
2798.6G20161438l04947k739334j391449r44519j31607O45294R33762Q13522k676620
$$ plain form
2807.3 714365540 713927460 715690155 714942245 714159546 713106537 711546249 711391830 711006165 710200424
2816 710200424 711286926 710875244 711494370 713191833 710076294 707750397 707714386 708187103 708345108
2824.7 708345108 707169952 707538376 707828064 708061600 708176727 705494614 702833862 702022552 701307678
2833.3 701307678 702117996 703073502 701437378 700037460 698660278 698341293 698872299 696675568 694395676
2842 694395676 692246628 689168472 687092133 686318588 685360794 683467331 682300720 681916962 681322784
2850.7 681322784 679645157 677301941 676296158 675805130 675195389 675917358 676785355 676210022 676096191
2859.4 676096191 677821350 678328857 677105103 677507172 676953659 675130539 674297104 672716370 671802750
2868.1 671802750 670746536 669322586 669411087 669293060 668138885 667904282 668914337 667543945 667340088
$$ packed form
2807.3G14365540m38080J762695p47910p82699j053009j560288j54419l85665q05741
2816G10200424J086502m11682O19126J697463l115539k325897l6011M72717J58005
2824.7G08345108j175156L68424K89688K33536J15127k682113k660752q11310p14874
2833.3G01307678Q10318R55506j636124j399918j377182l18985N31006k196731k279892
2842F94395676k149048l078156k076339p73545r57794j893463j166611l83758n94178
2850.7F81322784j677627k343216j005783m91028o09741P21969Q67997n75333j13831
2859.4F76096191J725159N07507j223754M02069n53513j823120q33435j580734r13620
2868.1F71802750j056214j423950Q8501j18027j154175k34603J010055j370392k03857
$$ plain form
2876.7 667340088 669662628 669534760 668797684 667751083 665744476 663780060 664012527 665995102 665691833
2885.4 665691833 664449844 662038803 659625626 660757141 662527771 661954269 659381638 656998444
2893.1 656998444 657304306 658875427 658107605 657290726 657309952 655661163 655468903 654612808 651680374
2901.8 651680374 653178329 655176468 652255020 649830933 650328522 650761108 650110321 649009705 646855164
2910.5 646855164 645057907 644304123 642601242 642759018 644749069 644918747 642803268 639874687 638597565
2919.2 638597565 636788788 634203415 634424858 637282448 638775749 637835922 637725716 636738052 635874367
2927.8 635874367 636158752 636677437 638763046 637882385 635359306 634440956 634256516 636045227 637719345
2936.5 637719345 638930092 640130463 640172272 639887390 640194168 641718521 642856522 643055649 644164200
$$ packed form
2876.7F67340088K322540j27868p37076j046601k006607j964416K32467J982575l03269
2885.4F65691833j241989k411041k413177J131515J770630n73502k572631k383194
2893.1F56998444L05862J571121p67822q16879J9226j648789j92260q56095k932434
2901.8F51680374J497955J998139k921448k424087M97589M32586o50787j100616k154541
2910.5F46855164j797257p53784j702881J57776J990051J69678k115479k928581j277122
2919.2F38597565j808777k585373K21443K857590J493301r39827j10206r87664q63685
2927.8F35874367K84385N18685K085609q80661k523079r18350j84440J788711J674118
2936.5F37719345J210747J200371M1809k84882L06778J524353J138001J99127J108551
$$ plain form
2945.2 644164200 643546982 640952606 641120834 642614670 642874680 642312164 641044693 639332199 637544632
2953.9 637544632 637596779 638998833 639772491 639335480 638965416 641154022 642706604 639977150 637653046
2962.6 637653046 638251305 638048782 639356537 642167587 642299805 642486191 643137665 643548355 644812469
2971.2 644812469 646265182 647743073 648948441 649219818 647938309 647962112 649949570 650166626 649912491
2979.9 649912491 651337280 652806320 654293747 655451736 655613785 656731110 656926651 656509094 657599716
2988.6 657599716 657285538 657291260 659314346 661427994 661534119 659263153 658464203 660781937 663126907
2997.3 663126907 661777344 661293793 663988876 663106613 660284500 658355026 656935196 658499527 659494019
3006 659494019 656843338 656088028 659410629 661218109 660822220 661280518 660896835 661016693 662543488
$$ packed form
2945.2F44164200o17218k594376J68228J493836K60010n62516j267471j712494j787567
2953.9F37544632N2147J402054P73658m37011l70064K188606J552582k729454k324104
2962.6F37653046N98259k02523J307755K811050J32218J86386O51474M10690J264114
2971.2F44812469J452713J477891J205368K71377j281509K3803J987458K17056k54135
2979.9F49912491J424789J469040J487427J157989J62049J117325J95541m17557J090622
2988.6F57599716l14178N722K023086K113648J06125k270966p98950K317734K344970
2997.3F63126907j349563m83551K695083q82263k822113j929474j419830J564331R94492
3006F59494019k650681p55310L322601J807480l95889M58298l83683J19858J526795
$$ plain form
3014.6 662543488 661084976 659077759 659452133 658486938 657412720 658219757 658002701 657692337 658749313
3023.3 658749313 658175278 655898819 654774551 654350967 653033524 652818527 653275681 652592621 653071060
3032 653071060 653078384 652180710 652070847 652214890 652962341 652886200 653045654 651478806 648843231 649362106
3041.6 649362106 647578125 646215363 648130264 647265015 645867767 646343842 647307510 648139572 647889709
3050.3 647889709 646162796 644748001 644922256 644783478 644365463 644413147 643388214 640776138 638395538
3059 638395538 638651848 640977554 641697235 640302124 639228249 639781227 641067505 641467667 640748215
3067.7 640748215 637326050 634406776 635514755 636713982 637337074 637105522 635913315 635844917 636577530
3076.4 636577530 636468430 634092522 632637482 632191429 631214561 632300873 633067932 630902214 628520927
$$ packed form
3014.6F62543488j458512k007217L74374r65195j074218Q07037k17056l10364J056976
3023.3F58749313n74035k276459j124268m23584j317443k14997M57154o83060M78439
3032F53071060P324q97674j09863J44043P47451p6141J59454j566848k635575N18875
3041.6F49362106j783981j362762J914901q65249j397248M76075R63668Q32062k49863
3050.3F47889709j726913j414795J74255j38778m18015M7684j024933k612076k380600
3059F38395538K56310K325706P19681j395111j073875N52978J286278M00162p19452
3067.7F40748215l422165k919274J107979J199227O23092k31552j192207o8398P32613
3076.4F36577530j09100k375908j455040m46053r76868J086312P67059k165718k381287
$$ plain form
3085 628520927 629715271 633173981 632896347 631126213 631553154 630147514 629343872 629716339 626929626
3093.7 626929626 625217209 625798912 626065140 625464020 626479607 628228645 626142998 624398804 622645683
3102.4 622645683 619591331 619250107 620944939 622383842 621673584 620855942 620090218 619157600 618940849
3111.1 618940849 618547211 618238449 616351089 615706940 616628380 615433617 614003601 614099541 615322609
3119.8 615322609 614977531 613102226 611536713 610708733 610903015 611764221 611824760 609646568 608032494
3128.4 608032494 607481689 606792412 608138657 609487228 607022858 603741379 602864342 602424965 601427498
3137.1 601427498 600918503 601608849 601136131 599287987 598965034 599041328 598626595 597796783 596498985
3145.8 596498985 594643936 593760147 594145088 592663994 590886040 590992737 591575279 588847122 586110573
$$ packed form
3085F28520927J194344L458710k77634j770134M26941j405640q03642L72467k786713
3093.7F26929626j712417N81703K66228o01120J015587J749038k085647j744194j753121
3102.4F22645683l054352l41224J694832J438903p10258q17642p65724r32618k16751
3111.1F18940849l93638l08762j887360o44149R21440j194763j430016R5940J223068
3119.8F15322609l45078j875305j565513q27980J94282Q61206O0539k178192j614074
3128.4F08032494n50805o89277J346245J348571k464370l281479q77037m39377r97467
3137.1F01427498n08995O90346m72718j848144l22953P6294m14733q29812j297798
3145.8E96498985j855049q83789L84941j481094j777954J06697N82542k728157k736549
$$ plain form
3154.5 586110573 588168983 588680458 586855240 584897499 583407555 583280678 582280884 582348595 581677704
3163.1 581677704 579462128 579850426 580002670 578257179 577980957 579158173 578755913 577823677 577425995
3171.8 577425995 574895172 572752304 573160896 573549805 574323692 574178581 571866837 569546814 567657928
3180.5 567657928 566946106 566152802 565311890 565907059 565315361 562639465 560067139 559032211 558931313
3189.2 558931313 559389725 559254303 559109421 560254593 559700203 557482605 555520668 555848885 555723648
3197.9 555723648 551923256 550507622 551434822 551263199 550576019 549557076 548979721 548722572 547378960
3206.5 547378960 544974442 543058815 542174606 543590813 543442802 541237144 542098198 541717949 540109825
3215.2 540109825 540582924 540614243 539914780 539890556 540519753 539361038 537816582 536507950 534551125
$$ packed form
3154.5E86110573K058410N11475j825218j957741j489944j26877r99794O7711o70891
3163.1E81677704k215576L88298J52244j745491k76222J177216m02260r32236l97682
3171.8E77425995k530823k142868M08592L88909P73887j45111k311744k320023j888886
3180.5E67657928p11822p93304q40912N95169n91698k675896k572326j034928j00898
3189.2E58931313M58412j35422j44882J145172n54390k217598j961937L28217j25237
3197.9E55723648l800392j415634R27200j71623o87180j018943n77355k57149j343612
3206.5E47378960k404518j915627q84209J416207j48011k205658Q61054l80249j608124
3215.2E40109825M73099L1319o99463k4224O29197j158715j544456j308632j956825
$$ plain form
3223.9 534551125 534361382 534902382 533731308 532316437 531423035 528443069 526744614 528262634 528514099
3232.6 528514099 528250618 528646431 528063126 525864143 525732574 527332726 525549011 522493744 520491447
3241.3 520491447 519872131 519994888 519024429 517862740 517401581 517393456 516852303 516497231 517324944 517161255
3250.9 517161255 514428253 512544518 512625198 511386719 511809425 514651909 514960861 512844582 510886841
3259.6 510886841 510534325 511473579 510616302 507636185 506547356 506496124 505354500 505832863 506993294
3268.3 506993294 506419029 505794601 506346016 505831413 503172760 500136299 499343491 501047707 500811539
3276.9 500811539 499460869 500330849 500665054 499141464 497039642 496991692 497978325 496842155 496342926
3285.6 496342926 495909348 493313408 491971054 492523842 492534714 491586952 490812454 490853386 489845467
$$ packed form
3223.9E34551125j89743N41000j171074j414871q93402k979966j698455J518020K51465
3232.6E28514099k63481L95813n83305k198983j31569J600152j783715l055267k002297
3241.3E20491447o19316J22757r70459j161689m61159q125n41153l55072Q27713j63689
3250.9E17161255k733002j883735Q0680j238479M22706K842484L08952k116279j957741
3259.6E10886841l52516R39254q57277k980117j088829n1232j141624M78363J160431
3268.3E06993294n74265o24428N51415n14603k658653l036461p92808J704216k36168
3276.9E00811539j350670Q69980L34205j523590k101822m7950R86633j136170m99229
3285.6D96342926m33578k595940j342354N52788J0872r47762p74498M0932j007919
$$ plain form
3294.3 489845467 489341087 490640335 490219078 489926567 490323410 489535141 489068184 487278824 486084900
3303 486084900 486821861 486677284 486112289 485516014 485897980 485103493 482451935 482457314 483568649 482585831
3312.6 482585831 480129738 478126183 477078209 476816254 476727409 475410309 475021172 475342674 473699074
3321.3 473699074 472451706 472381401 471398354 471552734 473615303 472458954 468337288 467136993 467520828
3330 467520828 466451378 465661278 464989357 463870392 463242722 463261909 463777199 463549805 462254562 459716873
3339.6 459716873 457054749 455928154 454992981 455271111 455430641 451920204 448746262 450265770 452056351
3348.3 452056351 450675774 450379143 449735947 447111664 446560936 445765572 445007477 446142540 445096054
3357 445096054 443002968 441836281 439968796 440085869 441621742 440375214 438373375 436875114 436448822
$$ packed form
3294.3D89845467n04380J299248m21257k92511L96843p88269m66957j789360j193924
3303D86084900P36961j44577n64995n96275L81966p94487k651558N379J111335r82818
3312.6D82585831k456093k003555j047974k61955q8845j317100l89137L21502j643600
3321.3D73699074j247368p0305r83047J54380K062569j156349m121666j200295L83835
3330D67520828j069450p90100o71921j118965o27670J9187N15290k27394j295243k537689
3339.6D59716873k662124j126595r35173K78130J59530l510437l173942J519508J790581
3348.3D52056351j380577k96631o43196k624283n50728p95364p58095J135063j046486
3357D45096054k093086j166687j867485J17073J535873j246528k001839j498261m26292
$$ plain form
3365.7 436448822 437150917 436717033 435832100 433896942 430706596 428440704 428286514 429210014 429793015
3374.3 429793015 430031776 428941765 427349091 426784668 427190666 426299667 422419128 420337143 422240715
3383 422240715 421808662 418813286 419572983 419856339 418570061 419266090 419336891 420339012 419683266 418141899
3392.7 418141899 418876877 417254791 416467361 416285782 414211502 412643433 412259026 414169044 415120277
3401.3 415120277 413306923 412018547 410617867 408760033 409732704 410319328 409519043 409386826 407366486
3410 407366486 407672157 408394318 407084770 408402672 408688850 407142525 406738586 407318306 406127472
3418.7 406127472 406176262 409017105 407345314 406032333 407194824 407521667 408342171 407678947 406983185
3427.4 406983185 407133751 406991234 406075287 404577827 405222778 406548729 406009560 404634628 404195023
$$ packed form
3365.7D36448822P02095m33884q84933j935158l190346k265892j54190R23500N83001
3374.3D29793015K38761j090011j592674n64423M05998q90999l880539k081985J903572
3383D22240715m32053k995376P59697K83356j286278O96029P0801J002121o55746j541367
3392.7D18141899P34978j622086p87430j81579k074280j568069l84407J910018R51233
3401.3D15120277j813354j288376j400680j857834R72671N86624q00285j32217k020340
3410D07366486L05671P22161j309548J317902K86178j546325m03939N79720j190834
3418.7D06127472M8790K840843j671791j312981J162491L26843Q20504o63224o95762
3427.4D06983185J50566j42517r15947j497460O44951J325951n39169j374932m39605
$$ plain form
3436.1 404195023 405394096 407971992 409199715 407571793 407157364 409186668 409755211 408019638 407349663
3444.7 407349663 408757172 409378738 408231506 407992287 407875061 407263374 408741570 411015854 411260986
3453.4 411260986 411232834 413001709 415932388 418293190 416961479 414892387 416301994 415283928 412993622
3462.1 412993622 415165100 418436470 419299583 417836266 417875557 419017944 419961433 421956482 422577477
3470.8 422577477 422316170 422893448 424937057 426146355 424756966 424191551 424210739 423996468 424387207
3479.5 424387207 426584396 429938393 430133553 428347511 428527679 430281487 432434158 433158607 431838722
3488.1 431838722 432634850 437017784 439115181 436820145 435907440 437073326 438483391 441319160 442299614
3496.8 442299614 441543121 442018623 441971664 440424271 440216942 442115440 440694466 441707153 446914177
$$ packed form
3436.1D04195023J199073K577896J227723j627922m14429K029304N68543j735573o69975
3444.7D07349663J407509O21566j147232k39219j17226o11687J478196K274284K45132
3453.4D11260986k8152J768875K930679K360802j331711k069092J409607j018066k290306
3462.1D12993622K171478L271370Q63113j463317L9291J142387R43489J995049O20995
3470.8D22577477k61307N77278K043609J209298j389389n65415J9188k14271L90739
3479.5D24387207K197189L353997J95160j786042J80168J753808K152671P24449j319885
3488.1D31838722P96128M382934K097397k295036r12705J165886J410065K835769R80454
3496.8D42299614p56493M75502m6959j547393k07329J898498j420974J012687N207024
$$ plain form
3505.5 446914177 447391548 448249664 450929642 450412178 449579773 450527306 452619705 453278503 452698174
3514.2 452698174 452222633 451925011 454354057 457146339 458633575 460449524 460657120 462384911 464961014
3522.9 464961014 462728310 462659416 465675049 467392693 467604904 466481705 467026901 468031006 469538612
3531.5 469538612 472535057 474403267 475061455 475855179 477520905 477133827 476640320 477999992 478317413
3540.2 478317413 479946594 482826500 484589157 485814743 485663567 485153618 485713921 487062683 489404984
3548.9 489404984 491432991 492815590 493412514 492975960 495328178 498051682 498015251 498736725 500425339
3557.6 500425339 502114944 505149879 506162910 503410492 504916649 508861809 509324837 511656837
3565.3 511656837 514216042 514071236 512423744 512564087 516135292 517488518 519413834 521762543 522421227
$$ packed form
3505.5D46914177M77371Q58116K679978n17464q32405R47533K092399O58798n80329
3514.2D52698174m75541k97622K429046K792282J487236J815949K07596J727791K576103
3522.9D64961014k232704o8894L015633J717644K12211j123199N45196J004105J507606
3531.5D69538612K996445J868210O58188P93724J665726l87078m93507J359672L17421
3540.2D78317413J629181K879906J762657J225586j51176n09949N60303J348762K342301
3548.9D89404984K028007J382599N96924m36554K352218K723504l6431P21474J688614
3557.6E00425339J689605L034935J013031k752418J506157L945160M63028K332000
3565.3E11656837K559205j44806j647492J40343L571205J353226J925316K348709O58684
$$ plain form
3574 522421227 523859978 525857468 526548347 525807762 529300194 531958008 532340240 534649353 535174026
3582.6 535174026 537797585 540512466 542045860 544144554 544676514 545561752 545255775 548438339 550974312
3591.3 550974312 552659760 555181084 557372398 561813698 561360588 562294388 564419174 563215523 566086655
3600 566086655 568910255 571761665 574839439 576537819 577327118 579363518 584495811 587367439 590900917
3608.7 590900917 586895256 583366737 590465393 592069283 591808510 597642479 599173126 600760803
3616.4 600760803 602969627 605098915 611920319 614394112 609457703 609269066 612864227 615222130
3624.1 615222130 618535042 623152046 625789680 632316971 643132095 633185120 626855431 627942848
3631.8 627942848 633129578 636181335 635670433 639405823 644660797 647605515 647465820 649182739 651051559
$$ packed form
3574E22421227J438751J997490O90879p40585L492432K657814L82232K309113N24673
3582.6E35174026K623559K714881J533394K098694N31960Q85238l05977L182564K535973
3591.3E50974312J685448K521324K191314M441300m53110R33800K124786j203651K871132
3600E66086655K823600K851410L077774J698380P89299K036400N132293K871628L533478
3608.7E90900917m005661l528519P098656J603890k60773N833969J530647J587677
3616.4F00760803K208824K129288O821404K473793m936409j88637L595161K357903
3624.1F15222130L312912M617004K637634O527291J0815124r946975o329689J087417
3631.8F27942848N186730L051757n10902L735390N254974K944718j39695J716919J868820
$$ plain form
3640.5 651051559 652219009 654224701 654258575 654204330 656738663 664075241 665068359 663804855 673669128
3649.2 673669128 671333084 663608856 661761856 666052246 670391235 676400070 684524689 674636154
3656.9 674636154 674004364 679540253 680089035 681834564 682790604 684733047 686505966 688289871 689762192
3665.6 689762192 691507034 696693649 698473969 698435059 701373901 694101181 689881363 695080948 705524445
3674.3 705524445 710348129 693356781 692273636 701806335 710246582 708416519 704658356 705337906
3682 705337906 706677017 706918640 705934143 704302216 708391953 718418808 712819824 707818069 716853638
3690.6 716853638 710914459 705839386 709489975 708697815 708146133 710411453 713638611 714236374 712296829
3699.3 712296829 715297089 720723877 716525345 711780548 715864868 718235321 718944244 721077499
$$ packed form
3640.5F51051559J167450K005692L3874n4245K534333P336578R93118j263504R864273
3649.2F73669128k336044p724228j847000M290390M338989O008835Q124619r888535
3656.9F74636154o31790N535889N48782J745529R56040J942443J772919J783905J472321
3665.6F89762192J744842N186615J780320l8910K938842p272720m219818N199585J0443497
3674.3G05524445M823684j6991348j083145R532699Q440247j830063l758163O79550
3682G05337906J339111K41623r84497j631927M089737J0026855n598984n001755R035569
3690.6G16853638n939179n075073L650589p92160n51682K265320L227158N97763j939545
3699.3G12296829L000260N426788m198532m744797M084320K370453P08923K133255
$$ plain form
3707 721077499 723795242 726617737 719642410 725051346 734276123 718953171 718335571 720807343 721824875
3715.7 721824875 725019531 726496277 727415543 726150894 727027435 732302246 727555847 719677963 724952087
3724.4 724952087 728468170 728055344 724152527 723961258 730240860 732120209 736920776 734988708 724724579
3733.1 724724579 731158295 734356918 730451431 725761566 724683304 726512299 729774551 733901978
3740.8 733901978 730115051 733802338 746888504 734305878 718989792 730086212 735917435 743692627
3748.5 743692627 743514404 726220627 734946594 734385986 726236572 730107346 732060623 736806564
3756.2 736806564 735337982 737189865 741565552 731638336 729334564 732697601 733733444 734957581
3763.9 734957581 738749237 735813828 729705734 732699890 736484909 734681168 727932129 731531677
$$ packed form
3707G21077499K717743K822495o975327N408936R224777j5322952o17600K471772J017532
3715.7G21824875L194656J476746R19266j264649Q76541N274811m746399p877884N274124
3724.4G24952087L516083m12826l902817j91269O279602J879349M800567j932068j0264129
3733.1G24724579O433716L198623l905487m689865j078262J828995L262252M127427
3740.8G33901978l786927L687287J3086166j2582626j5316086J1096420N831223P775192
3748.5G43692627j78223j7293777Q725967n60608q149414L870774J953277M745941
3756.2G36806564j468582J851883M375687r927216k303772L363037J035843J224137
3763.9G34957581L791656k935409o108094K994156L785019j803741o749039L599548
$$ plain form
3771.7 731531677 734530334 734003220 735728073 736820297 737737198 736904526 740247269 741455002 732176590
3780.3 732176590 732801971 732863235 734313354 739410248 736270828 732805328 733861618 734784164 735089874
3789 735089874 735713730 735920563 735083618 734799881 736071701 738924942 740542221 736966095 733181000
3797.7 733181000 733283691 736236496 743566360 742509918 729420242 731378098 732049255 733406906
3805.4 733406906 740638428 736816406 732320099 736542358 736786499 734282761 734155807 734722061 735698166
3814.1 735698166 741698685 743788834 730515976 732231903 737118378 742957153 751904526 736122589
3821.8 736122589 729535446 735402908 737720566 738387222 739148560 737101135 735604553 732409592 733288879
3830.5 733288879 739117050 733584137 733496780 740002975 734127350 732772217 744422226 743117523
$$ packed form
3771.7G31531677K998657n27114J724853J092224R16901q32672L342743J207733r278412
3780.3G32176590O25381O1264J450119N096894l139420l465500J056290R22546L05710
3789G35089874O23856K06833q36945k83737J271820K853241J617279l576126l785095
3797.7G33181000J02691K952805P329864j056442j3089676J957856O71157J357651
3805.4G33406906P231522l822022m496307M222259K44141k503738j26954N66254R76105
3814.1G35698166O000519K090149j3272858J715927M886475N838775Q947373j5781937
3821.8G36122589o587143N867462K317658O66656P61338k047425j496582l194961Q79287
3830.5G33288879N828171n532913q7357O506195n875625j355133J1650009j304703
$$ plain form
3838.2 743117523 736424713 743722534 741436768 737567825 739060135 734138718 731667252 735863571
3845.9 735863571 738513565 737914658 738339920 738656082 741764755 747241974 743130341 747022934 733657532
3854.6 733657532 726199265 734869766 736360092 734831085 738253250 741682510 744832611 739682465
3862.3 739682465 737028809 743451080 739438858 732175369 734094772 739226913 748281021 744234238
3870 744234238 732574539 733053970 737362976 740423965 731554184 731360016 734241562 733035278 735019760
3878.7 735019760 742990799 744325256 734193268 736514587 739270630 741245041 744063721 732981644
3886.4 732981644 732166214 734796906 736437836 740551071 742595139 736350555 733229065 735419312
3894.1 735419312 735329590 737145844 738158264 740150223 745182037 738281708 739238129 737670670 731128616
$$ packed form
3838.2G43117523o692810P297821k285766l868943J492310m921417k471466M196319
3845.9G35863571K649994n98907M25262L16162L108673N477219m111633L892593j3365402
3854.6G33657532p458267Q670501J490326j529007L422165L429260L150101n150146
3862.3G39682465k653656O422271m012222p263489J919403N132141R054108m046783
3870G44234238j1659699M79431M309006L060989q869781j94168K881546j206284J984482
3878.7G35019760P971039J334457j0131988K321319K756043J974411K818680j1082077
3886.4G32981644q15430K630692J640930M113235K044068o244584l121490K190247
3894.1G35419312q9722J816254J012420J991959N031814o900329R56421j567459o542054
$$ plain form
3902.8 731128616 738260880 738909760 733945160 730797958 730593872 734747314 738701324 740703049 739896698
3911.5 739896698 738557663 736908035 737346573 740513306 742626266 741459732 735193710 735161057 737194138
3920.2 737194138 735273514 739497910 742074509 740586548 737164307 731092224 732997742 737321167
3927.9 737321167 739876251 739544144 737397995 737441177 733283234 732136688 735204468 735031204 733428116
3936.6 733428116 733344269 733404007 731518326 731944046 736189880 739726105 735209198 733449478 736546173
3945.2 736546173 735517044 736553345 735802002 734776154 735699005 733109589 735398102 737537460 736769638
3953.9 736769638 735124512 734009705 736097641 737343063 737733231 736405945 737081146 737046051 733658295
3962.6 733658295 734179611 734268112 734296646 735702133 736175995 736511612 735230255 734260788 735242081 734361649
$$ packed form
3902.8G31128616P132264O48880m964600l147202k04086M153442L954010K001725q06351
3911.5G39896698j339035j649628M38538L166733K112960j166534o266022l2653K033081
3920.2G37194138j920624M224396K576599j487961l422241o072083J905518M323425
3927.9G37321167K555084l32107k146149M3182m157943j146546L067780j73264j603088
3936.6G33428116q3847N9738j885681M25720M245834L536225m516907j759720L096695
3945.2G36546173j029129J036301p51343j025848R22851k589416K288513K139358p67822
3953.9G36769638j645126j114807K087936J245422L90168j327286O75201l5095l387756
3962.6G33658295N21316Q8501K8534J405487M73862L35617j281357r69467R81293q80432
$$ plain form
3972.2 734361649 731904678 731585464 732111435 732766724 732841873 733877029 736074982 736077271 736339645 736549377
3981.9 736549377 734796906 733072357 732513199 732655029 735790176 739603348 738275604 736880035 736481476
3990.6 736481476 735335236 734436569 734437866 736697769 736994934 735933228 735114136 735248795 736993637
3999.2 736993637 738406143
4000.2 738406143
$$ packed form
3972.2G34361649k456971l19214N25971O55289P5149J035156K197953K289K62374K09732
3981.9G36549377j752471j724549n59158J41830L135147L813172j327744j395569l98559
3990.6G36481476j146240q98667J297K259903K97165j061706q19092J34659J744842
3999.2G36993637J412506
4000.2G38406143
##END=$$ End of the data block
