##TITLE=$$ Begin of the data block
##JCAMP-DX=5.00 $$ ACD/SpecManager v 10.08
##SPECTROMETER/DATA SYSTEM=Varian
##DATE=07 Jan 2013 10:07:26
##DATA TYPE=INFRARED SPECTRUM
##DATA CLASS=XYDATA
##ORIGIN=
##OWNER=
##NPOINTS=3735
##FIRSTX=399.26403809
##LASTX=4000.35498047
##MAXX=4000.35498047
##MINX=399.26403809
##MAXY=85.75189972
##MINY=13.84290791
##XFACTOR=1.0000000000
##YFACTOR=0.000000100000000
##FIRSTY=66.06665039
##DELTAX=0.96440572
##XUNITS=1/CM
##YUNITS=TRANSMITTANCE
##XYDATA=(X++(Y..Y))
$$ plain form
399.3 660666504 690680542 653827744 637236023 643245621 776244049 727783661 505184860
406 505184860 446345482 453331718 502435989 531497536 519534721 664349899 789827271 744351501
413.7 744351501 688464127 576216660 495162125 539809952 587382812 700702667 718756332
420.5 718756332 657687225 785710907 741203003 559941826 692729263 857518997 827608719
427.2 827608719 701716385 619922714 559397354 449707260 431396255 486488266 543270226
434 543270226 586553116 621799393 605747871 505911598 519211884 542565346 504346428 568759422
441.7 568759422 656759415 703797913 738310165 681681900 571113701 529374275 594197617
448.4 594197617 640210342 656146851 674598312 605888596 488437347 527390480 660766525
$$ packed form
399.3F60666504L0014038l6852798j6591721O009598J32998428m8460388k22598801
406E05184860n8839378O986236M9104271K9061547j1962815J44815178J25477372m5475770
413.7G44351501n5887374j12247467q1054535M4647827M7572860J13319855J8053665
420.5G18756332o1069107J28023682m4507904j81261177J32787437J64789734k9910278
427.2H27608719j25892334q1793671o0525360j09690094j8311005N5092011N6781960
434E43270226M3282890L5246277j6051522r9836273J3300286K3353462l8218918O4412994
441.7E68759422Q7999993M7038498L4512252n6628265j10568199m1739426O4823342
448.4E94197617M6012725J5936509J8451461o8709716j17451249L8953133J33376045
$$ plain form
455.2 660766525 694692764 642884674 616334457 661056900 610509796 512700844 563931198
462 563931198 576656494 540723915 662290421 702906342 546497459 488975410 578260384
468.7 578260384 628784065 625411148 600826645 512704811 566797752 609856873 573070526 557220306
476.4 557220306 562756615 576746292 615820274 683856125 660773087 666820908 661163177 617495079
484.1 617495079 717475510 691624908 583764114 549602318 524946365 563457451 591124611
490.9 591124611 619972992 650451660 660057068 628152657 556446114 519967499 506768837 561463661
498.6 561463661 630430298 620029373 621703987 640973129 622355957 610223808 609948425 603816109
506.3 603816109 623991013 603541832 591889381 636364441 643146820 625470467 596251755 598834534
$$ packed form
455.2F60766525L3926239n1808090k6550217M4722443n0547104r7808952N1230354
462E63931198J2725296l5932579J21566506M0615921j56408883n7522049Q9284974
468.7E78260384N0523681l372917k4584503q8121834N4092941M3059121l6786347j5850220
476.4E57220306N536309J3989677L9073982O8035851k3083038O047821n657731m3668098
484.1F17495079R9980431k5850602j07860794l4161796k4655953L8511086K7667160
490.9E91124611K8848381L0478668R605408l1904411p1706543l6478615j3198662N4694824
498.6E61463661O8966637j0400925J674614J9269142j8617172j2132149k75383o132316
506.3F03816109K0174904k0449181j1652451M4475060O782379j7676353k9218712K582779
$$ plain form
514 598834534 604481010 588986359 606686287 576918182 571246681 596924820 585286674 569909897
521.7 569909897 573911705 593583717 579656944 546334267 538370857 582026215 598400764 571252441
529.5 571252441 583818245 575021439 559776878 593779259 607825890 595932274 612400093 631552429
537.2 631552429 597021523 538376427 509660645 546927528 594004745 596276283 607303734 618050613
544.9 618050613 618038559 611831589 596229630 584699669 576829376 575125275 589307404 607839966
552.6 607839966 596877785 581954079 569533691 557933846 562892876 567167358 575572052 574442940
560.3 574442940 572433128 583888817 599284515 610621529 592192497 582363052 596335869 608166847
568 608166847 617820854 597235680 550122452 544628372 579593124 578754463 581774139 616338615
$$ packed form
514E98834534N646476j5494651J7699928k9768105n671501K5678139j1638146j5376777
521.7E69909897M001808J9672012j3926773l3322677p963410M3655358J6374549k7148323
529.5E71252441J2565804q796806j5244561L4002381J4046631j1893616J6467819J9152336
537.2F31552429l4530906n8645096k8715782L7266883M7077217K271538J1027451J0746879
544.9F18050613j2054o206970j5601959j1529961p870293j704101J4182129J8532562
552.6F07839966j0962181j4923706j2420388j1599845M959030M274482Q404694j129112
560.3E74442940k009812J1455689J5395698J1337014j8429032r829445J3972817J1830978
568F08166847R654007k0585174m7113228n494080L4964752q38661L019676L4564476
$$ plain form
575.8 616338615 594727097 563636131 581374550 596705971 596813469 594742012 575018730 578344002
583.5 578344002 585344582 544824219 535997009 569946632 594213219 601932449 596974678 601492004
591.2 601492004 611542282 610930443 605477562 605277176 597379341 572493706 568980141 579379730
598.9 579379730 575696259 570348854 579588280 587943802 574106331 568152351 559024048 528364944
606.6 528364944 527564926 544781685 536076622 513871078 492555847 478662796 472719841 460498352
614.3 460498352 454408340 467634239 459393997 443185997 439524269 428293877 430425148 420519371
622 420519371 402721176 409476013 415181274 420834084 426235199 447393112 474972458 482474709
629.8 482474709 497580986 500523071 483104324 489054413 502854576 500222244 480899734 458439217
$$ packed form
575.8F16338615k1611518l1090966J7738419J5331421J07498k071457j9723282L325272
583.5E78344002P000580m0520363q827210L3949623K4266587P719230m957771M517326
591.2F01492004J0050278o11839n452881k00386p897835k4885635l513565J0399589
598.9E79379730l683471n347405R239426Q355522j3837471n953980r128303l0659104
606.6E28364944q00018J7216759q705063k2205544k1315231j3893051n942955j2221489
614.3D60498352o090012J3225899q240242j6208000l661728j1230392K131271r905777
622D20519371j7798195O754837N705261N652810N401115K1157913K7579346P502251
629.8D82474709J5106277K942085j7418747N950089J3800163k632332j9322510k2460517
$$ plain form
637.5 458439217 449278030 445738602 455575638 476058922 494219398 516182785 529397736 548518867
645.2 548518867 571448822 581895409 595081139 611074448 613382416 601374893 599567642 606756096
652.9 606756096 603324966 596231804 598363762 609802208 611601372 610096970 627100258 638216629
660.6 638216629 624573021 619430542 624473305 620721092 619139938 617572060 613565331 602606506
668.3 602606506 607363548 621191025 628125916 636599236 634772377 614238853 612511292 626274033
676.1 626274033 630859909 629342995 623186836 616969833 632553482 648448486 633003311 621925621
683.8 621925621 620340881 618392372 625867691 627324829 626945686 618437271 613012924 629481964
691.5 629481964 633269577 631705627 628366013 606794968 593904419 600315361 617789688 626030197
$$ packed form
637.5D58439217r161187l539428R837036K0483284J8160476K1963387J3214951J9121131
645.2E48518867K2929955J0446587J3185730J5993309K307968j2007523j807251P188454
652.9F06756096l431130p093162K131958J1438446J799164j504402J7003288J1116371
660.6F38216629j3643608n142479N042763l752213j581154j567878m006729j0958825
668.3F02606506M757042J3827477O934891Q473320j826859k0533524j727561J3762741
676.1F26274033M585876j516914o156159o217003J5583649J5895004j5445175j1077690
683.8F21925621j584740j948509P475319J457138l79143q508415n424347J6469040
691.5F29481964L787613j563950l339614k1571045j2890549O410942J7474327Q240509
$$ plain form
699.2 626030197 621642799 619471016 617860680 616313477 614536324 618843575 622476196 618358994
706.9 618358994 615327606 617613907 619654884 615781975 621436043 630210876 632019119 622004929
714.6 622004929 608128242 619128990 633048134 641905289 647873459 650968170 660333786 650191040
722.3 650191040 644588928 646437225 630386696 620931664 620336075 626133385 637346992 640193100
730.1 640193100 635744438 635434418 639464760 647787018 656320038 652759094 641634827 628974190
737.8 628974190 631939240 638257217 632186584 635200615 633656807 629434853 625315323 618382263
745.5 618382263 629634209 647852707 662633591 665256500 656050644 651976013 650919571 656407700
753.2 656407700 660132523 656888885 658128662 656891174 663545303 679571304 682324829 677902908
$$ packed form
699.2F26030197m387398k171783j610336j547203j777153M307251L632621m117202
706.9F18358994l031388K286301K040977l872909N654068Q774833J808243j0014190
714.6F22004929j3876687J1000748J3919144Q857155N968170L094711R365616j0142746
722.3F50191040n602112J848297j6050529r455032n95589N797310J1213607K846108
730.1F40193100m448662l10020M030342Q322258Q533020l560944j1124267j2660637
737.8F28974190K965050O317977o070633L014031j543808m221954m119530o933060
745.5F18382263J1251946J8218498J4780884K622909r205856m074631j056442N488129
753.2F56407700L724823l243638J239777j237488O654129J6026001K753525m421921
$$ plain form
760.9 677902908 673007202 672450638 676297073 674497375 672028198 670246735 679233170 688888550 680472717
769.6 680472717 678698578 688385315 685614166 671225281 668341370 673301926 670589600 668253326
777.3 668253326 668870697 673499908 682468567 690280533 698392181 705398788 702209778 697502899 700731049
786 700731049 702560043 697488632 686191101 686209183 694371719 703845978 713512421 705221405 703000946
794.7 703000946 709567337 712150040 702910080 684356842 692059097 695876541 690041046 698038635
802.4 698038635 704919739 715962448 721287308 712188034 700127716 699751129 701841507 703149796
810.1 703149796 707395096 697862015 695724640 701509018 709780731 716571121 706802216 711086044
817.8 711086044 716743927 709066467 713059540 710594559 699950638 700057144 698475418 703165436
$$ packed form
760.9F77902908m895706n56564L846435j799698k469177j781463Q986435R655380q415833
769.6F80472717j774139R686737k771149j4388885k883911M960556k712326k336274
777.3F68253326O17371M629211Q968659P811966Q111648P006607l189010m706879L228150
786G00731049J828994n071411j1297531J8082Q162536R474259R666443q291016k220459
794.7G03000946O566391K582703r239960j8553238P702255L817444n835495P997589
802.4F98038635O881104J1042709N324860r099274j2060318l76587K090378J308289
810.1G03149796M245300r533081k137375N784378Q271713O790390r768905M283828
817.8G11086044N657883p677460L993073k464981j0643921J06506j581726M690018
$$ plain form
825.5 703165436 713896866 704944153 696028214 703464203 708647461 696018677 686009064 696925201
833.3 696925201 701673126 693657379 684228439 681354141 673034134 659619904 657250366 650818405
841 650818405 651563492 655039291 652646408 659701004 667557907 670720596 661232071 653935013 659159470
849.6 659159470 663639832 662675781 655193329 658532104 664005814 658121338 662546539 675188293
857.4 675188293 682187729 692473831 699047699 691700058 690613022 690966949 685039902 688679047
865.1 688679047 694385147 691355667 689165115 690473022 687457123 691139908 701650620 698766174
872.8 698766174 687864227 687366791 690918427 690621414 693231583 692981415 691299362 685827255 678362427
881.5 678362427 679619522 676104660 672467880 677706985 685652466 684266663 681188278 691246719
$$ packed form
825.5G03165436J0731430q952713q915939P435989N183258j2628784j0009613J0916137
833.3F96925201M747925q015747r428940k874298q320007j3414230k369538o431961
841F50818405P45087L475799k392883P054596P856903L162689r488525p297058N224457
849.6F59159470M480362r64051p482452L338775N473710n884476M425201J2641754
857.4F75188293O999436J0286102O573868p347641j087036L53927n927047L639145
865.1F88679047N706100l029480k190552J307907l015899L682785J0510712k884446
872.8F98766174j0901947m97436L551636k97013K610169k50168j682053n472107p464828
881.5F78362427J257095l514862l636780N239105P945481j385803l078385J0058441
$$ plain form
889.2 691246719 690635376 680197067 677514725 686008911 693967819 688380508 683061676 677782364
896.9 677782364 682204056 692747116 692324219 690442734 683119049 677000961 675742798 677732468
904.6 677732468 685567627 681224823 675903091 679983063 673423233 667825470 673685150 671929245
912.3 671929245 664230423 658514328 653164673 651660156 651888733 649836731 647421188 643515015 637607117
921 637607117 639102745 638341560 630337601 633102570 633181725 627184143 626814346 624924850 626885185
929.7 626885185 628451118 625212402 622601547 617237701 613458176 618004112 627151375 630744896
937.4 630744896 631339264 632608795 633597107 638645973 643365326 647484283 651019211 651216354 654583054
946.1 654583054 654995193 650669785 658211517 669074631 670249557 669959641 666755295 664252548 667377777
$$ packed form
889.2F91246719o11343j0438309k682342Q494186P958908n587311n318832n279312
896.9F77782364M421692J0543060m22897j881485p323685o118088j258163J989670
904.6F77732468P835159m342804n321732M079972o559830n597763N859680j755905
912.3F71929245p698822n716095n349655j504517K28577k052002k415543l906173n907898
921F37607117J495628p61185q003959K764969P9155n997582l69797j889496J960335
929.7F26885185J565933l238716k610855n363846l779525M545936R147263L593521
937.4F30744896N94368J269531R88312N048866M719353M118957L534928J97143L366700
946.1F54583054M12139m325408P541732J0863114J174926k89916l204346k502747L125229
$$ plain form
954.8 667377777 666700134 661010513 657627029 659295120 660379181 657237778 654123306 653850250 651210327
963.4 651210327 643762436 638393898 635883217 633016129 629706841 628713226 631243095 633451538 632560844
972.1 632560844 629052429 627834358 626969566 627910347 630821800 624573936 616407089 613783073 615968094
980.8 615968094 622624588 621460762 614941559 613838806 610777359 602427406 595747337 597276611
988.5 597276611 602596550 595965309 585829964 584029808 582304573 571076164 542334862 520811386
996.2 520811386 523770561 533503609 545939560 560534630 570167885 568546295 571218910 576633072
1004 576633072 570959244 566117821 561487579 562584724 565790367 561926804 560629311 560440063 563171616
1012.6 563171616 562073784 554564362 553249207 554603691 549359856 542201462 542132950 547740135 552328186
$$ packed form
954.8F67377777o77643n689621l383484J668091J084061l141403l114472k73056k639923
963.4F51210327p447891n368538k510681k867088l309288r93615K529869K208443q90694
972.1F32560844l508415j218071q64792R40781K911453o247864q166847k624016K185021
980.8F15968094O656494j163826o519203j102753l061447q349953o680069J529274
988.5E97276611N319939o631241j0135345j800156j725235j1228409k8741302k1523476
996.2E20811386K959175R733048J2435951J4595070R633255j621590K672615N414162
1004E76633072n673828m841423m630242J097145L205643l863563j297493j89248K731553
1012.6E63171616j097832p509422j315155J354484n243835p158394o8512N607185M588051
$$ plain form
1021.3 552328186 547579269 539169312 535003014 533342247 532629662 532267647 532992668 527305832 518491058
1030 518491058 513300934 511743927 512539673 513329163 514537201 511129494 506622086 501096802 496991615
1038.7 496991615 498159485 501343956 505886192 503763161 498196564 494583893 501164207 512131119
1046.4 512131119 512034340 508845901 507390175 508749619 506906891 501835060 498595085 500232697 504018250
1055.1 504018250 501535645 505637054 510852890 512276115 513039017 508289223 505690231 507536812
1062.8 507536812 513039436 511829605 510939751 517722244 515116615 508112907 507557831 505664482 499607544
1071.5 499607544 499398956 497305527 491457634 488660736 490469513 496666603 495381126 494794044 491570625
1080.1 491570625 486803780 488626823 486204987 489863358 492770348 489659042 490598145 490033836 487136536
$$ packed form
1021.3E52328186m748917q409957m166298j660767p12585l62015P25021n686836q814774
1030E18491058n190124j557007P95746P89490J208038l407707m507408n525284m105187
1038.7D96991615J167870L184471M542236k123031n566597l612671O580314J0966912
1046.4E12131119r6779l188439j455726J359444j842728n071831l239975J637612L785553
1055.1E04018250k482605M101409N215836J423225P62902m749794k598992J846581
1062.8E07536812N502624j209831q89854O782493k605629p003708n55076j893349o056938
1071.5D99607544k08588k093429n847893k796898J808777O197090j285477n87082l223419
1080.1D91570625m766845J823043k421836L658371K906990l111306R39103n64309k897300
$$ plain form
1088.8 487136536 486945038 487117920 476056023 461692009 450860443 438435402 428844681 422683067
1096.5 422683067 411383591 394847908 382165565 369035721 351887550 332917099 320402069
1103.3 320402069 314625988 308866196 294928608 270691338 253205891 243734894 242537365 235427799
1111 235427799 218424492 209624825 205364704 204289207 199056931 193864651 192244549 191587887 194556446
1119.7 194556446 198808804 202178860 198120422 195973339 198102531 201991558 203038216 196014347
1127.4 196014347 194669228 200124454 203282433 202254257 202750072 202843666 199850483 192127666 184957561
1136.1 184957561 186109238 183155460 178901558 175917034 173411598 173354130 169351177 163199959 158586483
1144.8 158586483 155264587 148124332 142714853 138429079 138633709 144672651 145098457 143998804 142752705
$$ packed form
1088.8D87136536j91498J72882j1061897j4364014j0831566j2425041r590721o161614
1096.5D22683067j1299476j6535683j2682343j3129844j7148171j8970451j2515030
1103.3C20402069n776081n759792j3937588k4237270j7485447r470997j197529p109566
1111B35427799j7003307q799667m260121j075497n232276n192280j620102o56662K968559
1119.7A94556446M252358L370056m058438k147083K129192L889027J046658p023869
1127.4A96014347j345119N455226L157979j028176M95815R3594k993183p722817p170105
1136.1A84957561J151677k953778m253902k984524k505436n7468m002953o151218m613476
1144.8A58586483l321896p140255n409479m285774K04630O038942M25806j099653j246099
$$ plain form
1153.4 142752705 147589083 152106657 151659937 150428152 150064564 154884529 159254141 167311821 173844624
1162.1 173844624 177826462 176479397 174087467 182398987 189019356 193776093 195588436 202046337
1169.8 202046337 209698372 216264400 230177917 238568230 252141457 264252930 267404079 273835430
1177.5 273835430 281040859 294946766 312409077 323532867 333367500 344860954 350823517 357061615
1185.3 357061615 366521225 374659920 387031403 397850037 401967163 405281334 410766907 416856041
1193 416856041 422589951 430453529 441349792 449031105 450199814 453792953 462145653 468979836
1200.7 468979836 471422005 476152611 486266098 493169708 496156845 501286201 507709770 509844513
1208.4 509844513 511826859 517658081 522889671 524545097 525247307 530141754 535621872 536009140 532306671
$$ packed form
1153.4A42752705M836378M517574m46720j231785l63588M819965M369612Q057680O532803
1162.1A73844624L981838j347065k391930Q311520O620369M756737J812343O457901
1169.8B02046337P652035O566028J3913517Q390313J3573227J2111473L151149O431351
1177.5B73835430P205429J3905907J7462311J1123790R834633J1493454N962563O238098
1185.3C57061615R459610Q138695J2371483J0818634M117126L314171N485573O089134
1193D16856041N733910P863578J0896263P681313J168709L593139Q352700O834183
1200.7D68979836K442169M730606J0113487O903610K987137N129356O423569K134743
1208.4E09844513J982346N831222N231590J655426P02210M894447N480118L87268l702469
$$ plain form
1217.1 532306671 532004051 534165611 534851723 538245277 540756149 543466759 547017593 548072701 546927605
1225.8 546927605 545892029 548676643 548639793 547329369 546295547 544938545 548631363 551211777 551554832
1234.4 551554832 550595779 550682220 553795967 554454384 553904724 554592896 555885735 557500877 559628944
1243.1 559628944 557200470 552342262 552402649 556205139 561185722 561124573 559244385 561369667 563432693
1251.8 563432693 561699867 559806557 563512955 567663345 569010277 567964020 565616798 564726524
1259.5 564726524 565888138 568436203 569229622 569855728 570927963 572079811 573468628 574357719 574034615
1268.2 574034615 572885323 574525452 577282600 578769341 578670158 581960258 584837837 581322670 582657356
1276.9 582657356 587259254 591997528 597382240 597680168 597119331 598644524 600931587 602255325 603497124
$$ packed form
1217.1E32306671l02620K161560O86112L393554K510872K710610L550834J055108j145096
1225.8E46927605j035576K784614l6850j310424j033822j357002L692818K580414L43055
1234.4E51554832r59053Q6441L113747O58417n49660O88172J292839J615142K128067
1243.1E59628944k428474m858208O0387L802490M980583o1149j880188K125282K063026
1251.8E63432693j732826j893310L706398M150390J346932j046257k347222q90274
1259.5E64726524J161614K548065P93419O26106J072235J151848J388817Q89091l23104
1268.2E74034615j149292J640129K757148J486741r9183L290100K877579l515167J334686
1276.9E82657356M601898M738274N384712K97928n60837J525193K287063J323738J241799
$$ plain form
1285.5 603497124 606475868 609759140 612673454 614522133 614155922 613890991 617970848 619847450 617773743
1294.2 617773743 619500961 623857422 627797050 628718376 628830872 631470642 633815613 636292610 637194443
1302.9 637194443 633692551 632376480 635768471 637383308 638485184 640260849 640869675 643651428
1310.6 643651428 645779953 644930954 642267685 639529800 641663895 644873199 644266357 643169098 644023819
1319.3 644023819 645651855 647338638 648933640 650128403 651061630 650644684 648842697 646396332 647516403
1328 647516403 652155304 653218460 654249115 656391144 655811462 655884933 654031219 651952209 654105988
1336.7 654105988 653271866 649980698 650542297 653016739 654666595 653556671 651284485 650903091 653306885
1345.3 653306885 656744080 656875229 654653854 651499023 649221725 649359436 651473846 654484863 654399414
$$ packed form
1285.5F03497124K978744L283272K914314J848679l66211k64931M079857J876602k073707
1294.2F17773743J727218M356461L939628R21326J12496K639770K344971K476997R01833
1302.9F37194443l501892j316071L391991J614837J101876J775665O08826K781753
1310.6F43651428K128525q48999k663269k737885K134095L209304o06842j097259Q54721
1319.3F44023819J628036J686783J595002J194763R33227m16946j801987k446365J120071
1328F47516403M638901J063156J030655K142029n79682P3471j853714k079010K153779
1336.7F54105988q34122l291168N61599K474442J649856j109924k272186l81394K403794
1345.3F53306885L437195J31149k221375l154831k277298J37711K114410L011017q5449
$$ plain form
1354 654399414 654110870 653215332 650881271 649641037 647758560 646485825 644987717 646445694 647706223
1362.7 647706223 645763702 646176300 645418854 644894562 641900482 636869659 636390076 637643585 638850975
1371.4 638850975 639455223 639268951 636022873 633673859 634417534 635009193 634421921 632948151 632486572
1380.1 632486572 630511894 628778229 628346558 629341583 630391426 631170387 636739197 637401581 632066727
1388.7 632066727 630069122 630507812 631294785 628712997 629017982 627166061 622490997 626626244 628317719
1397.4 628317719 625849419 621279755 619143028 619885521 619849777 618923607 618435707 618696632 616614456
1406.1 616614456 612415504 608873520 607213898 605039520 602972412 603136482 605612869 607422943
1413.8 607422943 607102127 606264496 603457756 599379845 597816467 599605980 599660110 597124481 594900284
$$ packed form
1354F54399414k88544q95538k334061j240234j882477j272735j498108J457977J260529
1362.7F47706223j942521M12598p57446n24292k994080n030823m79583J253509J207390
1371.4F38850975O04248j86272l246078k349014P43675N91659n87272j473770m61579
1380.1F32486572j974678j733665m31671R95025J049843P78961N568810O62384n334854
1388.7F32066727j997605M38690P86973k581788L04985j851921m675064M135247J691475
1397.4F28317719k468300m569664k136727P42493l5744r26170m87900K60925k082176
1406.1F16614456m198952l541984j659622k174378k067108J64070K476387J810074
1413.8F07422943l20816q37631k806740m077911j563378J789513N4130k535629k224197
$$ plain form
1422.5 594900284 592273140 589095116 589551811 591720161 592281685 590680580 591598969 591606522 587333336
1431.2 587333336 586066742 586565323 585739632 583597527 584034920 587689171 585991936 586824532 585878983
1439.8 585878983 583754272 584299698 585063286 585754967 584721680 585923767 589264030 588946304 585525665
1448.5 585525665 585663109 588255386 589400330 590215034 590628090 590503159 591314278 591919174 595201759
1457.2 595201759 597564430 598482780 600676003 602909393 603805199 604656715 608794518 615021400 612098885
1465.9 612098885 609359512 611871910 613934898 615456543 618264084 620945702 624243660 624404106
1473.6 624404106 626548271 628114662 627817688 630006180 634541206 638896294 638195343 637271767 639042931
1482.3 639042931 641788101 645261078 646773987 648905106 649747086 648630676 649957962 648411865
$$ packed form
1422.5E94900284k627144l178024M56695K168350N61524j601105R18389P553m273186
1431.2E87333336j266594M98581q25691k142105M37393L654251j697235Q32596r45549
1439.8E85878983k124711N45426P63588O91681j033287J202087L340263l17726l420639
1448.5E85525665J37444K592277J144944Q14704M13056j24931Q11119O04896L282585
1457.2E95201759K362671R18350K193223K233390Q95806Q51516M137803O226882k922515
1465.9F12098885k739373K512398K062988J521645K807541K681618L297958J60446
1473.6F24404106K144165J566391k96974K188492M535026M355088p00951r23576J771164
1482.3F39042931K745170L472977J512909K131119Q41980j116410J327286j546097
$$ plain form
1490 648411865 646532059 647138824 648174286 648239899 646658478 643504486 644404221 652119446 654745102
1498.7 654745102 652017136 650340881 648350754 649417496 650289917 650274048 647219391 636886024 641300964
1507.3 641300964 641371841 644425507 647645798 648940277 648633499 644443054 643348312 643567963 645741348
1516 645741348 650873795 644659653 640925217 642067719 644438934 643423157 642027893 644671783 645457230
1524.7 645457230 637785149 634309769 634574852 634313965 638068733 640479660 640552063 645616684 652518921
1533.4 652518921 642707214 639286880 640739517 641793442 643701782 647299042 645086517 637124252
1541.1 637124252 627663307 629154434 637629890 639143524 634413681 634112701 636664848 642859802
1548.8 642859802 647450943 642135391 636652184 637435570 644234848 646950073 643135834 643391342 650095062
$$ packed form
1490F48411865j879806O06765J035462O5613j581421l153992Q99735P715225K625656
1498.7F54745102k727966j676255j990127J066742Q72421j5869l054657j0333367M414940
1507.3F41300964P0877L053666L220291J294479l06778m190445j094742K19651K173385
1516F45741348N132447o214142l734436J142502K371215j015777j395264K643890P85447
1524.7F45457230p672081l475380K65083k60887L754768K410927P2403N064621O902237
1533.4F52518921r811707l420334J452637J053925J908340L597260k212525p962265
1541.1F37124252r460945J491127Q475456J513634m729843l00980K552147O194954
1548.8F42859802M591141n315552n483207P83386O799278K715225l814239K55508O703720
$$ plain form
1557.5 650095062 648861237 618782959 634514313 645413589 648859177 649009857 649196472 647388840
1565.2 647388840 645973511 649477081 651592102 652480316 652009048 651564941 651537170 649726410 648988876
1573.9 648988876 650446854 655169144 653491211 650088882 646985779 642416153 641336212 641417236 639410439
1582.6 639410439 636320992 635873451 635181046 635436325 636007004 633800468 629788017 624048386 623178215
1591.2 623178215 623668365 621763229 617806053 616172333 616043243 611500015 609361458 606122742 603074722
1599.9 603074722 601021538 597851562 595950813 593999176 592836533 589905968 587525330 581812439
1607.6 581812439 578856010 579787598 576940498 576847496 574982948 572066383 568865852 568232727 570387650
1616.3 570387650 565135231 561945190 556333542 553323059 551755447 551509628 549819107 543410759
$$ packed form
1557.5F50095062j233825l0078278J5731354J0899276L445588J50680J86615j807632
1565.2F47388840j415329L503570K115021Q88214m71268m44107k7771j810760p37534
1573.9F48988876J457978M722290j677933l402329l103103m569626j079941Q1024k006797
1582.6F39410439l089447m47541o92405K55279N70679k206536m012451n739631q70171
1591.2F23178215M90150j905136l957176j633720j29090m543228k138557l238716l048020
1599.9F03074722k053184l169976j900749j951637j162643k930565k380638n712891
1607.6E81812439k956429R31588k847100r3002j864548k916565l200531o33125K154923
1616.3E70387650n252419l190041n611648l010483j567612k45819j690521o408348
$$ plain form
1624 543410759 544916382 546210785 548326836 548092308 544142723 539434776 536294403 535801239 534756088
1632.7 534756088 536446228 534925385 528015404 528640938 532659645 534137611 532175179 532472267 533184624
1641.4 533184624 536201172 535324440 532457886 532623749 533592148 538121567 539486656 536812248 536723328
1650.1 536723328 543168602 551322632 554745674 539985428 542815018 549035339 550819931 551351967
1657.8 551351967 551749763 553103638 555175400 557530861 560862617 561928635 564075623 565847855
1665.5 565847855 566952705 568112488 572939453 580159378 583319969 584381828 579303055 580728645
1673.2 580728645 584707909 586560974 587312660 591565094 597307587 599987526 601978035 602940826 606494522
1681.9 606494522 610009346 611160851 614778175 613093643 616213493 618197823 620790100 625412750
$$ packed form
1624E43410759J505623J294403K116051k34528l949585m707947l140373m93164j045151
1632.7E34756088J690140j520843o909981O25534M018707J477966j962432K97088P12357
1641.4E33184624L016548q76732k866554J65863R68399M529419J365089k674408q8920
1650.1E36723328O445274Q154030L423042j4760246K829590O220321J784592N32036
1657.8E51351967L97796J353875K071762K355461L331756J066018K146988J772232
1665.5E65847855J104850J159783M826965P219925L160591J061859n078773J425590
1673.2E80728645L979264J853065P51686M252434N742493K679939J990509R62791L553696
1681.9F06494522L514824J151505L617324j684532L119850J984330K592277M622650
$$ plain form
1689.6 625412750 629340935 631989899 634426956 639302292 646900177 660159454 656282120 651689606
1697.3 651689606 654333191 654576645 653560257 660296249 667875214 672579117 675482254 676547546
1705 676547546 678839798 682621307 684533463 687953796 689580765 689389191 691110687 696226959 703264694
1713.7 703264694 702562561 695783386 693621674 696018448 701739655 703671646 705410233 706394806 709413986
1722.4 709413986 712320099 712291183 712644272 713882141 713799515 712717438 714490891 714646835 714388275
1731.1 714388275 718711166 720414505 714796982 712185593 716552963 719813004 722066422 725876312
1738.8 725876312 724131927 719274292 723483200 727606430 729527435 730111694 731686478 734229279
1746.5 734229279 733349152 732725601 735577240 737085495 737388535 741140289 746300201 748174362 747914352
$$ packed form
1689.6F25412750L928185K648964K437057M875336P597885J3259277l877334m592514
1697.3F51689606K643585K43454j016388O735992P578965M703903K903137J065292
1705F76547546K292252L781509J912156L420333J626969j91574J721496N116272P037735
1713.7G03264694p02133o779175k161712K396774N721207J931991J738587R84573L019180
1722.4G09413986K906113k8916L53089J237869q2626j082077J773453J55944k58560
1731.1G14388275M322891J703339n617523k611389M367370L260041K253418L809890
1738.8G25876312j744385m857635M208908M123230J921005N84259J574784K542801
1746.5G34229279q80127o23551K851639J508255L03040L751754N159912J874161k60010
$$ plain form
1755.2 747914352 749940033 748692703 747832565 750226212 749607086 749706421 751160355 751516724 753926849
1763.9 753926849 756045227 758028488 760463486 761722641 758410492 757870483 761776886 764977112
1771.6 764977112 763853226 758219604 759232864 763259048 762658386 762622375 762651291 761726074 762915115
1780.3 762915115 763191223 763544388 764553757 764995270 763975525 763606110 767217255 769403687 768808060
1788.9 768808060 768375473 766322861 766279526 764928055 764607544 768403320 769672623 767629547 767864456
1797.6 767864456 772188797 774073486 771133423 771660385 772171402 770940247 770302887 770798035 770388260
1806.3 770388260 769542542 770195389 772283630 774449005 773020401 773686829 773921280 771623154 772243118
1815 772243118 773543167 774762115 774353714 772951279 772713852 773128204 774793243 775460739 775700302
$$ packed form
1755.2G47914352K025681j247330q60138K393647o19126R9335J453934L56369K410125
1763.9G53926849K118378J983261K434998J259155l312149n40009L906403L200226
1771.6G64977112j123886n633622J013260M026184o00662l6011K8916r25217J189041
1780.3G62915115K76108L53165J009369M41513j019745l69415L611145K186432n95627
1788.9G68808060m32587k052612m3335j351471l20511L795776J269303k043076K34909
1797.6G67864456M324341J884689k940063N26962N11017j231155o37360M95148m09775
1806.3G70388260q45718O52847K088241K165375j428604O66428K34451k298126O19964
1815G72243118J300049J218948m08401j402435k37427M14352J665039O67496K39563
$$ plain form
1823.7 775700302 776101837 772887497 771367340 774842072 779274673 783444748 782472382 778127670 777945023
1832.3 777945023 777802582 776616516 775452728 776791077 780189819 779996567 779907455 779309769 776964493
1841 776964493 776730804 780518570 782808762 775749512 777151108 781917038 783917923 783399658 781306000
1849.7 781306000 780128937 780364685 781057663 780966187 779511871 777824783 779066696 781271744 781741562
1858.4 781741562 782589874 781988373 780466309 780925369 782129898 782556000 782795105 782019882 781452866
1867.1 781452866 782288971 779722824 779297714 781564713 781511536 780599899 780215607 780818558 782324982
1875.7 782324982 783403320 782360840 782993546 783649979 783612137 785202637 784510498 785139542 785130768 782405472
1885.4 782405472 781106339 781681900 785085526 785824585 783512421 783634949 784504089 784845123 785373764
$$ packed form
1823.7G75700302M01535l214340j520157L474732M432601M170075r72366m344712j82647
1832.3G77945023j42441j186066j163788J338349L398742j93252q9112n97686k345276
1841G76964493k33689L787766K290192p059250J401596M765930K000885n18265k093658
1849.7G81306000j177063K35748O92978r1476j454316j687088J241913K205048M69818
1858.4G81741562Q48312o01501j522064M59060J204529M26102K39105p75223n67016
1867.1G81452866Q36105k566147m25110K266999n3177r11637l84292O02951J506424
1875.7G82324982J078338j042480O32706O56433l7842J590500o92139O29044q774k725296
1885.4G82405472j299133N75561L403626P39059k312164J22528Q69140L41034N28641
$$ plain form
1894.1 785373764 786679916 785556259 783545303 782349091 783064346 784030991 783195343 781937256 780663986
1902.7 780663986 781431885 782375793 782028809 780915146 780863724 782939453 783968277 783794556 783020096
1911.4 783020096 783499756 783316650 782742538 784235001 785276871 784274063 780015640 779877777 781967010
1920.1 781967010 782790527 782676468 781332626 783189316 784006119 783392181 783548660 783576202 783575745 782272339
1929.7 782272339 781914291 783050003 784502869 784654465 784277344 784656754 783898239 783640442 783510208
1938.4 783510208 782387848 781422653 782029800 781917496 779546204 779984283 781175003 782056427 783295364
1947.1 783295364 784353180 783160248 780052567 780289917 781658783 782346191 784089355 784221954 782510223
1955.8 782510223 781721573 782153473 782022781 782025375 782964554 782396240 780655136 780219955 780099564 780842972
$$ packed form
1894.1G85373764J306152j123657k010956j196212P15255R66645q35648j258087j273270
1902.7G80663986P67899R43908l46984j113663n1422K075729J028824j73721p74460
1911.4G83020096M79660j83106n74112J492463J041870j002808m258423j37863K089233
1920.1G81967010Q23517j14059j343842J856690Q16803o13938J56479K7542m57j303406
1929.7G82272339l58048J135712J452866J51596l77121L79410p58515k57797j30234
1938.4G83510208j122360r65195O07147j12304k371292M38079J190720Q81424J238937
1947.1G83295364J057816j192932l107681K37350J368866O87408J743164J32599j711731
1955.8G82510223p88650M31900j30692K594R39179n68314j741104m35181j20391P43408
$$ plain form
1965.4 780842972 782751846 781945419 780504761 780870056 780720596 780524826 781546021 783040924 783917236
1974.1 783917236 784229736 782644577 781157532 782439346 782281036 779558640 777608643 777604141 778525696
1982.8 778525696 779486618 779987183 779349823 778874359 778942871 778634720 778537521 779605789 780232849 778850174
1992.4 778850174 778129196 777367783 776486893 778400955 781337128 781569824 780498428 781100388 780614853
2001.1 780614853 779183044 779594955 779995041 779105377 777000122 777360840 779808884 779638290 779778824
2009.8 779778824 781007309 779972076 777538986 776456223 778063507 780864334 780013275 776077118
2017.5 776077118 776272736 778781586 779065857 776947327 774934158 775335007 775919952 777060928 778973618
2026.2 778973618 778575897 776751938 776188660 776472321 776009521 775879440 775905914 773848038 772860641
$$ packed form
1965.4G80842972J908874q06427j440658L65295j49460j95770J021195J494903Q76312
1974.1G83917236L12500j585159j487045J281814j58310k722396j949997m502R21555
1982.8G78525696R60922N00565o37360m75464O8512l08151r7199J068268O27060j382675
1992.4G78850174p20978p61413q80890J914062K936173K32696j071396O01960m85535
2001.1G80614853j431809M11911M00086q89664k105255L60718K448044j70594J40534
2009.8G79778824J228485j035233k433090j082763J607284K800827q51059l936157
2017.5G76077118J95618K508850K84271k118530k013169M00849N84945J140976J912690
2026.2G78973618l97721j823959n63278K83661m62800j30081K6474k057876r87397
$$ plain form
2034.9 772860641 775134125 774909744 772899551 773102493 773585663 774936523 776058273 775558929 774200211
2043.5 774200211 772157745 771191483 772084808 774580154 775974503 775903473 775877304 776252441 775851059
2052.2 775851059 773303070 773508377 776411972 776005249 772923203 772164536 773735428 774540558 774034119
2060.9 774034119 772894974 773149567 772460937 770941391 770928345 770835648 771543045 772184906 772451706 770701675
2070.5 770701675 769012451 770025101 769229355 767812424 766551666 765509796 765350876 765574265 765841446
2079.2 765841446 765512009 767156448 768254776 767566605 766520920 765596390 766866684 766849594 764951859
2087.9 764951859 765474625 767273102 767118530 766820374 767414093 766753845 765112991 765537262 767135620
2096.6 767135620 766226425 765789719 765811310 766162033 767538376 767670746 768590240 768887787 769512711 768937759
$$ packed form
2034.9G72860641K273484k24381k010193K02942M83170J350860J121750m99344j358718
2043.5G74200211k042466r66262Q93325K495346J394349p1030k6169L75137m01382
2052.2G75851059k547989K05307K903595m06723l082046p58667J570892Q05130n06439
2060.9G74034119j139145K54593o88630j519546j3046r2697P07397O41861K66800j750031
2070.5G70701675j689224J012650p95746j416931j260758j041870j58920K23389K67181
2079.2G65841446l29437J644439J098328o88171j045685r24530J270294j7090j897735
2087.9G64951859N22766J798477j54572k98156N93719o60248j640854M24271J598358
2096.6G67135620r09195m36706K1591L50723J376343J32370R19494K97547O24924n74952
$$ plain form
2106.2 768937759 766643219 767287064 767578812 768428040 768667068 766708374 766947479 769385529 771367111
2114.9 771367111 771151352 771021881 770740738 770318527 769926147 769069901 769483414 769753265 770223999 770407639
2124.5 770407639 768663025 766907349 767383118 768149796 768018875 768388367 769083252 771266861 771979675
2133.2 771979675 770857468 769220963 766942978 768092270 770701218 771499252 770325317 770141754 770178223
2141.9 770178223 768121948 768156509 768377304 768558731 769900742 771239090 772971954 772763367 771632538
2150.6 771632538 771504211 772761536 772921677 771646576 772348785 772553711 771377716 770901413 771606064
2159.3 771606064 772894669 773913803 774182053 771473770 769362869 771384354 771881866 771199951 771827469
2167.9 771827469 771668549 771911621 771625595 771205826 770871277 770462952 772135620 772318726 771261673
$$ packed form
2106.2G68937759k294540O43845K91748Q49228K39028j958694K39105K438050J981582
2114.9G71367111k15759j29471k81143m22211l92380q56246M13513K69851M70734J83640
2124.5G70407639j744614j755676M75769P66678j30921L69492O94885K183609P12814
2133.2G71979675j122207j636505k277985J149292K608948P98034j173935j83563L6469
2141.9G70178223k056275L4561K20795J81427J342011J338348J732864k08587j130829
2150.6G71632538j28327J257325J60141j275101P02209K04926j175995m76303P04651
2159.3G71606064J288605J019134K68250k708283k110901K021485M97512o81915O27518
2167.9G71827469j58920K43072k86026m19769l34549m08325J672668J83106j057053
$$ plain form
2176.6 771261673 770948563 770440903 770792313 771474609 772219543 772404556 771163712 769445572 768724060
2185.3 768724060 767834091 766911469 768299026 770539017 771884155 772031860 771823502 772130127 773308563
2194 773308563 772755051 770546799 770985870 772493286 774912872 776313095 774666977 773529739 773304062
2202.6 773304062 773256073 772653122 773038406 774341278 775651398 775825272 775198822 776305618 775243759
2211.3 775243759 774619217 775917892 776283646 776509476 775300293 775496750 775387039 774845428 775997849
2220 775997849 776153336 776109543 774079590 772919693 774942093 775441895 775274506 775650406 775560074 775981598
2229.7 775981598 776685562 776075974 775779572 776670837 776661987 775550766 774630051 774514313 774622879 774615631
2239.3 774615631 774550247 774272156 773967056 774124603 773741913 772641907 772292252 772582703 773390121 774011536
$$ packed form
2176.6G71261673l13110n07660L51410O82296P44934J85013j240844j718140p21512
2185.3G68724060q89969r22622J387557K239991J345138J47705k08358L06625J178436
2194G73308563n53512k208252M39071J507416K419586J400223j646118j137238k25677
2202.6G73304062m7989o02951L85284J302872J310120J73874o26450J106796j061859
2211.3G75243759o24542J298675L65754K25830j209183J96457j09711n41611J152421
2220G75997849J55487m3793k029953j159897K022400M99802j67389L75900r0332M21524
2229.7G75981598P03964o09588k96402Q91265q850j111221r20715j15738J08566p248
2239.3G74615631o5384k78091l05100J57547l82690j100006l49655K90451Q07418O21415
$$ plain form
2248.9 774011536 774891663 776207809 776308365 776152191 775614395 773857956 773044815 774499512 775641861
2257.6 775641861 775459518 775460358 775246048 774935684 774512024 773540344 772357178 772266312 774236832 775766068
2267.3 775766068 774930038 774259033 775259933 776108932 776906967 777290802 776069565 774076385 774187698
2275.9 774187698 777356415 777233963 774415512 774605865 775424194 775051117 774097748 773962021 774713669
2284.6 774713669 774537735 773325653 771773605 772703476 776480255 777981262 775996399 774046707 773282623
2293.3 773282623 773235779 774251556 776648026 777637482 775153351 772667084 772707596 774064560 774775009
2302 774775009 775305252 775672684 774673538 773976974 773492279 772800903 773754120 775198364 774321518 773254013
2311.6 773254013 772989960 771839447 772761230 773869171 773953857 774970093 773515015 770523300 770349808
$$ packed form
2248.9G74011536Q80127J316146J00556j56174n37796j756439q13141J454697J142349
2257.6G75641861j82343Q40k14310l10364m23660r71680j183166r0866J970520J529236
2267.3G75766068q36030o71005J000900Q48999P98035L83835j221237j993180J11313
2275.9G74187698L168717j22452k818451J90353Q18329l73077r53369j35727P51648
2284.6G74713669j75934j212082j552048R29871L776779J501007j984863j949692p64084
2293.3G73282623m6844J015777K396470R89456k484131k486267M0512J356964P10449
2302G74775009N30243L67432r99146o96564m84695o91376R53217J444244q76846j067505
2311.6G73254013k64053j150513R21783J107941Q4686J016236j455078k991715j73492
$$ plain form
2320.3 770349808 771931992 770286331 767888870 768819733 769838562 770663986 770289459 766948547 764278183
2329 764278183 766876373 772255402 776288223 775908890 770827560 767667007 767627182 769838333 769040909
2337.7 769040909 765635757 768594131 768974533 764117432 762891693 765935822 769476929 768622513 769240875
2346.3 769240875 771164093 770481644 772189941 775572510 777243652 774996948 771747742 774411850
2354.1 774411850 772429276 765739441 766837082 769559937 767448349 764505997 769748230 769420929
2361.8 769420929 763768234 772238007 779023743 772458572 766647568 769135513 769544067 768478241
2369.5 768478241 770620270 771779022 773637619 773815918 773496628 774161987 774992447 774876404 773080368
2378.2 773080368 775395660 779266510 779044800 776008453 775485764 777795868 778022842 777792587 777911987
$$ packed form
2320.3G70349808J582184j645661k397461R30863J018829Q25424l74527l340912k670364
2329G64278183K598190N379029M032821l79333n081330l160553l9825K211151p97424
2337.7G69040909l405152K958374L80402m857101j225739L044129L541107q54416O18362
2346.3G69240875J923218o82449J708297L382569J671142k246704l249206K664108
2354.1G74411850j982574o689835J097641K722855k111588k942352N242233l27301
2361.8G69420929n652695Q469773O785736o565171n811004K487945M08554j065826
2369.5G68478241K142029J158752J858597J78299l19290O65359Q30460j16043j796036
2378.2G73080368K315292L870850k21710l036347n22689K310104K26974k30255J19400
$$ plain form
2386.8 777911987 778573303 779469376 779152451 779681091 779012756 777103577 777293015 778410416 778008347
2395.5 778008347 776510925 776850815 779449310 780176620 777901993 776812134 777031631 776810684 777585754
2404.2 777585754 779263458 779152832 777744141 777620010 777998734 778420105 778676682 778942337 778482132
2412.9 778482132 776527328 775386505 775339890 776638260 777661209 777409515 777760315 777769547 777878342
2421.6 777878342 777895584 776447067 775269165 775950851 777347336 778383179 778354263 778008804 778340225
2430.2 778340225 777067947 775784683 775631485 775803452 776800461 776535416 775510941 774063797 773250122
2438.9 773250122 774256363 774943161 775408859 775445557 774975052 774709167 775161285 776873016 777388458
2447.6 777388458 775090714 772967834 772459717 773603592 776387863 776917267 775531921 775299835 775727768
$$ packed form
2386.8G77911987O61316Q96073l16925N28640o68335j909179J89438J117401m02069
2395.5G78008347j497422L39890K598495P27310k274627j089859K19497k20947P75070
2404.2G77585754J677704j10626j408691j24131L78724M21371K56577K65655m60205
2412.9G78482132j954804j140823m6615J298370J022949k51694L50800R232J08795
2421.6G77878342J7242j448517j177902O81686J396485J035843k8916l45459L31421
2430.2G78340225j272278j283264j53198J71967R97009k65045j024475j447144q13675
2438.9G73250122J006241O86798M65698L6698m70505k65885M52118J711731N15442
2447.6G77388458k297744k122880n08117J143875K784271N29404j385346k32086M27933
$$ plain form
2456.3 775727768 775649948 774466553 773607483 773816833 775137405 775298462 773487930 772240906 771770477
2465 771770477 772298737 773141022 774326324 775240555 774994278 773980331 772282181 772192993 772310333 772014771
2474.6 772014771 772333603 771202850 770496140 771505356 771783752 771647720 772442703 772374115 771563644
2483.3 771563644 771425095 770875244 770028000 769886932 769218521 768132782 769510880 770480194 769691010
2492 769691010 769819107 769961090 770941162 771371994 770715332 770378113 770021210 771031494 771306229 769468384
2501.6 769468384 767791672 767723541 769259949 769968948 768334732 767986221 770399323 770836868 769576035
2510.3 769576035 769524994 769518890 767592621 765423355 765410080 765137482 765788574 767418213 766941605 766826782
2519.9 766826782 767937088 768713379 767866898 766352768 765781326 765289764 765789719 766452332 766193542
$$ packed form
2456.3G75727768p7820j183395q59070K09350J320572J61057j810532j247024m70429
2465G71770477N28260Q42285J185302R14231k46277j013947j698150q9188J17340k95562
2474.6G72014771L18832j130753p06710J009216K78396j36032P94983o8588q10471
2483.3G71563644j38549n49851q47244j41068o68411j085739J378098R69314p89184
2492G69691010J28097J41983R80072M30832o56662l37219l56903J010284K74735j837845
2501.6G69468384j676712o8131J536408P08999j634216l48511K413102M37545j260833
2510.3G69576035n1041o104j926269k169266j3275k72598O51092J629639m76608j14823
2519.9G66826782J110306P76291q46481j514130n71442m91562M99955O62613k58790
$$ plain form
2528.6 766193542 766006546 766110153 766580734 765114670 763394241 763703766 763982086 765521927 766016693
2537.3 766016693 764575424 763947678 763196716 763089447 761622162 760458679 763666306 767045975 767354126
2546 767354126 766433640 765722122 763765793 763115005 764192200 764767838 765773010 764993744 763418961
2554.6 763418961 761805420 761549683 764116287 764444122 763088150 762758560 763051376 763501968 764350281
2563.3 764350281 765190277 764489975 763245468 762212296 762238007 763568420 764513702 762722626 760261002
2572 760261002 761020966 761768265 761494217 762264023 763486786 763964386 762693329 761125565 760718231
2580.7 760718231 760823288 761087799 762472534 763583984 763166580 761938629 759904633 758904953 759776688
2589.4 759776688 760692368 760676804 760638962 760246658 759633179 759773483 759689636 759812927 759145126 758701401
$$ packed form
2528.6G66193542j86996J03607M70581j466064j720429L09525K78320J539841M94766
2537.3G66016693j441269o27746p50962j07269j467285j163483L207627L379669L08151
2546G67354126r20486p11518j956329o50788J077195N75638J005172p79266j574783
2554.6G63418961j613541k55737K566604L27835j355972l29590K92816M50592Q48313
2563.3G64350281Q39996p00302j244507j033172K5711J330413R45282j791076k461624
2572G60261002P59964P47299k74048P69806J222763M77600j271057j567764m07334
2580.7G60718231J05057K64511J384735J111450m17404j227951k033996r99680Q71735
2589.4G59776688R15680j5564l7842l92304o13479J40304q3847J23291o67801m43725
$$ plain form
2599 758701401 760248566 760772934 760773315 761476364 761251297 760009003 759155426 758380127 757306671 757030716
2608.6 757030716 756949692 757286224 757740936 756892700 755989304 756856003 758608551 759263306 758266754 756140594
2618.3 756140594 756015549 757558441 757100677 756500931 756535568 755099945 753574600 754257889 756216354
2627 756216354 756961975 756429291 754753647 752825623 753543701 754696808 753370209 751544876 750905380
2635.6 750905380 752306824 753603973 752635651 751978989 752193527 751301041 751029587 752147827 751941223
2644.3 751941223 751464157 751327133 752284393 754622955 753526688 751248550 751464462 752097549 751691132
2653 751691132 749505692 747584763 747809753 748656998 748571091 748286514 748206711 748694839 749479980 749350739
2662.6 749350739 748605728 747862701 748053589 746708069 745715027 748283310 749895325 749788361 749087448
$$ packed form
2599G58701401J547165N24368L81P03049k25067j242294q53577p75299j073456k75955
2608.6G57030716q1024L36532M54712q48236r03396Q66699J752548O54755r96552k126160
2618.3G56140594j25045J542892m57764n99746L4637j435623j525345O83289J958465
2627G56216354P45621n32684j675644j928024P18078J153107j326599j825333o39496
2635.6G50905380J401444J297149r68322o56662K14538q92486k71454J118240k06604
2644.3G51941223m77066j37024R57260K338562j096267k278138K15912O33087m06417
2653G51691132k185440j920929K24990Q47245q5907k84577p9803M88128P85141j29241
2662.6G49350739p45011p43027J90888j345520r93042K568283J612015j06964p00913
$$ plain form
2671.3 749087448 749153671 749279938 748577271 748730545 747753906 746753006 746142120 745051270 744880219
2680 744880219 745655746 745506058 745292358 746833572 745023499 742850342 744329910 745254822 744290390
2688.7 744290390 742571182 744819183 747297134 746241150 745158539 743752518 743241577 743362579 743829880
2697.4 743829880 743879929 742496719 741808777 742822495 743867569 741991730 740246353 740119934 740191116
2706 740191116 739922256 738421326 739872284 742529373 742331696 741559525 741008606 740317764 739036865
2714.7 739036865 739403229 740821609 739250031 738483734 740134506 739615479 737877731 737678757 738731613
2723.4 738731613 739134979 738311157 738415375 739183197 739078979 738389816 737918625 738025970 737741165 735535126
2733 735535126 732907257 733525772 735345917 735313416 735069046 734743729 734353790 734262695 733790436 734120026
$$ packed form
2671.3G49087448O6223J26267p02667J53274r76639j000900o10886j090850j71051
2680G44880219P75527j49688k13700J541214j810073k173157J479568R24912r64432
2688.7G44290390j719208K248001K477951j055984j082611j406021n10941J21002M67301
2697.4G43829880N0049j383210o87942J013718J045074j875839j745377j26419P1182
2706G40191116k68860j500930J450958K657089j97677p72171n50919o90842j280899
2714.7G39036865L66364J418380j571578p66297J650772n19027j737748j98974J052856
2723.4G38731613M03366q23822J04218P67822j04218o89163m71191J07345k84805k206039
2733G35535126k627869O18515J820145l2501k44370l25317l89939r1095m72259L29590
$$ plain form
2742.7 734120026 735170517 735425873 735793686 736605682 736324081 735231552 734413757 733548508 733502350
2751.4 733502350 733500290 731662979 731278534 731912003 730903473 729789352 729058456 730472870 731797638
2760 731797638 730553894 729715271 729700317 729509506 728585281 728984833 729969711 729353867 729160919 729005051
2769.7 729005051 728675003 728102341 728088531 729392090 729523468 729015350 729065094 727912369 725307465
2778.4 725307465 723731613 723066864 723853912 725317764 724204941 723991241 723992462 722184067 721765747
2787 721765747 721744537 721965485 722710114 723565750 724494705 724016800 721796112 719735031 720230331 721122818
2796.7 721122818 721027069 720828705 719785385 719411697 719169006 718155441 717696609 716523285 715076523
2805.4 715076523 714270630 713963470 715251312 715738907 714440231 714007339 713382339 712396774 713177872
$$ packed form
2742.7G34120026J050491K55356L67813Q11996k81601j092529q17795q65249m6158
2751.4G33502350k060j837311l84445O33469j008530j114121p30896J414414J324768
2760G31797638j243744q38623j4954j90811r24225L99552R84878o15844j92948j55868
2769.7G29005051l30048n72662j3810J303559J31378n08118M9744j152725k604904
2778.4G25307465j575852o64749P87048J463852j112823k13700J221j808395m18320
2787G21765747k1210K20948P44629Q55636R28955m77905k220688k061081M95300Q92487
2796.7G21122818r5749j98364j043320l73688k42691j013565m58832j173324j446762
2805.4G15076523q05893l07160J287842M87595j298676m32892o25000r85565P81098
$$ plain form
2814 713177872 714171066 712743759 711024628 712084122 712750092 711508560 711412506 711538315 711002426
2822.7 711002426 710470123 708671875 707242050 707955017 707439346 706005478 706264877 705123215 703589325
2831.4 703589325 703607712 702499390 701974182 702552490 701794739 700636215 700171204 698531036 695991135
2840.1 695991135 695803299 696531601 695157928 691369247 688636093 689229050 688714981 685901794 684123840
2848.8 684123840 684559479 683466721 679823837 678322754 677970581 677093277 676719208 677032089 677412643
2857.4 677412643 676093445 675198441 677423477 679115143 677318802 676258545 675805206 673545532 673299179
2866.1 673299179 674746628 674381256 672593536 672092667 672089233 671147461 670748367 670221176 669861832 669025726
2875.8 669025726 668000336 668809586 669124985 668706131 668316345 666829987 665419693 665375214 665538712
$$ packed form
2814G13177872R93194j427307j719131J059494O65970j241532r6054J25809n35889
2822.7G11002426n32303j798248j429825P12967n15671j433868K59399j141662j533890
2831.4G03589325J8387j108322n25208N78308p57751j158524m65011j640168k539901
2840.1F95991135j87836P28302j373673l788681k733154N92957n14069k813187j777954
2848.8F84123840M35639j092758l642884j501083l52173q77304l74069L12881L80554
2857.4F77412643j319198q95004K225036J691666j796341j060257m53339k259674k46353
2866.1F73299179J447449l65372j787720n00869l434r41772l99094n27191l59344q36106
2875.8F69025726j025390Q09250L15399m18854l89786j486358j410294m4479J63498
$$ plain form
2884.4 665538712 665189438 664184113 662319870 661831055 662214127 661268539 660858231 661719208 661957550
2893.1 661957550 660623856 658392258 657482224 657940979 657074280 655757294 655281143 654564285 653695068
2901.8 653695068 653110199 653357697 653059311 651001434 649942322 651482162 652658539 650802536 647233887
2910.5 647233887 645200653 645763092 646267624 645354462 643346481 641490707 641568985 642393188 641085510
2919.2 641085510 636976852 635300446 636528816 636772308 637142563 636107750 634529915 635019722 636362267
2927.8 636362267 637767715 638002777 637752304 637727051 636963577 635754356 636118469 638886833 640968475
2936.5 640968475 640847168 640266495 639530144 639887695 642382965 644165573 643905029 643137283 643622360
2945.2 643622360 643367996 641119614 641256866 643720016 644436646 642951889 642569962 642007446 640437241
$$ packed form
2884.4F65538712l49274j005325j864243m88815L83072r45588m10308Q60977K38342
2893.1F61957550j333694k231598r10034M58755q66699j316986m76151p16858q69217
2901.8F53695068n84869K47498k98386k057877j059112J539840J176377j856003l568649
2910.5F47233887k033234N62439N04532r13162k007981j855774P8278Q24203j307678
2919.2F41085510m108658j676406J228370K43492L70255j034813j577835M89807J342545
2927.8F36362267J405448K35062k50473k5253p63474j209221L64113K768364K081642
2936.5F40968475j21307n80673p36351L57551K495270J782608k60544p67746M85077
2945.2F43622360k54364k248382J37252K463150P16630j484757l81927n62516j570205
$$ plain form
2953.9 640437241 640793686 640213852 640145493 640536499 639850464 639588928 637850571 638421478 639888802
2962.6 639888802 639115715 638891373 639165573 639322891 639990730 643287582 645701752 646273651 646884995
2971.2 646884995 646503067 646868668 647280579 648877869 650910568 651463013 652295685 652511520 652346954
2979.9 652346954 653063812 654745102 655217667 654833069 655474091 656072006 655999374 655539398 657354431
2988.6 657354431 659071121 658902512 660008469 660167389 659889450 660730057 660513306 660957565 662077866
2997.3 662077866 661145859 660876312 662462082 662588654 662423019 662661057 661771240 662028122 662690201
3006 662690201 660971832 660636292 662255783 662018967 661759796 661443176 660154953 659905548 659956284 660297318
3015.6 660297318 660879135 660583878 659503555 659419022 660314331 658510208 656802139 657512817 657706299
$$ packed form
2953.9F40437241L56445n79834o8359L91006o86035k61536j738357N70907J467324
2962.6F39888802p73087k24342K74200J57318O67839L296852K414170N71899O11344
2971.2F46884995l81928L65601M11911J597290K032699N52445Q32672K15835j64566
2979.9F52346954P16858J681290M72565l84598O41022N97915p2632m59976J815033
2988.6F57354431J716690j68609J105957J58920k77939Q40607k16751M44259J120301
2997.3F62077866r32007k69547J585770J26572j65635K38038q89817K56882O62079
3006F62690201j718369l35540J619491k36816k59171l16620j288223k49405N0736L41034
3015.6F60297318N81817k95257j080323q4533Q95309j804123j708069P10678J93482
$$ plain form
3024.3 657706299 658324738 657398758 655102844 654504929 654891815 655275879 654064102 654744186 656441422
3033 656441422 655819016 654801483 652503510 652074966 652698135 652224808 652696228 651756744 651062698 651286697
3042.6 651286697 650867615 650894012 650827713 649064941 647124176 647570572 648551788 648897247 647484818
3051.3 647484818 646370773 646623230 645407944 645919418 647128906 646434860 644677505 642853012 643019409
3060 643019409 643219070 642626419 641135406 639642715 640472107 641223297 641469193 641131668 638558464
3068.6 638558464 638104553 640126190 640174026 639063606 637318993 637449532 638647537 637184944 636008873
3077.3 636008873 635342407 634994507 634706116 633939285 633264122 632415314 632719612 632251892 632715225 634429970
3087 634429970 632651863 630220413 630573540 630465393 628774147 629659271 630441818 628423271 627140617
$$ packed form
3024.3F57706299O18439r25980k295914n97915L86886L84064j211777O80084J697236
3033F56441422o22406j017533k297973m28544O23169m73327M71420r39484o94046K23999
3042.6F51286697m19082K6397o6299j762772j940765M46396R81216L45459j412429
3051.3F47484818j114045K52457j215286N11474J209488o94046j757355j824493J66397
3060F43019409J99661n92651j491013j492691Q29392P51190K45896l37525k573204
3068.6F38558464m53911K021637M7836j110420j744613J30539J198005j462593j176071
3077.3F36008873o66466l47900k88391p66831o75163q48808L04298m67720M63333J714745
3087F34429970j778107k431450L53127j08147j691246Q85124P82547k018547j282654
$$ plain form
3095.6 627140617 627336235 627609978 626480904 625465508 625512238 625925674 624985237 623756218 623682480
3104.3 623682480 620619316 618990288 621397209 622887688 622965813 621072998 619485130 619284744 619171791
3113 619171791 619129257 617854271 617669601 618306046 617087402 616958122 616827316 615500984 614462013
3121.7 614462013 612718239 612843513 613088036 612490082 613164558 612307892 610278816 607937927 607586632
3130.4 607586632 608861847 608150330 606461258 604761696 603962326 603850517 603862381 602470436 601422272
3139 601422272 601997604 600559998 599485359 599032326 598093605 598238068 597986984 596494980 595606422
3147.7 595606422 596253510 596290131 595918846 594356232 591541061 589778938 589927788 590529480 588360176
3156.4 588360176 587045784 587975235 588558006 588860550 587675743 584910164 583173485 583482552 582329865
$$ packed form
3095.6F27140617J95618K73743j129074j015396M6730M13436r40437j229019p3738
3104.3F23682480l063164j629028K406921J490479P8125j892815j587868k00386j12953
3113F19171791m2534j274986j84670O36445j218644j29280j30806j326332j038971
3121.7F14462013j743774J25274K44523n97954O74476q56666k029076k340889l51295
3130.4F07586632J275215p11517j689072j699562p99370j11809J1864j391945j048164
3139F01422272N75332j437606j074639m53033r38721J44463k51084j492004q88558
3147.7E95606422O47088L6621l71285j562614k815171j762123J48850O01692k169304
3156.4E88360176j314392R29451N82771L02544j184807k765579j736679L09067j152687
$$ plain form
3165.1 582329865 581305199 580757790 579988136 581395683 580633430 578679352 577391205 575993919 576106720
3173.8 576106720 575601273 573987198 572751732 572243958 571373329 571129761 571287842 569937172 568880310
3182.4 568880310 567947540 566626511 567036476 567116089 563604851 561666985 562400169 561380577 560515556
3191.1 560515556 560432625 559929581 559300461 559291306 558781738 558115311 556512070 553728676 554226151 553341675
3200.8 553341675 550921898 551316833 551591530 550873260 549526825 549105949 547463608 545525436 546154060
3209.4 546154060 545886917 544720306 544302750 544188347 543077011 542171745 541822395 541762085 542332497
3218.1 542332497 541356087 539804306 538668327 537321663 535797157 535199814 535086479 534146996 533300972
3226.8 533300972 533030586 533294754 532549324 531511726 529818344 528982925 530274315 528971710 526844826
$$ packed form
3165.1E82329865j024666n47409p69654J407547p62253j954078j288147j397286J12801
3173.8E76106720n05447j614075j235466n07774q70629k43568J58081j350670j056862
3182.4E68880310r32770j321029M09965P9613l511238j937866P33184j019592q65021
3191.1E60515556q2931n03044o29120r155n09568o66427j603241k783394M97475q84476
3200.8E53341675k419777L94935K74697p18270j346435m20876j642341j938172O28624
3209.4E46154060k67143j166611m17556j14403j111336r05266l49350o0310N70412
3218.1E42332497r76410j551781j135979j346664j524506n97343j13335r39483q46024
3226.8E33300972k70386K64168p45430j037598j693382q35419J291390j302605k126884
$$ plain form
3235.5 526844826 526129684 527222977 528253555 528594475 527613258 522147522 519989166 520539742 519919662
3244.2 519919662 520821648 520516701 520354843 519651031 517356491 516419182 516092606 514348869 513177719
3252.8 513177719 513383980 513327866 513325348 512073479 512537651 513236656 511306915 511163940 510752296 509315643
3262.5 509315643 507874908 506647644 507539368 509056931 509788971 509389305 507136078 505019989 505460320
3271.2 505460320 504405746 502670326 502945099 502792702 503437157 502929687 501765671 501665421 500304451
3279.8 500304451 498373451 497462387 497545433 497601547 499646187 500009270 495840950 492518005 491022568
3288.5 491022568 492840691 495575600 494911690 493834763 492741051 490895348 490543709 491350594 491054535
3297.2 491054535 489633179 488862228 489981575 490676422 489202538 487105942 484685249 484605827 487588272
$$ packed form
3235.5E26844826p15142J093293J030578L40920r81217n465736k158356N50576o20080
3244.2E19919662R01986l04947j61858p03812k294540r37309l26576j743737j171150
3252.8E13177719K06261n6114k518j251869M64172O99005j929741j42975m11644j436653
3262.5E09315643j440735j227264Q91724J517563P32040l99666k253227k116089M40331
3271.2E05460320j054574j735420K74773j52397O44455n07470j164016j00250j360970
3279.8E00304451j931000r11064Q3046N6114K044640L63083m168320l322945j495437
3288.5D91022568J818123K734909o63910j076927j093712j845703l51639Q06885k96059
3297.2D91054535j421356p70951J119347O94847j473884k096596k420693p9422K982445
$$ plain form
3305.9 487588272 489022942 488065338 486073685 483468132 482144508 482244072 481601372 479844666 477999649
3314.6 477999649 477239990 477897911 478583565 478027153 476771965 476674156 476774712 475503654 474779396
3323.2 474779396 473571510 470267029 469049339 469542351 467935257 467148476 467516403 466844864 467141075
3331.9 467141075 467004890 464937630 464315262 465449104 465122871 463508606 463491096 463049278 460341301
3340.6 460341301 458621292 457471619 455523186 453470345 452682724 453938026 454500504 454341774 453368721
3349.3 453368721 450322113 446791306 446328011 448920250 448462143 447483902 446537628 441731148 439736366
3357.9 439736366 441679001 444091797 444258194 441428833 439602127 438551903 437405052 436260071
3365.7 436260071 436597977 437768593 435977669 433993416 433858223 433098030 431216011 429313736 427666130
$$ packed form
3305.9D87588272J434670r57604j991653k605553j323624R9564o42700j756706j845017
3314.6D77999649p59659O57921O85654n56412j255188r7809J00556j271058p24258
3323.2D74779396j207886l304481j217690M93012j607094p86781L67927o71539K96211
3331.9D67141075j36185k067260o22368J133842l26233j614265j7510m41818k707977
3340.6D60341301j720009j149673j948433k052841p87621J255302N62478j58730r73053
3349.3D53368721l046608l530807m63295K592239m58107r78241r46274m806480j994782
3357.9D39736366J942635K412796J66397k829361j826706j050224j146851j144981
3365.7D36260071L37906J170616j790924j984253j35193p60193j882019j902275j647606
$$ plain form
3374.3 427666130 426262283 425408325 424309578 424016571 424803162 423600693 422051964 423244057 425556526
3383 425556526 425105400 420750351 419020767 419474487 417706871 417620201 417373924 416112328 415954056
3391.7 415954056 415278778 415799789 416393433 416261978 416159706 415612221 415489769 414902077 414335899 414922142
3401.3 414922142 414625549 412767220 412227249 411963310 410968666 411120758 409624863 408733902 409848976
3410 409848976 409081421 409480171 409536514 406988297 405920753 406395378 407629242 408263321 408310280 409692116
3419.7 409692116 409583626 406502686 405416870 407537498 408292961 408427505 407945251 405077019 403959503
3428.3 403959503 404800949 406517258 407305183 406183014 406790771 406899910 404993324 403941994 405451927
3437 405451927 407836113 408366966 407150345 406578369 408041992 407814255 407370644 408585701 409210281
$$ packed form
3374.3D27666130j403847q53958j098747k93007P86591j202469j548729J192093K312469
3383D25556526m51126m355049j729584M53720j767616q6670k46277j261596j58272
3391.7D15954056o75278N21011N93644j31455j02272n47485j22452n87692n66178N86243
3401.3D14922142k96593j858329n39971k63939r94644J52092j495895q90961J115074
3410D09848976p67555L98750N6343k548217j067544M74625J233864O34079M6959J381836
3419.7D09692116j08490l080940j085816K120628P55463J34544m82254k868232j117516
3428.3D03959503Q41446J716309P87925j122169O07757J09139j906586j051330J509933
3437D05451927K384186N30853j216621n71976J463623k27737m43611J215057O24580
$$ plain form
3445.7 409210281 409438324 407833481 407244949 408101196 408882065 409674988 409257736 408755188 408603096
3454.4 408603096 409450989 410661964 412660599 414920349 414899940 414231453 413708305 415169449 418415565
3463.1 418415565 419164200 417517014 418387756 421102257 421357498 421151505 419648132 419450531 421850204
3471.7 421850204 422191544 422797165 423419533 424021378 424887733 423865776 424085808 426379585 428418045
3480.4 428418045 429336395 429354973 429311409 429972687 430790710 430636559 430847206 432915840 434880714 435727196
3490.1 435727196 435453644 434922867 436742210 438011665 438233109 439660492 441009331 441908836 441759148
3498.7 441759148 443146629 445197754 445082092 445323563 446593933 447495842 447727585 448399811 448799667
3507.4 448799667 450391884 451708603 449942169 450240173 450953445 451170006 452324638 453024483 453574257
$$ packed form
3445.7D09210281K28043j604843n88532Q56247P80869P92923m17252n02548j52092
3454.4D08603096Q47893J210975J998635K259750k0409o68487n23148J461144L246116
3463.1D18415565P48635j647186Q70742K714501K55241k05993j503373j97601K399673
3471.7D21850204L41340O05621O22368O01845Q66355j021957K20032K293777K038460
3480.4D28418045R18350J8578m3564O61278Q18023j54151K10647K068634J964874Q46482
3490.1D35727196k73552n30777J819343J269455K21444J427383J348839Q99505j49688
3498.7D41759148J387481K051125j15662K41471J270370R01909K31743O72226L99856
3507.4D48799667J592217J316719j766434K98004P13272K16561J154632O99845N49774
$$ plain form
3516.1 453574257 454091873 455329399 457862167 460606651 462014046 464286270 465749359 465092773 465948639
3524.8 465948639 466786804 469214439 470599289 468955917 468794518 470553894 472297249 473286095 475270462
3533.5 475270462 476150894 476755371 477063217 476168098 476958694 477847328 479845734 481282005 481151390
3542.1 481151390 481233330 483950653 486972771 485473328 485586433 485313911 486814613 490960312 493360367
3550.8 493360367 494964256 494707832 497434807 498704033 498865662 501657677 502345581 503935966 503994522
3559.5 503994522 503193283 503632698 504991913 507976685 509574585 513314095 515173683 514376678 514794807
3568.2 514794807 514855423 517200890 518416214 521978989 525893898 525664368 524192886 526469765 531185684
3576.9 531185684 530819168 530566254 532803726 535714340 538176537 540417099 543570366 541260033 542360420
$$ packed form
3516.1D53574257N17616J237526K532768K744484J407395K272224J463089o56586Q55866
3524.8D65948639Q38165K427635J384850j643372j61399J759376J743355R88846J984367
3533.5D75270462Q80432O04477L07846q95119P90596Q88634J998406J436271j30615
3542.1D81151390Q1940K717323L022118j499443J13105k72522J500702M145699K400055
3550.8D93360367J603889k56424K726975J269226J61629K792015O87904J590385N8556
3559.5E03994522q01239M39415J359215K984772J597900L739510J859588p97005M18129
3568.2E14794807O0616K345467J215324L562775L914909k29530j471482K276879M715919
3576.9E31185684l66516k52914K237472K910614K462197K240562L153267k310333J100387
$$ plain form
3585.5 542360420 547157822 543718643 542831421 546034050 550988350 553633537 555989418 558735161
3593.2 558735161 558429642 561853867 562210579 563321495 567996445 567924995 568577881 571411819 574136353
3601.9 574136353 575006866 575922127 578543282 582121124 585884705 585497169 589234543 589661942 586064491
3610.6 586064491 592166367 597137909 597898979 600185509 597666931 600736961 607682877 610787888
3618.3 610787888 614467430 611565781 607471657 611238403 614429359 617634583 622325211 624066010
3626 624066010 626485100 633683243 636713181 627601471 627778969 631713028 638660622 641621933 638477058
3634.7 638477058 640538177 644216614 645497437 646003571 648538513 650473557 652978821 655137100
3642.4 655137100 655568085 658215637 660297012 664401016 663747940 660318069 667094955 668192520 669734573
$$ packed form
3585.5E42360420M797402l439179q87222L202629M954300K645187K355881K745743
3593.2E58735161l05519L424225L56712J110916M674950p1450O52886K833938K724534
3601.9E74136353Q70513R15261K621155L577842L763581l87536L737374M27399l597451
3610.6E86064491O101876M971542P61070K286530k518578L070030O945916L105011
3618.3F10787888L679542k901649m094124L766746L190956L205224M690628J740799
3626F24066010K419090P198143L029938r111710J77498L934059O947594K961311l144875
3634.7F38477058K061119L678437J280823N06134K534942J935044K505264K158279
3642.4F55137100M30985K647552K081375M104004o53076l429871O776886J097565J542053
$$ plain form
3651.1 669734573 668607254 670311279 674010162 678904877 686837387 678984070 678299484 684202423
3658.8 684202423 685574265 688567352 688861542 688567276 689422836 690001907 690056992 689964294 693311005
3667.5 693311005 694227448 695666580 701652603 697638245 697539520 703125763 711002655 715895157 698396301
3676.2 698396301 696899643 703956146 706550217 702313690 703035202 705974960 706509933 707692642 707005310
3684.9 707005310 707460632 713756409 722042618 713532639 704422226 715792694 717967529 712804794
3692.6 712804794 714116364 712352219 712771378 713149109 713089371 715574417 718329620 720950623 721865692
3701.3 721865692 717689438 715117187 719593811 721152725 720897522 721819000 723284683 726095734 717887039
3709.9 717887039 721981735 729202728 717108002 720450668 726625900 729404221 728235626 728096085
$$ packed form
3651.1F69734573j127319J704025L698883M894715P932510p853317o84586N902939
3658.8F84202423J371842K993087K94190k94266Q55560N79071N5085r2698L346711
3667.5F93311005R16443J439132N986023m014358r8725N586243P876892M892502j7498856
3676.2F98396301j496658P056503K594071m236527P21512K939758N34973J182709o87332
3684.9G07005310M55322O295777Q286209q509979r110413J1370468K174835n162735
3692.6G12804794J311570j764145M19159L77731n9738K485046K755203K621003R15069
3701.3G21865692m176254k572251M476624J558914k55203R21478J465683K811051q208695
3709.9G17887039M094696P220993j2094726L342666O175232K778321j168595j39541
$$ plain form
3717.7 728096085 729389877 726208496 727029648 732291183 729634247 722494507 725022278 725981522 725773087
3726.3 725773087 724744568 725432892 730776672 732631531 738381271 735601807 724365921 732163467
3734 732163467 737503738 735032196 731920547 728684998 725086517 727331924 732932053 730103607 734015045
3742.7 734015045 747313766 737097092 720074310 730218658 734810715 740972137 739848785 726444626
3750.4 726444626 737879868 735062408 725574417 730327530 734697418 738620453 731898041 734710922
3758.2 734710922 742608643 733133392 729404449 734303360 735855484 736857452 743086166 739238281
3765.9 739238281 729706955 731507568 736477127 737109909 729719162 734433517 738774490 736748657
3773.6 736748657 735443878 735556717 738466110 739350128 741503372 741124802 733395309 734834671 735786285
$$ packed form
3717.7G28096085J293792l181381Q21152N261535k656936p139740K527771R59244k08435
3726.3G25773087j028519O88324N343780J854859N749740k779464j1235886P797546
3734G32163467N340271k471542l111649l235549l598481K245407N600129k828446L911438
3742.7G34015045J3298721j0216674j7022782J0144348M592057O161422j123352j3404159
3750.4G26444626J1435242k817460r487991M753113M369888L923035o722412K812881
3758.2G34710922P897721r475251l728943M898911J552124J001968O228714l847885
3765.9G39238281r531326J800613M969559O32782p390747M714355M340973k025833
3773.6G36748657j304779J12839K909393Q84018K153244l78570p729493J439362R51614
$$ plain form
3782.3 735786285 736393051 740149155 739641190 737905655 737206879 736306534 737264404 737519455 737812881
3790.9 737812881 739657288 739529800 738129196 739296417 742859879 741939316 738113708 737522125 739023895
3799.6 739023895 745132904 741344147 728739700 733420792 737324219 740765152 746868439 738247833
3807.3 738247833 730222321 735305405 739422684 740298386 739735947 737459869 737905884 745810242 748093643
3816 748093643 730719070 733568192 740971069 746808777 754268265 738054504 730941467 736075974
3823.7 736075974 738266907 738616943 739172211 735881042 734418335 735385132 739415588 745078583 738021393
3832.4 738021393 737226334 742103195 733500214 732348404 743669510 742817688 737060623 744415283
3840.1 744415283 742944031 739155807 741220627 736534805 733605957 738200912 740893097 739112549
$$ packed form
3782.3G35786285O06766L756104n07965j735535o98776r00345R57870K55051K93426
3790.9G37812881J844407j27488j400604J167221L563462r20563l825608n91583J501770
3799.6G39023895O109009l788757j2604447M681092L903427L440933O103287q620606
3807.3G38247833q025512N083084M117279Q75702n62439k276078M46015P904358K283401
3816G48093643j7374573K849122P402877N837708P459488j6213761p113037N134507
3823.7G36075974K190933L50036N55268l291169j462707R66797M030456N662995p057190
3832.4G38021393p95059M876861q602981j151810J1321106q51822n757065P354660
3840.1G44415283j471252l788224K064820m685822k928848M594955K692185j780548
$$ plain form
3847.8 739112549 740107117 740192947 739269562 743864212 741875916 742116394 728398590 729424133 742648697
3856.5 742648697 740632782 733883514 735712433 738461609 742688370 740796890 739560852 743893356
3864.2 743893356 740472870 737128983 739116058 741458664 746954422 742704391 733352280 735913696
3871.9 735913696 740156479 744191132 738727798 735355072 736756210 736869659 738828888 743311615
3879.7 743311615 739553375 735255585 740652695 739333115 740251617 747703552 738277435 736806641
3887.4 736806641 738378601 737452011 741205215 741608734 735231323 735561981 737829056 737580032 739738007
3896.1 739738007 739255600 740009918 743074875 734281082 737005005 737061691 731466827 738718796 739422836
3904.7 739422836 739029617 738173218 736279449 740128860 742350616 741423798 739207993 738064423 737126083
$$ packed form
3847.8G39112549R94568Q5830r23385M594650j988296K40478j3717804J025543J3224564
3856.5G42648697k015915o749268J828919K749176M226761j891480j236038M332504
3864.2G43893356l420486l343887J987075K342606N495758m250031r352111K561416
3871.9G35913696M242783M034653n463334l372726J401138J13449J959229M482727
3879.7G43311615l758240m297790N397110j319580R18502P451935r426117j470794
3887.4G36806641J571960r26590L753204M03519o377411L30658K267075k49024K157975
3896.1G39738007m82407P54318L064957q793793K723923N6686n594864P251969P04040
3904.7G39422836l93219q56399j893769L849411K221756r26818k215805j143570r38340
$$ plain form
3913.4 737126083 735748444 737436523 740113983 738809128 734427490 736732101 738893433 736274338
3921.1 736274338 739086380 740521545 739155197 736434479 732941437 734839172 737349854 739941864
3928.8 739941864 739823227 739451447 741859665 738274460 735914307 736079636 736397400 737747803 738265610
3937.5 738265610 740191879 739368286 736661377 737923508 740362320 737002563 734418030 736376572
3945.2 736376572 737914810 739275131 736844177 735962982 735960999 733374710 736834793 736687622 733818359
3953.9 733818359 735571747 736271973 736220398 735398331 736506042 737490692 736510849 736256256 735428772
3962.6 735428772 737424088 739674225 737996063 735378571 734642944 736835098 738574371 737972031 737025909
3971.3 737025909 736423798 736610870 736839294 736990738 736885071 736561584 737457886 737264099 735959702
$$ packed form
3913.4G37126083j377639J688079K677460j304855m381638K304611K161332k619095
3921.1G36274338K812042J435165j366348k720718l493042J897735K510682K592010
3928.8G39941864j18637l71780K408218l585205k360153J65329L17764J350403N17807
3937.5G38265610J926269q23593k706909J262131K438812l359757k584533J958542
3945.2G36376572J538238J360321k430954q81195j983k586289L460083j47171k869263
3953.9G33818359J753388P00226n1575q22067J107711R84650r79843k54593q27484
3962.6G35428772J995316K250137j678162k617492p35627K192154J739273o02340r46122
3971.3G37025909o02111J87072K28424J51444j05667l23487Q96302j93787j304397
$$ plain form
3980 735959702 736364288 737759323 737280502 734725952 735532074 737986984 738271027 738378601 737712250
3988.6 737712250 737452316 737008362 735431137 735736084 737886658 739222641 737607346 735550003 736368713
3997.3 736368713 738294907 737746124 735527649
4000.2 735527649
$$ packed form
3980G35959702M04586J395035m78821k554550Q06122K454910K84043J07574o66351
3988.6G37712250k59934m43954j577225L04947K150574J335983j615295k057343Q18710
3997.3G36368713J926194n48783k218475
4000.2G35527649
##END=$$ End of the data block
