##TITLE=$$ Begin of the data block
##JCAMP-DX=5.00 $$ ACD/SpecManager v 10.08
##SPECTROMETER/DATA SYSTEM=Varian
##DATE=07 Jan 2013 10:07:22
##DATA TYPE=INFRARED SPECTRUM
##DATA CLASS=XYDATA
##ORIGIN=
##OWNER=
##NPOINTS=3735
##FIRSTX=399.26403809
##LASTX=4000.35498047
##MAXX=4000.35498047
##MINX=399.26403809
##MAXY=88.48469543
##MINY=13.46553421
##XFACTOR=1.0000000000
##YFACTOR=0.000000100000000
##FIRSTY=66.05747223
##DELTAX=0.96440572
##XUNITS=1/CM
##YUNITS=TRANSMITTANCE
##XYDATA=(X++(Y..Y))
$$ plain form
399.3 660574722 396029625 470608292 629625740 737601547 747962112 669085770 752930908
406 752930908 710796432 578344460 609326286 569757919 595221481 806771240 774371872
412.8 774371872 478426056 493420334 662939148 655855789 643260422 598332214 791415482
419.5 791415482 884846954 641344604 678584213 832786789 730391693 640594101 592478256
426.3 592478256 588160057 630844307 708724289 777546158 794381561 726956635 601527023
433 601527023 575236130 587927895 602535934 638684311 581464920 537808418 608589287 729715958
440.7 729715958 739442139 589544868 547827415 644834213 738374939 771870499 684654770
447.5 684654770 580697937 561548004 562820892 638770409 697398300 574211540 533882866
$$ packed form
399.3F60574722k64545097P4578667J59017448J07975807J0360565p8876342Q3845138
406G52930908m2134476j32451972L0981826l9568367K5463562K11549759l2399368
412.8G74371872k95945816J4994278J69518814p083359j2595367m4928208J93083268
419.5G91415482R3431472k43502350L7239609J54202576j02395096q9797592m8115845
426.3E92478256m318199M2684250P7879982O8821869J6835403o7424926j25429612
433F01527023k6290893J2691765J4608039L6148377n7219391m3656502P0780869J21126671
440.7G29715958R726181j49897271m1717453R7006798R3540726L3495560q7215729
447.5F84654770j03956833j9149933J272888P5949517N8627891j23186760m0328674
$$ plain form
454.2 533882866 568660240 604769821 664440079 625527153 648288269 655397644 613285332 633862190
462 633862190 597318153 539067459 617003326 694106979 625033455 596065140 646393890 719407959
469.7 719407959 676994553 542232018 567096901 654030380 622882156 546737976 547384148 573058624
477.4 573058624 530535202 566379166 648570404 629246864 603323402 642189636 665442200
484.1 665442200 612894669 581909142 584459572 586342926 558468056 502052803 509667549 620091629
491.8 620091629 691092682 682148895 674522400 663033218 673716812 652070541 600096550 661377258
499.6 661377258 666947861 567923355 533127975 533927498 544914970 565986824 629068451 703737640
507.3 703737640 638048401 573958588 624092636 658055191 603323631 576501007 609353485
$$ packed form
454.2E33882866L4777374L6109581N9670258l8912926K2761116P109375m2112312K0576858
462F33862190l6544037n8250694P7935867P7103653o9073524k8968315N0328750P3014069
469.7G19407959m2413406j34762535K4864883Q6933479l1148224p6144180O46172K5674476
477.4E73058624m2523422L5843964Q2191238j9323540k5923462L8866234K3252564
484.1F65442200n2547531l0985527K550430J883354k7874870n6415253P614746J10424080
491.8F20091629P1001053q943787p626495j1489182J0683594k1646271n1973991O1280708
499.6F61377258N570603r9024506l4795380P99523J0987472K1071854O3081627P4669189
507.3G03737640o5689239o4089813N0134048L3962555n4731560k6822624L2852478
$$ plain form
514 609353485 619924736 617837029 641137466 574557953 517650299 576506119 635270424 651625137
521.7 651625137 626943016 596260223 591476784 540573807 530390396 570978546 568330460 551822319
529.5 551822319 553454361 567148666 567676926 565173454 555565224 543337860 561406441 582223816
537.2 582223816 583939476 575635490 583351860 609981918 610516167 586852455 574203072 579088974
544.9 579088974 595387077 602501030 582195511 565546074 576906204 586161118 584459915 590249100
552.6 590249100 590304489 600139275 616587791 594751167 557547684 537518120 537757912 550162239
560.3 550162239 568233566 600444756 620893974 617336960 588635826 555219612 582863693 620295219
568 620295219 602751999 568575974 541213608 546474571 582845650 609317169 626040649 642449646
$$ packed form
514F09353485J0571251k087707K3300437o6579513n6907654N8855820N8764305J6354713
521.7F51625137k4682121l0682793m783439n0902977j0183411M0588150k648086j6508141
529.5E51822319J632042J3694305N28260k503472r608230j2227364J8068581K0817375
537.2E82223816J715660q303986P716370K6630058N34249k3663712j2649383M885902
544.9E79088974J6298103P113953k0305519j6649437J1360130R254914j701203N789185
552.6E90249100N5389R834786J6448516k1836624l7203483k0029564K39792J2404327
560.3E50162239J8071327L2211190K0449218l557014k8701134l3416214K7644081L7431526
568F20295219j7543220l4176025k7362366N260963L6371079K6471519J6723480J6408997
$$ plain form
575.8 642449646 604802399 550604706 556750603 579357529 561199913 540267677 550705605 565136185
583.5 565136185 563778572 574066467 605504761 611708870 582868690 585156441 607687874 611913071
591.2 611913071 589412003 557145615 575837059 600271111 595142288 593248024 578564644 583899879
598.9 583899879 588127899 569131966 578401642 585135689 566889687 560231743 581759224 577996407
606.6 577996407 537511024 525735359 526700516 516796570 499224243 472785912 462322960 446728592
614.3 446728592 411709442 403259811 428085175 448820114 440327263 423209572 431637993 432919464
622 432919464 413551941 395837021 394978600 411501808 415315628 431824226 460221252 474346046
629.8 474346046 493425102 507159233 505460625 493866653 489073257 487807465 465459213 449056091
$$ packed form
575.8F42449646l7647247n4197693O145897K2606926j8157616k0932236J0437928J4430580
583.5E65136185j357613J0287895L1438294O204109k8840180K287751K2531433M225197
591.2F11913071k2501068l2266388J8691444K4434052n128823j894264j4683380N335235
598.9E83899879M228020j8995933R269676O734047j8246002o657944K1527481l762817
606.6E77996407m0485383j1775665R65157r903946j7572327k6438331j0462952j5594368
614.3D46728592l5019150q449631K4825364K0734939q492851j7117691Q428421J281471
622D32919464j9367523j7714920q58421J6523208L813820J6508598K8397026J4124794
629.8D74346046J9079056J3734131j698608j1593972m793396j265792k2348252j6403122
$$ plain form
637.5 449056091 442970734 446270943 464043198 471674652 478803177 493678093 513939285 540356445
645.2 540356445 554252548 569042778 588574409 601590309 610685921 612678947 612269516 614848061
652.9 614848061 607074738 591721573 594263725 616334839 639524422 632429047 618094826 627923431
660.6 627923431 619915276 603649216 595972137 591707001 603087234 618121071 628674049 622322235
668.3 622322235 627734070 630530777 632529373 632165031 611080208 609860153 626748924 629597206
676.1 629597206 635340919 641819382 642416916 643895340 635047302 614528961 619371758 637475777
683.8 637475777 637894707 642934570 643405228 631816406 627161865 631541443 642021255 636868782
691.5 636868782 617682266 611716042 615704155 618621597 617318954 616680489 617115707 614794006 614476089
$$ packed form
637.5D49056091o085357L300209J7772255P631454P128525J4874916K0261192K6417160
645.2E40356445J3896103J4790230J9531631J3015900R095612J993026m09431K578545
652.9F14848061p773323j5353165K542152K2071114K3189583p095375j4334221R828605
660.6F27923431q008155j6266060p677079m265136J1380233J5033837J0552978o351814
668.3F22322235N411835K796707J998596l64342k1084823j220055J6888771K848282
676.1F29597206N743713O478463N97534J478424q848038k0518341M842797J8104019
683.8F37475777M18930N039863M70658j1588822m654541M379578J0479812n152473
691.5F36868782j9186516n966224L988113K917442j302643o38465M35218k321701l17917
$$ plain form
700.2 614476089 603018227 594195824 604697838 611060791 616630020 620312500 616271362 612716827
707.9 612716827 614071732 618849144 618784294 633470078 638844261 621939201 623657722 630835762
715.6 630835762 633829994 632437935 633765297 649576111 659370880 656226730 646391830 642633209
723.3 642633209 640229950 632104111 629179649 629880791 636627083 641854248 644198074 642754974 637537613
732 637537613 643667908 648165131 641030731 632729530 624433899 612132492 612809143 631787987 641665192
740.7 641665192 647386551 647411957 637809525 641036148 642480927 638085289 643782196 645865250 644555359
749.3 644555359 651804504 651460419 645135040 655224762 662936172 662446365 673431854 680043259
757.1 680043259 675823441 672175827 675529633 679826202 673497162 676300812 687224808 681018982
$$ packed form
700.2F14476089j1457862q822403J0502014O362953N569229L682480m041138l554535
707.9F12716827J354905M777412o4850J4685784N374183j6905060J718521P178040
715.6F30835762K994232j392059J327362J5810814R794769l144150r834900l758621
723.3F42633209k403259q125839k924462P01142O746292N227165K343826j443100n217361
732F37537613O130295M497223p134400q301201q295631j2301407O76651J8978844R877205
740.7F41665192N721359K5406r602432L226623J444779m395638N696907K083054j309891
749.3F44555359P249145l44085o325379J0089722P711410m89807J0985489O611405
757.1F80043259m219818l647614L353806M296569o329040K803650J0923996o205826
$$ plain form
764.8 681018982 676032944 678037491 672187042 671732025 673984680 676366959 676461258 668754044 675950241
773.5 675950241 675531311 664147873 680824814 695681152 686758957 677522430 681617279 690561600
781.2 690561600 696403503 701969833 700001526 698760910 693508759 685161209 692613602 701093369
788.9 701093369 699386368 693635025 697779312 707932205 711385193 710819092 711962433 717245560
796.6 717245560 711015854 707409058 711183167 700865250 691848068 690753479 696424713 707900925
804.3 707900925 712158585 703920135 698083344 700087280 699509354 700229721 696866455 699735489 702409210
813 702409210 695023270 699605408 702717438 711696548 722576447 718174973 724243546 720488434 694914703
821.7 694914703 694229126 717303391 711516800 691268921 690005264 698552475 704553833 699076233
$$ packed form
764.8F81018982m986038K004547n850449m55017K252655K382279R4299p707214P196197
773.5F75950241m18930j1383438J6676941J4856338q922195r236527M094849Q944321
781.2F90561600N841903N566330j968307j240616n252151q347550P452393Q479767
788.9G01093369j707001n751343M144287J0152893L452988n66101J143341N283127
796.6G17245560o229706l606796L774109j0317917r017182j094589N671234J1476212
804.3G07900925M257660q238450n836791K003936n77926P20367l363266K869034K673721
813G02409210p385940M582138L112030Q979110J0879899m401474O068573l755112k5573731
821.7F94914703o85577K3074265n786591k0247879j263657Q547211O001358n477600
$$ plain form
829.4 699076233 700325928 698546371 689082031 693496399 696960602 692494507 679864578 673218842
837.1 673218842 671859131 668613358 668728027 668169556 671630478 661744919 652381439 652111359 654233170
845.8 654233170 666757584 656274261 646379471 658923874 661518478 656617126 655573273 659811478
853.5 659811478 668308029 678293610 682865143 693925781 703819046 693621216 680144730 671063004
861.2 671063004 684681625 703369370 697243195 691183395 689095001 688754730 694896545 701933136
868.9 701933136 705612564 703054352 694546051 692444382 697567749 692439194 690506439 695469131
876.7 695469131 693563385 684277725 675670853 681760025 688595428 686569977 679998322 673211594
884.4 673211594 674399109 673329315 669935989 669898071 670827332 672018967 672065659 677630615 685177307
$$ packed form
829.4F99076233J249695j779557r464340M414368L464203m466095j2629929o645736
837.1F73218842j359711l245773J14669n58471L460922r885559r363480k70080K121811
845.8F54233170J2524414j0483323r894790J2544403K594604m901352j043853M238205
853.5F59811478Q496551R985581M571533J1060638R893265j0197830j3476486r081726
861.2F71063004J3618621J8687745o126175o059800k088394l40271O141815P036591
868.9G01933136L679428k558212q508301k101669N123367n128555j932755M962692
876.7F95469131j905746r285660q606872O089172O835403k025451o571655o786728
884.4F73211594J187515j069794l393326l7918R29261J191635M6692N564956P546692
$$ plain form
893 685177307 686401138 687030106 689540176 688397598 687245331 688973160 690377502 690096664 684390640
901.7 684390640 682092361 683235626 678126450 676722107 678050613 674249344 668067856 669493942
909.4 669493942 676390762 669358063 660728226 659761734 656477203 658158493 659215469 655010910 654066315
918.1 654066315 655834122 653580627 645778198 639544907 634350662 625766716 619285736 621694946
925.8 621694946 623799858 623284531 625367737 621814766 619854012 622667580 622107887 623940163 626165504
934.5 626165504 624913254 625813599 632140808 638707581 640046692 638422356 641899185 653063660
942.2 653063660 654199982 650241776 655922470 654154053 651671982 658596725 662736664 662648926 657243271
950.9 657243271 657027283 662624969 660898209 662534332 667608719 666448059 661310196 656998520 658362961
$$ packed form
893F85177307J223831O28968K510070j142578j152267J727829J404342k80838n706024
901.7F84390640k298279J143265n109176j404343J328506l801269o181488J426086
909.4F69493942O896820p032699q629837r66492l284531J681290J056976m204559r44595
918.1F54066315J767807k253495p802429o233291n194245q583946o480980K409210
925.8F21694946K104912n15327K083206l552971j960754K813568n59693J832276K225341
934.5F26165504j252250R00345O327209O566773J339111j624336L476829J1164475
942.2F53063660J136322l958206N680694j768417k482071O924743M139939q7738n405655
950.9F57243271k15988N597686j726760J636123N074387j160660n137863m311676J364441
$$ plain form
959.6 658362961 655802307 652550812 658928375 661389694 657153702 651029358 639863892 631793556
967.3 631793556 631826019 629240341 623470421 622408524 624336510 625635948 623543777 618993988 617457733
976 617457733 621018257 625626183 626285706 623260078 621309433 622652092 620550270 617683449 621001625
984.7 621001625 620828209 611341667 597445450 591527824 593198013 586081848 579904785 583928871
992.4 583928871 581685333 563451996 534998779 516986809 520932121 535081177 549239159 562268486
1000.1 562268486 572044029 570122681 565924873 568813705 570970688 569241676 565519562 566611748
1007.8 566611748 571459732 570306435 560240479 552359314 555332222 556759109 554275475 553361397
1015.5 553361397 553297310 551369324 542977638 535248947 534389915 535157776 534480515 539306793 546299019
$$ packed form
959.6F58362961k560654l251495O377563K461319m235992o124344j1165466q070336
967.3F31793556L2463k585678n769920j061897J927986J299438k092171m549789j536255
976F17457733L560524M607926O59523l025628j950645J342659k101822k866821L318176
984.7F21001625j73416r486542j3896217n917626J670189p116165o177063M024086
992.4E83928871k243538j8233337k8453217j8011970L945312J4149056J4157982J3029327
1000.1E62268486R775543j921348m197808K888832K156983j729012l722114J092186
1007.8E66611748M847984j153297j0065956p881165K972908J426887k483634r14078
1015.5E53361397o4087j927986q391686p728691q59032P67861o77261M826278O992226
$$ plain form
1024.2 546299019 543640785 537947388 537526741 531938972 521694260 520373154 518014870 511939011
1031.9 511939011 508470306 508264351 516593208 514877129 504887543 504843369 505531654 503031425 504366875
1040.6 504366875 507627945 505643806 505203514 504464874 501988182 503788643 499119225 496024323 506629868
1049.3 506629868 513845062 509781685 506978302 502424774 498831139 504502602 506794739 508726768
1057 508726768 511084862 509702301 514061661 518264656 513694000 507812576 505210495 499936256 498073273
1065.7 498073273 502147522 505251694 507965355 506331940 498594131 492712593 497015076 502994232
1073.4 502994232 500902176 497038383 498335991 501900063 499185448 495584641 495795593 493524170
1081.1 493524170 489327698 493412666 500137520 496264725 490997162 487400856 482947464 478728333
$$ packed form
1024.2E46299019k658234n693397m20647n587769j0244712j321106k358284o075859
1031.9E11939011l468705k05955Q328857j716079r989586m4174O88285k500229J335450
1040.6E04366875L261070j984139m40292p38640k476692J800461m669418l094902J0605545
1049.3E06629868P215194m063377k803383m553528l593635N671463K292137J932029
1057E08726768K358094j382561M359360M202995m570656n881424k602081n274239j862983
1065.7D98073273M074249L104172K713661j633415p737809n881538M302483N979156
1073.4E02994232k092056l863793J297608L564072k714615l600807K10952k271423
1081.1D93524170m196472M084968O724854l872795n267563l596306m453392m219131
$$ plain form
1088.8 478728333 478950768 480362740 466781654 446036186 433521614 433037796 431272202 419296455
1096.5 419296455 402277298 386088181 378956490 368319016 354935608 342935638 328104401
1103.3 328104401 312772770 293991909 282567463 273966103 257444420 243002167 237309608 230275230
1111 230275230 216674309 203804855 197443943 196173496 194777069 193840637 190374489 188268738
1118.7 188268738 188149414 189407883 190573521 194004593 199982891 196493111 200250950 206352634
1126.4 206352634 206603851 209060783 206453686 207957058 210492134 207772388 199811649 194729786
1134.1 194729786 195098972 188845024 181167030 174959278 174769535 175965405 173856258 167734947 161680222
1142.8 161680222 162622681 157686014 152383003 151375017 150078688 141713543 134655342 143591042
$$ packed form
1088.8D78728333K22435J411972j3581086k0745468j2514572m83818j765594j1975747
1096.5D19296455j7019157j6189117p131691j0637474j3383408j1999970j4831237
1103.3C28104401j5331631j8780861j1424446q601360j6521683j4442253n692559p034378
1111B30275230j3600921j2869454o360912j270447j396427r36432l466148k105751
1118.7A88268738j19324J258469J165638L431072N978298l489780L757839O101684
1126.4B06352634K51217K456932k607097J503372K535076k719746p960739n081863
1134.1A94729786L69186o253948p677994o207752j89743J195870k109147o121311o054725
1142.8A61680222R42459m936667n303011j007986j296329q365145p058201Q935700
$$ plain form
1150.5 143591042 149401569 146434641 141867189 141835165 144943972 147761621 149791937 151236610 157333927
1159.2 157333927 159479685 162557907 168511333 171564903 175741062 181490231 183665333 183846149
1166.9 183846149 193813763 205580997 211649532 212813702 220278931 234540977 239437389 246461411
1174.6 246461411 258909416 268393459 273323250 279896679 294390850 308371086 316459637 324803429
1182.4 324803429 337539215 349533119 364031296 376993790 384094048 387821541 387576675 392425270
1190.1 392425270 401060028 412064209 423298683 427826004 431799049 435998383 439835281 446785278
1197.8 446785278 456938400 466376877 470084839 475015678 485912247 492091904 495301437 502342415
1205.5 502342415 507722931 510006447 511958504 514361534 513518677 515044022 521838608 526248093
$$ packed form
1150.5A43591042N810527k966928m567452l2024L108807K817649K030316J444673O097317
1159.2A57333927K145758L078222N953426L053570M176159N749169K175102J80816
1166.9A83846149R967614J1767234O068535J164170P465229J4262046M896412P024022
1174.6B46461411J2448005R484043M929791O573429J4494171J3980236Q088551Q343792
1182.4C24803429J2735786J1993904J4498177J2962494P100258L727493k44866M848595
1190.1C92425270Q634758J1004181J1234474M527321L973045M199334L836898O949997
1197.8D46785278J0153122R438477L707962M930839J0896569O179657L209533P040978
1205.5E02342415N380516K283516J952057K403030q42857J525345O794586M409485
$$ plain form
1213.2 526248093 530799294 533711815 533910828 533372726 534422913 538920898 539813957 539160004 539850693
1221.9 539850693 540843811 542431870 546040039 551550446 550122757 545600700 545182037 546385651 549871368
1230.6 549871368 553329964 551562195 548354797 550812073 554022179 554553185 552720261 549200516
1238.3 549200516 550940742 553524284 552587585 552206955 552985001 555455322 557086906 558963585 563504486
1247 563504486 565043983 562301598 560641708 560116577 558669968 560515518 563323517 562422066 562668076
1255.7 562668076 565929260 570047035 569480057 567322083 570414581 569786758 565848923 564737701 568165932
1264.3 568165932 572231636 570033112 572709732 579564629 579577332 577138596 576227188 576784363 577812004
1273 577812004 579565163 581154900 583623314 586124535 587743950 593429794 598560486 598656960 597569847
$$ packed form
1213.2E26248093M551201K912521J99013n38102J050187M497985Q93059o53953O90689
1221.9E39850693R93118J588059L608169N510407j427689m522057m18663J203614L485717
1230.6E49871368L458596j767769l207398K457276L210106N31006j832924l519745
1238.3E49200516J740226K583542r36699l80630P78046K470321J631584J876679M540901
1247E63504486J539497k742385j659890n25131j446609J845550K807999r01451K46010
1255.7E62668076L261184M117775n66978k157974L092498o27823l937835j111222L428231
1264.3E68165932M065704k198524K676620O854897J2703k438736r11408N57175J027641
1273E77812004J753159J589737K468414K501221J619415N685844N130692R6474j087113
$$ plain form
1281.7 597569847 598670197 600148697 601387138 604317436 606627274 608238564 609711151 612245522
1289.4 612245522 615537796 617676659 618973465 619713249 620042534 620345192 623896751 628556213 629714622
1298.1 629714622 628890915 630615540 634215622 634396706 634035988 634764214 635533028 636491547 639124756
1306.8 639124756 644133911 644505157 642897415 644798965 644719009 643488159 645622025 645802231 643995972
1315.4 643995972 643855209 641863632 640193329 641068649 643813171 648562241 650135117 649320297 649621735
1324.1 649621735 648555298 645492554 643880997 648363876 654456024 653719788 651471405 653496246
1331.8 653496246 654697495 654242249 654912949 653885574 650424194 651085205 656025162 658399506 656959991
1340.5 656959991 656164856 655849075 655920181 656293030 654272385 654599609 656803360 653984146 649003448
$$ packed form
1281.7E97569847J100350J478500J238441K930298K309838J611290J472587K534371
1289.4F12245522L292274K138863J296806P39784L29285L02658L551559M659462J158409
1298.1F29714622q23707J724625L600082J81084l60718P28226P68814R58519K633209
1306.8F39124756N009155L71246j607742J901550p9956j230850K133866J80206j806259
1315.4F43995972j40763j991577j670303Q75320K744522M749070J572876q14820L01438
1324.1F49621735j066437l062744j611557M482879O092148p36236k248383K024841
1331.8F53496246J201249m55246O70700j027375l461380O61011M939957K374344j439515
1340.5F56959991p95135l15781P1106L72849k020645L27224K203751k819214m980698
$$ plain form
1349.2 649003448 646166458 645336380 644470901 646758881 649800797 647335663 646908188 651372910 652574005
1357.9 652574005 648307571 645575714 647368088 648448334 647228928 650029373 651651917 650301819
1365.6 650301819 648634796 643541107 640245590 637933960 634926186 636741676 636847420 638470917
1373.3 638470917 639359055 634889641 633337135 631808434 632539215 633268127 634133339 634307404 631962662
1382 631962662 631325874 630209999 632260475 633828888 629179878 628132095 630196724 628682823 628771706
1390.7 628771706 629366074 627742844 628702507 628783875 627513237 626420212 625843048 630155373 629228973
1399.3 629228973 625940018 625136681 622275009 619223518 617198944 616505585 612656631 610925751 610977859
1408 610977859 608576279 606120644 605921135 608850212 607745132 605067902 606164742 605859375 603283234
$$ packed form
1349.2F49003448k836990q30078q65479K287980L041916k465134m27475M464722J201095
1357.9F52574005m266434k731857J792374J080246j219406K800445J622544j350098
1365.6F50301819j667023n093689l295517k311630l007774J815490J05744J623497
1373.3F38470917Q88138m469414j552506j528701P30781P28912Q65212J74065k344742
1382F31962662o36788j115875K050476J568413m649010j047783K064629j513901Q8883
1390.7F28771706N94368j623230R59663Q1368j270638j093025n77164M312325r26400
1399.3F29228973l288955q03337k861672l051491k024574o93359l848954j730880N2108
1408F10977859k401580k455635j99509K929077j105080k677230J096840l05367k576141
$$ plain form
1416.7 603283234 602255363 605069923 601156311 593902321 593313408 593338203 591155319 590541725 594759521
1425.4 594759521 594353065 589814606 588962898 589278526 586452637 584978714 586444893 586541023 585046577
1434.1 585046577 585685654 588119431 584376907 582845421 586602211 586915817 585904655 585704994 586197662
1442.7 586197662 588403664 588759460 588756447 589648476 590404854 590248032 591920166 593788681 592568283
1451.4 592568283 590825996 589966087 591544228 592338867 586163635 580454445 587605286 594707451 599944611
1460.1 599944611 603296051 603652687 605036201 609186096 613119011 612637215 611314697 611036835 611750221
1468.8 611750221 614135399 613397217 611879578 621221542 626706429 627813225 628187561 629436722 631970177
1477.5 631970177 635573425 637904282 636949043 639014931 640901489 643011856 644651184 643711777 645968857
$$ packed form
1416.7F03283234j027871K814560l913612p253990n88913K4795k182884o13594M217796
1425.4E94759521m06456m538459q51708L15628k825889j473923J466179R6130j494446
1434.1E85046577O39077K433777l742524j531486L756790L13606j011162j99661M92668
1442.7E86197662K206002L55796l013Q92029P56378j56822J672134J868515j220398
1451.4E92568283j742287q59909J578141P94639o175232n709190P150841P102165N237160
1460.1E99944611L351440L56636J383514M149895L932915m81796j322518k77862P13386
1468.8F11750221K385178p38182j517639R341964N484887J106796L74336J249161K533455
1477.5F31970177L603248K330857r55239K065888J886558K110367J639328r39407K257080
$$ plain form
1486.1 645968857 649138565 651135483 651483078 649048157 647880478 647463608 647999878 648875809 651776199
1494.8 651776199 652178726 643043137 645800934 650457077 648638763 647010269 648083115 650875549
1502.5 650875549 650394745 650394287 654349289 651875534 633591690 637238197 645619659 646044922 646136551
1511.2 646136551 647356949 645752792 644507904 643487625 645422592 644349518 636114960 637433853
1518.9 637433853 641822891 645842972 644205170 645266495 647579422 647021942 642693634 642745972 640045471
1527.6 640045471 635060959 638131142 641535645 642647018 642403564 642455902 638605270 636411972 637730865
1536.3 637730865 637802773 637093353 640233765 643868179 645347977 647209015 643414841 643468399 646631546
1545 646631546 639265366 635371208 638328934 640423965 636916618 635119171 637922478 640195084 646504517
$$ packed form
1486.1F45968857L169708J996918L47595k434921j167679m16870N36270Q75931K900390
1494.8F51776199M02527r135589K757797M656143j818314j628494J072846K792434
1502.5F50875549m80804m58L955002k473755j8283844L646507Q381462M25263R1629
1511.2F46136551J220398j604157j244888j020279J934967j073074q234558J318893
1518.9F37433853M389038M020081j637802J061325K312927n57480m328308N2338k700501
1527.6F40045471m984512L070183L404503J111373k43454N2338l850632k193298J318893
1536.3F37730865P1908p09420L140412L634414J479798J861038l794174N3558L163147
1545F46631546p366180l894158K957726K095031l507347j797447K803307K272606O309433
$$ plain form
1553.6 646504517 650296021 643526077 646799850 653476791 635313301 636717987 647744904 647679138
1561.4 647679138 649013596 648719711 650088577 652380447 651962280 651896210 650906219 647786179 643671722
1570 643671722 647393799 651281815 652534256 651806946 652603607 655615387 649705200 648279800 647777023
1578.7 647777023 645952759 642981796 639555779 640220947 639976616 639160919 636745758 636185532 637633247
1587.4 637633247 633797874 629976845 626044273 623825989 622681046 622252426 622629585 620024567 616350594
1596.1 616350594 610527267 606900978 605512543 604765015 601581841 596542587 594405479 592783089
1603.8 592783089 591599197 590186882 589440498 585637245 583887062 582669411 576539268 574593887
1611.5 574593887 573245888 572505798 570091400 567080650 561747971 554365425 557475433 555840645
$$ packed form
1553.6F46504517L791504o769944L273773O676941j8163490J404686J1026917o5766
1561.4F47679138J334458k93885J368866K291870m18167o6070r89991l120040m114457
1570F43671722L722077L888016J252441p27310P96661L011780n910187j425400n02777
1578.7F47777023j824264k970963l426017O65168k44331q15697k415161n60226J447715
1587.4F37633247l835373l821029l932572k218284j144943m28620L77159k605018l673973
1596.1F16350594n823327l626289j388435p47528l183174n039254k137108j622390
1603.8E92783089j183892j412315p46384l803253j750183j217651o130143j945381
1611.5E74593887j347999p40090k414398l010750n332679p382546L110008j634788
$$ plain form
1619.2 555840645 554846306 553560448 553849030 551868477 546769371 549819565 547494583 543591423 542042923
1627.9 542042923 544200821 542601280 538573418 537823181 536422729 536595039 536573906 534192314 534297447
1636.6 534297447 537132492 536326065 532411613 530286369 529532852 531759033 532449951 535084076 539371185
1645.3 539371185 536884499 536413536 539425163 539908447 540121536 543485985 542564240 521848450 540148811
1653.9 540148811 546665077 546952019 547531395 552102814 555286026 556397057 555677414 555323677 557938423
1662.6 557938423 558058167 561733856 564591255 566195641 570100517 575288658 576800194 579900703
1670.3 579900703 586871109 585870705 586101799 589507790 593496017 593732948 592544479 594567795 597710571
1679 597710571 601436272 602704353 605937500 610678596 609499207 606644745 609927902 616621170 622400856
$$ packed form
1619.2E55840645r94339j285858K88582j980553n099106L050194k324982l903160j548500
1627.9E42042923K157898j599541m027862p50237j400452J72310k1133k381592J05133
1636.6E34297447K835045q06427l914452k125244p53517K226181O90918K634125M287109
1645.3E39371185k486686m70963L011627M83284K13089L364449r21745k0715790J8300361
1653.9E40148811O516266K86942N79376M571419L183212J111031p19643l53737K614746
1662.6E57938423J19744L675689K857399J604386L904876N188141J511536L100509
1670.3E79900703O970406j000404K31094L405991L988227K36931j188469K023316L142776
1679E97710571L725701J268081L233147M741096j179389k854462L283157O693268N779686
$$ plain form
1687.7 622400856 626265945 628808784 629325752 631498184 634891129 638738594 642143173 644758682
1695.4 644758682 645973282 649770660 653938370 659462585 669883423 662863998 667887421 674921875
1703.1 674921875 676223221 674511871 678407211 681436539 682239304 686380310 691781693 693647842
1710.8 693647842 693508835 696659241 702504501 702502975 699079666 703061218 707597961 699759445 700045013
1719.5 700045013 705789719 708945312 708964005 709083786 709598312 711666260 713418732 711337662 710272827
1728.2 710272827 714934006 717488022 714370499 715289001 720799255 732845917 723737335 718678894
1735.9 718678894 722084503 724617081 728162689 726438446 719469528 723055878 726837921 727076263
1743.6 727076263 728359756 732521362 735001221 734544678 734663620 733615265 736117859 740055084 740871582
$$ packed form
1687.7F22400856L865089K542839N16968K172432L392945L847465L404579K615509
1695.4F44758682J214600L797378M167710N524215J0420838p019425N023423P034454
1703.1F74921875J301346j711350L895340L029328Q02765M141006N401383J866149
1710.8F93647842j39007L150406N845260j526l423309L981552M536743p838516K85568
1719.5G00045013N744706L155593J8693J19781N14526K067948J752472k081070j064835
1728.2G10272827M661179K554016l117523R18502N510254J2046662r108582n058441
1735.9G18678894L405609K532578L545608j724243o968918L586350L782043K38342
1743.6G27076263J283493M161606K479859m56543J18942j048355K502594L937225Q16498
$$ plain form
1752.3 740871582 743812943 746328049 748173752 751132584 751105194 749753647 749487915 750285873 753014603
1761 753014603 752893982 753874359 756672440 756865158 757420425 759064407 759703369 756704712 757011108
1769.7 757011108 760357285 761409988 758750000 757115021 759790573 761733704 761533508 762512665 763295975
1778.3 763295975 764208603 765175705 765255890 765868835 766398773 766349564 765614090 763925171 765086975 767848663
1788 767848663 768214417 767123413 765173798 767286072 766805954 765126266 768703003 768715210 769200516
1796.7 769200516 773351974 776741943 774459457 768610764 770389557 770903168 769680405 771845627
1804.4 771845627 773090134 772487640 773860168 775081100 772901382 772611389 773515167 773009033 771755600
1813 771755600 771127014 772517395 773814545 774982681 774928055 774732285 774087753 773746109 774850693
$$ packed form
1752.3G40871582K941361K515106J845703K958832k7390j351547k65732P97958K728730
1761G53014603j20621R80377K798081J92718N55267J643982O38962k998657L06396
1769.7G57011108L346177J052703k659988j634979K675552J943131k00196R79157P83310
1778.3G63295975R12628R67102Q0185O12945N29938m9209p35474j688919J161804K761688
1788G67848663L65754j091004j949615K112274m80118j679688L576737J2207M85306
1796.7G69200516M151458L389969k282486n848693J778793N13611j222763K165222
1804.4G71845627J244507o02494J372528J220932k179718k89993R03778n06134j253433
1813G71755600o28586J390381J297150J168136n4626j95770o44532l41644J104584
$$ plain form
1821.7 774850693 774304657 775314255 776983032 775017471 773953857 775410004 777452164 777745972 774345398
1830.4 774345398 775406723 779231491 779673004 779261475 777825089 775672836 776605301 778319168 779988708
1839.1 779988708 779364166 779086456 780188599 781799088 783417664 777527618 777622833 780101776 781365128
1847.8 781365128 782388611 781302185 780346985 780367203 781370850 782273865 782922134 781996613 780120010
1856.4 780120010 779773102 780564728 782884598 783545761 783097153 782173920 780739212 781336594 782083435
1865.1 782083435 781981964 781574631 782419586 781895599 780257492 781995697 782652359 782625809 784230881
1873.8 784230881 784196701 782858810 782706909 781893234 783049316 785838013 785867538 784624939 782867355
1882.5 782867355 783146667 783597946 781356430 780067291 781166763 785012283 787377701 786549835 786012726
$$ packed form
1821.7G74850693n46036J009598J668777j965561j063614J456147K042160K93808l400574
1830.4G74345398J061325L824768M41513m11529j436386k152253R32465J713867J669540
1839.1G79988708o24542k77710J102143J610489J618576n890046R5215K478943J263352
1847.8G81365128J023483j086426r55200K0218J003647R03015O48269r25521j876603
1856.4G80120010l46908P91626K319870O61163m48608r23233j434708N97382P46841
1865.1G82083435j01471m07333Q44955n23987j638107J738205O56662k6550J605072
1873.8G84230881l4180j337891j51901q13675J156082K788697K9525j242599j757584
1882.5G82867355K79312M51279k241516j289139J099472L845520K365418q27866n37109
$$ plain form
1891.2 786012726 784256592 784601669 786309357 784244080 781442795 780474167 781601486 783673248 783050308
1899.8 783050308 782425079 783279724 784161530 784794617 784684906 784027481 782839508 783362808 784764023
1908.5 784764023 785221405 785216217 785275040 785931854 785296555 784712296 783810272 784529953 786201019 782477951
1918.2 782477951 781218185 781666946 781567154 782899399 782402420 782494278 782535934 783017197 784423370 783331680
1927.8 783331680 782557220 783411484 783015060 782240829 782498093 783330765 784616776 783941422 782664032
1936.5 782664032 782806778 782167358 782881088 784782639 785538559 784553223 782332535 782768555 783152847
1945.2 783152847 782348709 782598419 783062973 782708054 780792694 780177689 782618637 784157104 783924179
1953.8 783924179 783176193 781908798 780956497 781554871 782512589 782887878 783567657 782683258 781993179
$$ packed form
1891.2G86012726j756134L45077J707688k065277k801285r68628J127319K071762o22940
1899.8G83050308o25229Q54645Q81806O33087j09711o57425j187973N23300J401215
1908.5G84764023M57382n188N8823O56814o35299n84259r02024P19681J671066l723068
1918.2G82477951j259766M48761r9792J332245m96979R1858M1656M81263J406173j091690
1927.8G83331680p74460Q54264l96424p74231K57264Q32672J286011o75354j277390
1936.5G82664032J42746o39420P13730J901551P55920r85336k220688M36020L84292
1945.2G83152847q04138K49710M64554l54919j915360o15005K440948J538467k32925
1953.8G83924179p47986j267395r52301N98374R57718L75289O79779q84399o90079
$$ plain form
1962.5 781993179 782568359 782441254 782546463 782891617 783488159 782175598 781400223 781956940 780963974
1971.2 780963974 781058655 781134949 781300888 781610565 781645432 782292252 781865997 782708740 782222137 780296860
1980.8 780296860 779942780 779869537 781630020 781942902 779727097 779838257 781154785 780713730 780587463
1989.5 780587463 780942612 780602264 780715790 780201721 779448929 779141846 780045090 780925369 780735703 780620956
1999.2 780620956 779301682 778983688 779105377 778178101 777631302 777190552 777476578 777846451 778506927
2007.8 778506927 777991867 777452087 780158157 782202988 780326691 778246384 780483017 782210922 780564194
2016.5 780564194 779424133 778939133 779289551 779715729 778364182 776053619 775606689 776662445 776885605
2025.2 776885605 777570801 778667908 778731384 776987457 775360184 776479721 777152176 775722275 774947510
$$ packed form
1962.5G81993179N75180j27105J05209L45154N96542j312561p75375N56717r92966
1971.2G80963974R4681P6294J65939L09677L4867O46820m26255Q42743m86603j925277
1980.8G80296860l54080p3243J760483L12882k215805J11160J316528m41055j26267
1989.5G80587463L55149l40348J13526n14069p52792l07083R03244Q80279j89666j14747
1999.2G80620956j319274l17994J21689r27276n46799m40750K86026L69873O60476
2007.8G78506927n15060n39780K706070K044831j876297k080307K236633J727905j646728
2016.5G80564194j140061m85000L50418M26178j351547k310563m46930J055756K23160
2025.2G76885605O85196J097107O3476j743927j627273J119537O72455j429901p74765
$$ plain form
2033.9 774947510 775468369 776880493 778086929 777591019 776341400 776255493 777316132 777020187 775181503
2042.6 775181503 774856949 776274796 776264038 775280533 776815643 777854004 775770874 774124069 774598465
2051.2 774598465 774813843 773326340 773093185 774469833 775005035 774707565 774738235 774836273 773704300
2059.9 773704300 772398148 772152786 771531677 769757462 769748001 770108871 769164886 770128326 771547928
2068.6 771547928 773260803 773965073 772378235 771490097 770141068 768143158 767333145 767781372 768188324
2077.3 768188324 768625641 768513794 768450699 769928207 769983826 769495163 768339233 766933289 768031311
2086 768031311 769442978 769373550 767459259 766831055 767046204 766179428 765348511 764501724 766230850 767805557
2095.6 767805557 766845398 767464752 768708649 767891846 767290497 767388000 768123016 770252762 770687866
$$ packed form
2033.9G74947510N20859J412124J206436m95910j249619q5907J060639k95945j838684
2042.6G75181503l24554J417847j0758r83505J535110J038361k083130j646805M74396
2051.2G74598465K15378j487503k33155J376648N35202k97470L0670R8038j131973
2059.9G73704300j306152k45362o21109j774215r461L60870r43985R63440J419602
2068.6G71547928J712875P04270j586838q88138j349029j997910q10013M48227M06952
2077.3G68188324M37317j11847o3095J477508N5619m88663j155930j405944J098022
2086G68031311J411667o9428j914291o28204K15149q66776q30917q46787J729126J574707
2095.6G67805557r60159O19354J243897q16803o01349R7503P35016K129746M35104
$$ plain form
2104.3 770687866 770347061 769888153 769090881 768160248 766565933 767107697 767601242 768457947 768923264
2113 768923264 767991943 769398804 769975433 771150436 771852036 770159378 770413589 770364304 770128174 770258179
2122.6 770258179 769440689 769037247 768945694 769196854 769951324 770402374 768989639 766660995 767139664
2131.3 767139664 768677521 767955093 768307495 769597702 769888077 770779037 770347366 768910446 769524994
2140 769524994 771473236 771528320 770608368 771877975 772544632 771213684 770832748 772950821 775907669
2148.6 775907669 775595627 772042313 769884720 769957962 770041733 770008698 769887772 769995804 770789337 771410294
2158.3 771410294 771355667 772124634 773471527 773540192 773635864 773837433 773110352 772067032 772268982 773170471
2167.9 773170471 773455582 773439560 771700745 771475677 772642517 771385269 771386490 772958984 772810211
$$ packed form
2104.3G70687866l40805m58908p97272r30633j594315N41764M93545Q56705M65317
2113G68923264r31321J406861N76629J175003P01600j692658K54211m9285k36130J30005
2122.6G70258179q17490m03442r1553K51160P54470M51050j412735k328644M78669
2131.3G67139664J537857p22428L52402J290207K90375Q90960m31671j436920O14548
2140G69524994J948242N5084r19952J269607O66657j330948l80936K118073K956848
2148.6G75907669l12042l553314k157593P3242Q3771l3035j20926J08032P93533O20957
2158.3G71410294n4627P68967J346893O8665R5672K01569p27081j043320K01950R01489
2167.9G73170471K85111j6022j738815k25068J166840j257248J221J572494j48773
$$ plain form
2176.6 772810211 770319366 769595108 771448746 771336060 770244980 770309677 771361694 770817337 768870010
2185.3 768870010 768899155 769737701 770157852 770792999 771091995 771075134 772258148 774577866 775824280
2194 775824280 773935928 772722244 774185333 774050446 773841858 773635025 773621216 774133911 772471008
2202.6 772471008 772913895 774406204 774030075 774618988 775336609 774825134 774511948 775160217 774886932
2211.3 774886932 775233994 776901245 776911087 775994110 775835114 776058426 775285110 775133438 776566696 777741623
2221 777741623 778443832 776701889 773922653 774307938 775223846 774378510 773248367 773545151 776310120
2229.7 776310120 778632736 777532806 773481598 771070633 772556992 774352951 775965271 776458206
2237.4 776458206 775265427 775035019 776248398 776367111 774113846 774684830 776589737 775624771 774591293
$$ packed form
2176.6G72810211k490845p24258J853638j12686j091080O4697J052017n44357j947327
2185.3G68870010K9145Q38546M20151O35147K98996j6861J183014K319718J246414
2194G75824280j888352j213684J463089j34887k08588k06833j3809N12695j662903
2202.6G72471008M42887J492309l76129N88913P17621n11475l13186O48269k73285
2211.3G74886932L47062J667251R842r16977j58996K23312p73316j51672J433258J174927
2221G77741623P02209j741943k779236L85285R15908q45336j130143K96784K764969
2229.7G76310120K322616j099930m051208k410965J486359J795959J612320M92935
2237.4G76458206j192779k30408J213379J18713k253265N70984J904907r64966j033478
$$ plain form
2246 774591293 772051849 770973816 774104614 775964203 776243973 774903641 773832550 776408081 777437744
2254.7 777437744 776355057 775615234 774860153 775258408 775007858 775183182 776150513 775857925 774595337
2263.4 774595337 772946396 773915787 776180878 777062759 776972580 775885468 774778671 775812836 778201904
2272.1 778201904 777430649 775039597 774068375 774684219 775656204 775205460 774577560 774816284 776720505
2280.8 776720505 776749954 775456161 775765915 774862671 774766769 775612946 775345688 774839554 775595245 775449829
2290.4 775449829 773821564 773999481 772508392 771934891 774626465 776476364 776243362 774572754 775447006
2299.1 775447006 776574173 775216675 773065643 773408203 775686264 774349442 773822174 775650482 775618973
2307.8 775618973 773370438 772758331 775149612 773934555 772583771 773954391 774219208 774518890 772821503
$$ packed form
2246G74591293k539444j078033L130798J859589K79770j340332j071091K575531J029663
2254.7G77437744j082687p39823p55081L98255k50550J75324R67331k92588j262588
2263.4G74595337j648941R69391K265091Q81881r0179j087112j106797J034165K389068
2272.1G78201904p71255k391052r71222O15844R71985m50744o27900K38724J904221
2280.8G76720505K9449j293793L09754r03244r5902Q46177k67258n06134P55691j45416
2290.4G75449829j628265J77917j491089n73501K691574J849899k33002j670608Q74252
2299.1G75447006J127167j357498k151032L42560K278061j336822n27268J828308l1509
2307.8G75618973k248535o12107K391281j215057j350784J370620K64817K99682j697387
$$ plain form
2316.4 772821503 770007553 770342178 771688919 771510162 772224045 771232452 768692856 770741196 772551498
2325.1 772551498 772436218 773398209 773141785 772495499 769955750 768203888 769277267 768371887 768147202
2333.8 768147202 767646713 768878784 770248108 767542267 769596405 771665573 771699524 771429901 769696884
2342.5 769696884 768864441 765495224 763676682 765523605 771682053 775443115 775173569 776667709 776444244
2351.2 776444244 775359802 771690063 769322739 771976166 769781570 772452774 773181534 765279541
2358.9 765279541 760547562 761968079 766521759 769132156 769275589 767834244 770729370 771733551
2366.6 771733551 769231262 768422089 767815247 768730392 771298828 774680176 774531479 774442673 776350327
2375.3 776350327 777381287 777025604 775145950 776847305 778728561 777933884 777188721 776568451 777996368
$$ packed form
2316.4G72821503k813950L34625J346741j78757P13883r91593k539596K048340J810302
2325.1G72551498j15280R61991k56424o46286k539749j751862J073379r05380k24685
2333.8G68147202n00489J232071J369324k705841K054138K069168L3951k69623j733017
2342.5G69696884q32443l369217j818542J846923O158448L761062k69546J494140k23465
2351.2G76444244j084442l669739k367324K653427k194596K671204P28760p901993
2358.9G65279541m731979J420517M553680K610397J43433j441345K895126J004181
2366.6G71733551k502289q09173o06842R15145K568436L381348j48697q8806J907654
2375.3G76350327J030960l55683j879654J701355J881256p94677p45163o20270J427917
$$ plain form
2383.9 777996368 778694077 778405151 780245438 780078659 777922211 778729324 779580765 779123459 779852829
2392.6 779852829 779287872 778520813 778988571 778062134 776310349 777003555 778862000 778057480 777656021
2401.3 777656021 778292084 778179474 779046783 778955154 777362976 776877365 777333374 777718048 778911514
2410 778911514 780531082 780729675 779669037 778693085 778394165 777439575 775980072 776985779 779391708
2418.7 779391708 779626083 779262009 779570465 779511948 779089890 777560654 776845322 777901535 777716904
2427.3 777716904 776300354 776813965 778302460 777090683 775616226 776514893 776590118 775132980 775441360
2436 775441360 776482086 776127930 776200943 776808777 776540985 775811234 775884857 775581741 775911560 777792053
2445.7 777792053 777891922 776846161 775314331 773977356 773665390 774370117 775482254 774415207 773928604
$$ packed form
2383.9G77996368O97709k88926J840287j66779k156448Q07113Q51441m57306P29370
2392.6G79852829n64957p67059M67758r26437j751785O93206J858445q04520m01459
2401.3G77656021O36063j12610Q67309r1629j592178m85611M56009L84674J193466
2410G78911514J619568J98593j060638r75952k98920r54590j459503J005707K405929
2418.7G79391708K34375l64074L08456n8517m22058j529236p15332J056213j84631
2427.3G77716904j416550N13611J488495j211777j474457Q98667P5225j457138L08380
2436G75441360J040726l54156P3013O07834k67792p29751P3623l03116L29819J880493
2445.7G77792053R9869j045761j531830j336975l11966P04727J112137j067047m86603
$$ plain form
2454.3 773928604 775026627 776762848 777343445 776083374 776440659 775579376 773749084 772791977 772872086
2463 772872086 774174881 773671875 773486404 773868027 773395157 772839127 772694855 773153687 772653275 772301636
2472.7 772301636 772077408 772112808 772766113 771987457 771583023 772940979 772738800 770674057 770578079 770848541
2482.3 770848541 770079956 770922699 772162094 772135773 771234818 770801544 770636749 770450058 771741867
2491 771741867 772000504 770643387 770469437 769595184 768511200 769773483 771022491 771260452 771155777
2499.7 771155777 770770798 771173630 771532974 770781860 770231400 770204010 770132446 770398788 770667725 769506531
2509.3 769506531 767557144 767564240 768182983 768982773 770231552 768763809 767706985 767719650 766992493
2518 766992493 767066879 766653366 767360840 768190155 767326126 766303558 765858078 766842194 767140656 766765976
$$ packed form
2454.3G73928604J098023J736221N80597j260071L57285q61283j830292r57107Q0109
2463G72872086J302795n03006j85471L81623m72870n56030j44272M58832n00412l51639
2472.7G72301636k24228L5400O53305p78656m04434J357956k02179k064743r5978K70462
2482.3G70848541p68585Q42743J239395k6321r00955m33274j64795j86691J291809
2491G71741867K58637j357117j73950q74253j083984J262283J249008K37961j04675
2499.7G71155777l84979M02832L59344p51114n50460k7390p1564K66342K68937j161194
2509.3G69506531j949387P096O18743P99790J248779j467743j056824J2665p27157
2518G66992493P4386m13513P07474Q29315q64029j022568m45480R84116K98462l74680
$$ plain form
2527.6 766765976 767096176 767191925 766421280 766180496 766632233 766085892 765775223 766260605 767699661 767271652
2537.3 767271652 764252167 763107376 764184036 766161957 766746445 766428375 766589127 766783218 766612473
2546 766612473 766015167 766446533 765546188 764846497 766162033 766603699 766260529 765132751 763453598
2554.6 763453598 761997375 762685318 764040298 764464417 765063934 764492950 764366531 764011536 763278732
2563.3 763278732 763815002 763498611 762825165 762370911 762926865 764276505 764401474 764013138 762874374
2572 762874374 761773224 762158966 762748795 763246307 763255997 762882996 762320251 761982727 763183670 762205200
2581.6 762205200 760217667 761322784 762020493 761174774 760882034 761932449 762074051 761528091 762103806
2590.3 762103806 762504883 762452850 760828857 760129013 761333694 761232986 759550095 758177795 759407959
$$ packed form
2527.6G66765976L30200R5749p70645k40784M51737n46341l10669M85382J439056m28009
2537.3G67271652l019485j144791J076660J977921N84488l18070J60752J94091j70745
2546G66612473n97306M31366r00345o99691J315536M41666l43170j127778j679153
2554.6G63453598j456223O87943J354980M24119N99517n70984j26419l54995p32804
2563.3G63278732N36270l16391o73446m54254N55954J349640J24969l88336j138764
2572G62874374j101150L85742N89829M97512R690l73001n62745l37524J200943r78470
2581.6G62205200j987533J105117O97709q45719k92740J050415J41602n45960N75715
2590.3G62103806M01077n2033j623993o99844J204681j00708j682891j372300J230164
$$ plain form
2599 759407959 761247711 761925659 760940018 759687500 759962387 760502014 761183929 760713654 759820480 758569183
2608.6 758569183 757233505 757915573 758944626 759810104 759533997 757515945 756245346 757438812 759031830
2617.3 759031830 759526291 759395370 757157974 754572144 754794388 756668854 756205368 755142517 755860138
2626 755860138 756401901 757510910 756875381 755064697 754477997 754056625 754724121 755420914 754501648 752744827
2635.6 752744827 753617401 755299149 754475250 754456940 755781097 756540527 756041031 754708405 753375168
2644.3 753375168 752603455 751362152 751290283 753621979 753148422 751502609 751822281 752119446 752299500
2653 752299500 751692810 749693451 748075943 749369125 750940399 749650803 748508835 749075317 749809036
2661.7 749809036 751068573 750356522 747728577 747968979 747712250 747287140 748576279 748774185 748923035
$$ packed form
2599G59407959J839752O77948r85641j252518K74887N39627O81915m70275q93174j251297
2608.6G58569183j335678O82068J029053Q65478k76107k018052j270599J193466J593018
2617.3G59031830M94461j30921k237396k585830K22244J874466m63486j062851P17621
2626G55860138N41763J109009o35529j810684n86700m21372O67496O96793r19266j756821
2635.6G52744827Q72574J681748q23899j8310J324157P59430m99496j332626j333237
2644.3G53375168p71713j241303p1869K331696m73557j645813L19672K97165J80054
2653G52299500o06690j999359j617508J293182J571274j289596j141968N66482P33719
2661.7G49809036J259537p12051k627945K40402k56729m25110J289139J97906J48850
$$ plain form
2670.4 748923035 748128052 748428574 748844299 747348175 747609863 748343964 747981796 747350998 747741013
2679 747741013 748449860 748408737 747145844 745710602 745150452 742907867 743214264 746615295 747981262
2687.7 747981262 747565613 745625534 744650650 745057907 745732269 746826172 746509705 745622787 745102081
2696.4 745102081 744424286 744270630 744484177 744757996 745043259 744262772 742981491 742273941 741349716
2705.1 741349716 740806580 742072754 742218781 740618134 740858154 741167831 741395721 742186508 742124252
2713.8 742124252 741260681 739950333 740883560 740800629 739676208 740560760 740082016 739538727 739618454 740286407
2723.4 740286407 740835037 740699692 740740585 739436417 739541016 739234619 737290802 737492371 737934113
2732.1 737934113 738038177 737470322 735782471 735783539 736710052 736376114 736059952 736466293 736879501 736381302
$$ packed form
2670.4G48923035p94983L00522M15725j496124K61688P34101l62168o30798L90015
2679G47741013P08847m1123j262893j435242n60150k242585L06397L401031J365967
2687.7G47981262m15649j940079r74884M07257O74362J093903l16467q86918n20706
2696.4G45102081o77795j53656K13547K73819K85263p80487j281281p07550r24225
2705.1G41349716n43136J266174J46027j600647K40020L09677K27890P90787o2256
2713.8G42124252q63571j310348R33227q2931j124421Q84552m78744n43289P9727O67953
2723.4G40286407N48630j35345M0893j304168J04599l06397j943817K01569M41742
2732.1G37934113J04064n67855j687851J068R26513l33938l16162M06341M13208m98199
$$ plain form
2741.7 736381302 735421448 735055466 734725037 735121460 735438080 734840546 734114532 733362350 732250671
2750.4 732250671 731083145 732052994 733222504 733513184 733149261 731300049 730291138 729952698 731361618
2759.1 731361618 733685303 733710327 732620087 731423721 731172943 731568222 731414642 730999374 730566177
2767.8 730566177 729433365 729208374 730026245 728659439 727723770 728022461 727417984 727119598 727800980
2776.4 727800980 728726730 727884827 727073288 727674789 727655487 725914841 723385468 723991852 724542542
2785.1 724542542 722183838 722596283 723641968 722912903 723232956 723013000 722654495 722956543 722610550
2793.8 722610550 721881409 722136459 722690277 721724548 720826035 719528275 718928375 720026245 720530624
2802.5 720530624 720856552 719451294 717714615 717086792 716160507 716026154 716341400 715363541 713556290
$$ packed form
2741.7G36381302r59854l65982l30429L96423L16620n97534p26014p52182j111679
2750.4G32250671j167526R69849J169510K90680l63923j849212j008911l38440J408920
2759.1G31361618K323685K5024j090240j196366k50778L95279j53580m15268m33197
2767.8G30566177j132812k24991Q17871j366806r35669K98691o04477k98386O81382
2776.4G27800980R25750q41903q11539O01501j9302j740646k529373O06384N50690
2785.1G24542542k358704M12445J045685p29065L20053k19956l58505L02048l45993
2793.8G22610550p29141K55050N53818r65729q98513j297760n99900J097870N04379
2802.5G20530624L25928j405258j736679o27823r26285j34353L15246r77859j807251
$$ plain form
2811.2 713556290 714075394 714001312 712837601 712563629 711118698 712434921 714875336 714508286 713364792
2819.8 713364792 713101044 713286514 711969223 710236053 708780365 708760529 708616638 706987686 706613693
2828.5 706613693 707064362 707051392 706081848 705321503 703537521 702624359 703713837 701903610 700783157
2837.2 700783157 701366882 700229340 698857574 698215866 696920929 694541321 692862854 691279068 690203552
2845.9 690203552 689293365 686929550 683824921 682086716 682425003 681660080 679954758 678515854 678116074
2854.6 678116074 678000259 677982712 680076752 680371399 679345627 679345551 678507462 676979370 676347427 677092209
2864.2 677092209 676681824 675772324 675399857 675078583 674036255 672455826 673883743 675060806 672773361
2872.9 672773361 670803223 670012665 669143677 669079437 669622726 669247437 668717117 668561325 668737030 668654938
$$ packed form
2811.2G13556290N19104p4082j163711k73972j444931J316223K440415l67050j143494
2819.8G13364792k63748J85470j317291j733170j455688j9836j43891j628952l73993
2828.5G06613693M50669j2970r69544p60345j783982r13162J089478j810227j120453
2837.2G00783157N83725j137542j371766o41708j294937k379608j678467j583786j075516
2845.9F90203552r10187k363815l104629j738205L38287p64923j705322j438904l99780
2854.6F78116074j15815j7547K094040K94647j025772p6q38089j528092o31943P44782
2864.2F77092209m10385r09500l72467l21274j042328j580429J427917J177063k287445
2872.9F72773361j970138p90558q68988o4240N43289l75289n30320j55792J75705q2092
$$ plain form
2882.5 668654938 667918625 667118912 666575241 666864777 665601501 663260727 662056427 660990295 661512070
2891.2 661512070 661965179 661528244 661819305 660223083 658540115 658034363 656336975 655557709 657061462
2899.9 657061462 658408890 657621231 656143417 654894409 652689896 650695190 650922394 652045059 651204453
2908.6 651204453 649788437 649470215 649445648 648034439 644988937 643288651 643048859 643631668 642343445
2917.2 642343445 639349213 638838959 637901344 636873283 636250496 635992584 637980499 638147621 637271271
2925.9 637271271 637084808 637327690 637802582 636703033 636252861 636609917 636098213 636650581 638099556
2934.6 638099556 638289223 638978233 640056152 640321198 641975021 643882294 644194031 643641968 643071976
2943.3 643071976 642443771 643065491 645254059 646038971 645009842 644224701 644598999 643740311 642160645
$$ packed form
2882.5F68654938p36313p99713n43671K89536j263276k340774j204300j066132N21775
2891.2F61512070M53109m36935K91061j596222j682968n05752j697388p79266J503753
2899.9F57061462J347428p87659j477814j249008k204513j994706K27204J122665q40606
2908.6F51204453j416016l18222k4567j411209l045502j700286k39792N82809j288223
2917.2F42343445k994232n10254r37615j028061o22787k57912J987915J67122q76350
2925.9F37271271j86463K42882M74892j099549m50172L57056n11704N52368J448975
2934.6F38099556J89667O89010J077919K65046J653823J907273L11737n52063n69992
2943.3F43071976o28205O21720K188568P84912j029129p85141L74298q58688j579666
$$ plain form
2952 642160645 640502930 639074707 641059799 641942062 641019974 640782776 640546036 641155930 640225525
2960.6 640225525 639175262 639158401 640609131 642590942 641571732 641818848 644513474 646644363 646983795
2969.3 646983795 645782700 645988464 647444229 648986282 650574722 651081848 650399857 650767517 652427139
2978 652427139 653710403 654965057 655471191 654244766 655139999 659694748 661235733 658808899 656869202
2986.7 656869202 656225357 657696915 659033585 660201645 661889114 662233047 664019928 664085159 661442032
2995.3 661442032 662459183 663354187 661463013 660799637 662137833 662708664 661472855 662234802 663211594
3004 663211594 661761398 661189804 661866760 662753448 663153687 662626190 662097244 662312622 662568741 662798767
3013.7 662798767 662416458 660699387 660600662 661477051 661126175 659871674 659132385 659754257 659944687
$$ packed form
2952F42160645j657715j428223J985092Q82263r22088k37198k36740O09894r30405
2960.6F40225525j050263j6861J450730J981811j019210K47116K694626K130889L39432
2969.3F46983795j201095K05764J455765J542053J588440N07126o81991L67660J659622
2978F52427139J283264J254654N06134j226425Q95233M554749J540985k426834j939697
2986.7F56869202o43845J471558J336670J168060J687469L43933J786881O5231k643127
2995.3F61442032J017151Q95004j891174o63376J338196N70831j235809P61947R76792
3004F63211594j450196n71594O76956Q86688M00239n27497n28946K15378K56119K30026
3013.7F62798767l82309j717071r8725Q76389l50876j254501p39289O21872J90430
$$ plain form
3022.4 659944687 659574432 657726288 656913376 658309097 657865143 656740417 656599045 657272949 655852432
3031 655852432 653356552 653231812 654493942 656131821 655001373 653466873 653338776 653856812 655711288
3039.7 655711288 656365814 655443878 652848892 651751480 651986389 650646667 650097809 649606247 649874725
3048.4 649874725 650556564 649373322 646997528 646100082 647876358 647525177 645680618 646471558 647115479
3057.1 647115479 644656143 642549973 643087082 642914886 642380676 642878189 641879501 640138397 640516052
3065.7 640516052 641608658 641617508 641294556 641095657 639693680 638085976 638958702 638861313 638055954 638936005
3075.4 638936005 638575172 638436470 637318649 635365372 635590668 634276581 633090591 634378128 634660759
3084.1 634660759 634154091 634340172 634061127 632700157 632228661 632462273 631591911 631401939 631036682
$$ packed form
3022.4F59944687l70255j848144q12912J395721m43954j124726j41372O73904j420517
3031F55852432k495880j24740J262130J637879j130448j534500j28097N18036J854476
3039.7F55711288O54526r21936k594986j097412K34909j339722n48858m91562K68478
3048.4F49874725O81839j183242k375794q97446J776276l51181j844559P90940O43921
3057.1F47115479k459336k106170N37109j72196n34210M97513r98688j741104L77655
3065.7F40516052J092606Q850l22952j98899j401977j607704Q72726r7389q05359Q80051
3075.4F38936005l60833j38702j117821j953277K25296j314087j185990J287537K82631
3084.1F34660759n06668J86081k79045j360970m71496K33612q70362j89972l65257
$$ plain form
3092.7 631036682 629323502 628817253 627876320 627103195 628516197 628877335 627993622 627834625 627721100
3101.4 627721100 626036568 624892235 625125351 624158211 623972282 624608040 623611336 622133408 621207962
3110.1 621207962 621114883 621314049 620930939 620062485 619573021 620101089 620383568 619611092 618077011 616472054
3119.8 616472054 616217728 615149879 613249092 614170685 614518471 612991943 612588463 612463493 612015610
3128.4 612015610 610664825 609538269 609787598 608480797 607173042 608333778 607730064 605515404 605194359
3137.1 605194359 605104980 603796730 602477989 601803703 600615807 598661499 598196144 599560814 599729156
3145.8 599729156 599525223 599843941 597067757 594942932 594943657 594765091 595459023 593553619 591518135
3154.5 591518135 590684776 589427376 590004044 588616753 585818672 586286507 588862076 589170723 587500992
$$ packed form
3092.7F31036682j713180n06249r40933p73125J413002L61138q83713j58997j13525
3101.4F27721100j684532j144333K33116r67140j85929O35758r96704j477928r25446
3110.1F21207962r3079J99166l83110q68454m89464N28068K82479p72476j534081j604957
3119.8F16472054k54326j067849j900787R21593L47786j526528m03480j24970m47883
3128.4F12015610j350785j126556K49329j306801j307755J160736o03714k214660l21045
3137.1F05194359q9379j308250j318741o74286j187896j954308m65355J364670J68342
3145.8E99729156k03933L18718k776184k124825P25j78566O93932j905404k035484
3154.5E91518135q33359j257400N76668j387291k798081M67835K575569L08647j669731
$$ plain form
3163.1 587500992 586273499 584447441 583901520 583248138 581117592 579336967 578027992 579060631 580375595
3171.8 580375595 578862762 576002655 574816437 574802208 573473206 572854614 572967453 571786804 570734291
3180.5 570734291 570334740 570409775 570592499 570212631 569525337 567663155 566090584 566244354 566402245
3189.2 566402245 565799255 563834076 562274895 561590996 560782166 559511299 557935371 558595085 557800865
3197.9 557800865 555576897 555530205 554791870 553729362 553751640 554931831 554204750 551314735 549637222
3206.5 549637222 548216705 548212395 549699936 549842644 547455711 545358467 545459747 544391556 542296486
3215.2 542296486 542050591 543174095 542725143 540001640 537741852 537565269 537741203 537297859 536826439
3223.9 536826439 535577278 534798737 535122261 535349159 534555550 533234978 532251625 531551361 531696434
$$ packed form
3163.1E87500992j227493j826058n45921o53382k130546j780625j308975J032639J314964
3171.8E80375595j512833k860107j186218j4229j329002o18592J12839j180649j052513
3180.5E70734291l99551P5035J82724l79868o87294j862182j572571J53770J57891
3189.2E66402245o02990j965179j559181o83899q08830j270867j575928O59714p94220
3197.9E57800865k223968m6692p38335j062508K2278J180191p27081k890015j677513
3206.5E49637222j420517m310J487541J42708k386933k097244J01280j068191k095070
3215.2E42296486k45895J123504m48952k723503k259788j76583J75934m43344m71420
3223.9E36826439j249161p78541L23524K26898p93609j320572r83353p00264J45073
$$ plain form
3232.6 531696434 529893913 528490028 529756203 529858360 529319115 527587204 525942841 526062241 526181030
3241.3 526181030 524828758 522293587 520687904 519222260 519173470 519849014 519779701 520254860 520119133
3249.9 520119133 518624458 516015396 515284615 515440025 514324570 512890587 511471786 513065834 513905106
3258.6 513905106 511276321 510150909 510895119 511180687 510513229 509841270 509980507 510487213 509357681
3267.3 509357681 506826973 505227089 505090370 505912361 505508804 503871307 503545227 503911247 503002586
3276 503002586 502264977 502358589 500651436 498792114 499268494 499394836 498577080 497920380 497859192 499333878
3285.6 499333878 498684044 496777840 497414513 496618690 494946251 493880615 492698135 493498840 495010643
3294.3 495010643 494887085 492608299 491400185 491948242 491137314 490074921 490090752 489965057 488715172
$$ packed form
3232.6E31696434j802521j403885J266175J02157n39245j731911j644363J19400J18789
3241.3E26181030j352272k535171j605683j465644m8790O75544o9313M75159j35727
3249.9E20119133j494675k609062p30781J55410j115455j433983j418801J594048Q39272
3258.6E13905106k628785j125412P44210K85568o67458o71959J39237N06706j129532
3267.3E09357681k530708j599884j36719Q21991m03557j637497l26080L66020r08661
3276E03002586p37609R3612j707153j859322M76380J26342q17756o56700o1188J474686
3285.6D99333878o49834j906204O36673p95823j672439j065636j182480Q00705J511803
3294.3D95010643j23558k278786j208114N48057q10928j062393J5831j25695j249885
$$ plain form
3303 488715172 487758865 487490387 487370567 487860565 488185768 486554413 484040947 484191818 484463310 483306236
3312.6 483306236 482868958 481952362 480449867 479627686 479347649 477707634 476658669 477486153 477450905
3321.3 477450905 476661301 474176178 471989937 471819153 471176720 470926056 470371361 468705330 468112831
3330 468112831 468350182 467094612 466034584 467153854 467091675 466444321 466472206 464084587 461350250
3338.7 461350250 460153084 459012566 458516121 458566360 457095261 454649467 454383659 454523430 453436775
3347.3 453436775 453915100 453906288 451875381 451507912 452505379 450586548 448790703 449075432 446870193
3356 446870193 445971794 445331879 442720795 442647285 440946770 438936501 439592934 439184036 437560272
3364.7 437560272 436639481 437310600 435507812 433077431 433068161 431649704 430062256 430857582 431992226
$$ packed form
3303D88715172r56307k68478j19820M89998L25203j631355k513466J50871K71492j157074
3312.6D83306236m37278r16596j502495q22181k80037j640015j048965Q27484l5248
3321.3D77450905p89604k485123k186241j70784o42433k50664n54695j666031n92499
3330D68112831K37351j255570j060028J119270o2179o47354K7885k387619k734337
3338.7D61350250j197166j140518m96445N0239j471099k445794k65808J39771j086655
3347.3D53436775M78325q812k030907l67469R97467j918831j795845K84729k205239
3356D46870193q98399o39915k611084p3510j700515k010269O56433m08898j623764
3364.7D37560272r20791O71119j802788k430381r270j418457j587448P95326J134644
$$ plain form
3373.4 431992226 430568886 428467827 427107201 426133041 427206726 427777863 425105591 421351738 420992012
3382.1 420992012 423323860 423677635 422248611 421487656 420664673 418255501 417425041 417983780 417885208
3390.7 417885208 418453293 417309265 416018906 416816902 416867943 415500069 414890785 415464859 413874092
3399.4 413874092 412592049 413533096 414265060 414791183 412840576 410025826 409693031 410915947 412140579
3408.1 412140579 411669350 409962425 407924881 407532501 409513893 410750694 409981842 408815117 408162613
3416.8 408162613 407228775 407790031 409451103 407496872 404204636 405256538 407184448 405919647 405108376
3425.5 405108376 404112968 403378983 406154442 407284851 405833054 404904900 405447235 406277008 406043892
3434.1 406043892 405892982 404820900 405191422 407058830 407481117 407536316 408226013 409561119 408580971
$$ packed form
3373.4D31992226j423340k101059j360626r74160J073685N71137k672272l753853l59726
3382.1D20992012K331848L53775j429024p60955q22983k409172q30460N58739r8572
3390.7D17885208N68085j144028j290359P97996N1041j367874o09284N74074j590767
3399.4D13874092j282043R41047P31964N26123j950607k814750l32795J222916J224632
3408.1D12140579m71229j706925k037544l92380J981392J236801p68852j166725o52504
3416.8D08162613r33838N61256J661072j954231l292236J051902J927910j264801q11271
3425.5D05108376r95408p33985K775459J130409j451797r28154N42335Q29773k33116
3434.1D06043892j50910j072082L70522J867408M22287N5199O89697J335106r80148
$$ plain form
3442.8 408580971 407579613 408744469 409765930 409037170 406440773 408742142 411857109 411661873 412504539
3451.5 412504539 412254753 411027718 412150421 414062386 413625641 413230057 414648972 415358734 416513176
3460.2 416513176 417386856 416355705 414455719 414983521 417246132 417650261 418670540 419932480 420671654
3468.8 420671654 420377884 418860054 419646721 421370926 424541092 426431656 423901558 423297729 424542809
3477.5 424542809 425656624 427821732 429078522 427645836 426993256 429854088 431736946 432042770 432950630
3486.2 432950630 433298950 432743454 432975349 433993416 434807434 436950722 439259109 439096870 437829208
3494.9 437829208 438963203 442200279 442197533 440879631 441427345 443194237 445874443 446749535 446619797
3503.6 446619797 446104584 446673584 449761963 451845436 454084969 454581413 452827492 453206749 452894173
$$ packed form
3442.8D08580971j001358J164856J021461p28760k596397K301369L114967j95236Q42666
3451.5D12504539k49786j227035J122703J911965m36745l95584J418915P09762J154442
3460.2D16513176Q73680j031151j899986N27802K262611M04129J020279J261940P39174
3468.8D20671654k93770j517830P86667J724205L170166J890564k530098o03829J245080
3477.5D24542809J113815K165108J256790j432686o52580K860832J882858L05824R07860
3486.2D32950630L48320n55496K31895J018067Q14018K143288K308387j62239j267662
3494.9D37829208J133995L237076k746j317902N47714J766892K680206Q75092j29738
3503.6D46619797n15213N69000L088379K083473K239533M96444j753921L79257l12576
$$ plain form
3512.2 452894173 452338562 453116074 454909973 456526985 457226715 458254471 458685608 458534775 458422508
3520.9 458422508 459786568 462227631 463511124 464693680 465688553 466714973 467413712 469025230 471687927
3529.6 471687927 471262360 470723381 473805161 476369095 475965767 476128769 476609383 476217041 478290215
3538.3 478290215 479905396 478408699 478546638 481727333 484476814 485731163 485577011 485728912 487237282
3547 487237282 487478142 487869644 490171432 494211540 495836258 494357262 496750259 499122086 500148811
3555.6 500148811 502116051 503847313 505779953 506737900 506442528 505923767 508103523 510844917 512479553
3564.3 512479553 516582527 516735916 515771332 519118233 519472160 520179939 520969658 522248116 523002243
3573 523002243 524194107 526164474 526605759 528792114 532835541 536290741 535907898 535126266 538145180
$$ packed form
3512.2D52894173n55611P77512J793899J617012O99730J027756M31137j50833j12267
3520.9D58422508J364060K441063J283493J182556R94873J026420O98739J611518K662697
3529.6D71687927m25567n38979L081780K563934m03328J63002M80614l92342K073174
3538.3D78290215J615181j496697J37939L180695K749481J254349j54152J51901J508370
3547D87237282K40860L91502K301788M040108J624718j478996K392997K371827J026725
3555.6E00148811J967240J731262J932640R57947k95372n18761K179756K741394J634636
3564.3E12479553M102974J53389r64584L346901L53927P07779P89719J278458P54127
3573E23002243J191864J970367M41285K186355M043427L455200l82843p81632L018914
$$ plain form
3581.7 538145180 541017647 542523613 542719116 546362877 547436829 542497826 545627556 549054718
3589.4 549054718 552403603 555360870 557359428 558756561 559297676 563324089 562904015 563862419 567431641
3598.1 567431641 567595367 571107254 573144379 572491264 574546547 578621902 581777534 585443649 589476433
3606.8 589476433 586927795 590345421 591461372 587077408 593135414 597372742 598056679 602222977
3614.5 602222977 601847191 604072456 608911819 612307472 614441299 611963997 611697159 615656548 617694778
3623.1 617694778 618145943 620758362 624041557 627369461 635488167 641266785 629615402 628941345
3630.9 628941345 633134422 639110718 641069336 639764824 643724060 647724380 650940857 651794128
3638.6 651794128 650722122 651766891 655085983 657831802 659146500 661182556 663563995 670820312
$$ packed form
3581.7E38145180K872467J505966J95503L643761J073952m939003L129730L427162
3589.4E49054718L348885K957267J998558J397133N41115M026413m20074R58404L569222
3598.1E67431641J63726L511887K037125o53115K055283M075355L155632L666115M032784
3606.8E89476433k548638L417626J115951m383964O058006M237328O83937M166298
3614.5F02222977l75786K225265M839363L395653K133827k477302k66838L959389K038230
3623.1F17694778M51165K612419L283195L327904Q118706N778618j1651383o74057
3630.9F28941345M193077N976296J958618j304512L959236M000320L216477Q53271
3638.6F51794128j072006J044769L319092K745819J314698K036056K381439P256317
$$ plain form
3646.3 670820312 673552399 667827911 674160004 674868240 671430740 670032578 673543854 678284302
3654 678284302 681666565 686949158 680452728 679989929 685521851 688065796 690530472 689537659 690050659
3662.7 690050659 691685944 692432404 693436813 693674622 696262283 697086945 699832458 703751526 695433197
3671.4 695433197 695048065 701741562 710776062 716889496 705010376 698761444 703536072 711171036
3679.1 711171036 707935867 704098740 706208572 708512268 710227051 710964432 712568893 716398697
3686.8 716398697 723904343 717251129 710616226 721636963 715649185 710154800 715251312 715799408
3694.5 715799408 716709900 716871262 716246490 716733170 717132492 718959961 723307419 724687271 720578308
3703.2 720578308 721698380 722260818 722661285 724814529 727443161 728732758 719043961 724374313 732059860
$$ packed form
3646.3F70820312K732087n724488O332093P08236l437500j398162L511276M740448
3654F78284302L382263N282593o496430m62799N531922K543945K464676r92813N13000
3662.7F90050659J635285P46460J004409K37809K587661Q24662K745513L919068q318329
3671.4F95433197l85132O693497R034500O113434j1879120o248932M774628P634964
3679.1G11171036l235169l837127K109832K303696J714783P37381J604461L829804
3686.8G16398697P505646o653214o634903J1020737n987778n494385N096512N48096
3694.5G15799408R10492J61362o24772M86680L99322J827469M347458J379852m108963
3703.2G20578308J120072N62438M00467K153244K628632J289597r688797N330352P685547
$$ plain form
3711.9 732059860 720863190 723497314 726206512 727413559 729094772 730870361 733828430 729209976
3719.6 729209976 725038147 730739670 732798080 728650970 732525177 731458511 728081131 726321411
3727.3 726321411 726623535 731332016 733374252 740966797 740917587 728042908 737441330 747713165
3735 747713165 738840485 730632935 730242844 730057602 730481415 733237152 731868896 737653885 754497147
3743.7 754497147 752679749 724596405 728877869 735141449 746413269 745036621 728452377 741120224
3751.4 741120224 739210358 729712143 734279251 735768509 738853302 735366058 736636353 743350143
3759.1 743350143 735262299 729836349 734326859 736520157 736202774 741982117 742343597 734562073 735014420
3767.8 735014420 739931335 742130280 732157898 732384338 737229996 739002609 740498047 738897400
$$ packed form
3711.9G32059860j1196670K634124K709198J207047J681213J775589K958069m618454
3719.6G29209976m171829N701523K058410m147110L874207j066666l377380j759720
3727.3G26321411L02124M708481K042236P592545m9210j2874679R398422J0271835
3735G47713165q872680q207550l90091j85242M23813K755737j368256N784989J6843262
3743.7G54497147j817398k8083344M281464O263580J1271820j376648j6584244J2667847
3751.4G41120224j909866r498215M567108J489258L084793l487244J270295O713790
3759.1G43350143q087844n425950M490510K193298l17383N779343L61480p781524M52347
3767.8G35014420M916915K198945r972382K26440M845658J772613J495438j600647
$$ plain form
3775.5 738897400 738453064 741214981 747235565 746025543 733544617 735560074 738220444 737780304
3783.2 737780304 740046768 738525925 738086853 741200409 741958008 740264206 738903122 738238144 737267380
3791.9 737267380 737715454 739337845 741622849 743446121 739683685 736609955 739124603 744216156
3799.6 744216156 751597595 748392410 734483185 734770432 736526031 740154114 747395782 741665649
3807.3 741665649 735101547 738451767 740287704 741905899 743161011 741096573 739347534 745344620
3815.1 745344620 750906296 733680878 733666916 740551605 745868607 752999878 738179626 731434402
3822.8 731434402 735764999 737529068 739933243 743026505 740809174 738270950 738372040 743489075
3830.5 743489075 747190857 736861572 736501312 742015533 736571808 736953812 747070770 743221130
$$ packed form
3775.5G38897400m44336K761917O020584j210022j2480926K015457K660370m40140
3783.2G37780304K266464j520843m39072L113556P57599j693802j361084o64978r70764
3791.9G37267380M48074J622391K285004J823272l762436l073730K514648N091553
3799.6G44216156P381439l205185j3909225K87247J755599L628083P241668n730133
3807.3G41665649o564102L350220J835937J618195J255112k064438j749039N997086
3815.1G45344620N561676j7225418j3962O884689N317002P131271j4820252o745224
3822.8G31434402M330597J764069K404175L093262k217331k538224J01090N117035
3830.5G43489075L701782j0329285l60260N514221n443725L82004J0116958l849640
$$ plain form
3838.2 743221130 738848419 747592773 740588074 735862122 742500534 740760117 736291428 738751831
3845.9 738751831 740468903 739316101 740745239 740382462 740826950 749942627 752683487 754712830 735880203
3854.6 735880203 728902359 740088501 741893158 737300797 736606522 740172577 746359406 741145630
3862.3 741145630 738385468 743978958 739090576 734467850 738766708 742160873 746616211 741603851
3870 741603851 731631012 735012741 741356125 747472916 738955460 735460052 739869461 738355942 739011230
3878.7 739011230 746863098 744093475 733266907 737435532 740296402 741883392 746078262 734786530
3886.4 734786530 735926361 740563889 740274582 743577042 743750534 736554947 735978088 739513550 739550934
3895.1 739550934 739714966 739164505 740583267 745056458 738971558 743397293 742409821 733365097 740497665
$$ packed form
3838.2G43221130m372711Q744354p004699m725952O638412j740417m468689K460403
3845.9G38751831J717072j152802J429138l62777M44488R115677K740860K029343j8832627
3854.6G35880203o977844J1186142J804657m592361o94275L566055O186829n213776
3862.3G41145630k760162N593490m888382m622726M298858L394165M455338n012360
3870G41603851r972839L381729O343384O116791q517456l495408M409409j513519O55288
3878.7G39011230P851868k769623j0826568M168625K860870J586990M194870j1291732
3886.4G34786530J139831M637528k89307L302460J73492p195587n76859L535462L7384
3895.1G39550934J64032n50461J418762M473191o084900M425735r87472r044724P132568
$$ plain form
3903.8 740497665 740948486 739775925 737760925 736438522 739325943 739029617 739609528 740383987 741909714
3912.5 741909714 741872406 740803757 741909103 740689697 736586761 734435043 738543167 737125702 733693161
3921.1 733693161 739451447 742833633 744608307 741168289 734501953 736726456 739920578 740640793
3928.8 740640793 738864670 738194046 740955811 739150772 736741028 740362167 742440491 740750275
3936.6 740750275 740027084 740753021 740905991 739136353 741091537 744089432 738578720 735968399 736811981
3945.2 736811981 736940002 738815689 739890823 739634628 736248016 735220490 740066833 740925217 738028946
3953.9 738028946 737519226 738733444 739406967 739130859 738839111 738444290 739842758 740315475 738395691
3962.6 738395691 740656662 743439255 741463852 737610474 735373077 736898880 737580032 737142944 739202652
$$ packed form
3903.8G40497665M50821j172561k015000j322403K887421k96326N79911P74459J525727
3912.5G41909714l7308j068649J105346j219406m102936k151718M108124j417465l432541
3921.1G33693161N758286L382186J774674l440018o666336K224503L194122P20215
3928.8G40640793j776123o70624K761765j805039k409744L621139K078324j690216
3936.6G40750275p23191P25937J52970j769638J955184K997895n510712k610321Q43582
3945.2G36811981J28021J875687J075134k56195l386612j027526M846343Q58384k896271
3953.9G38028946n09720J214218O73523k76108k91748l94821J398468M72717j919784
3962.6G38395691K260971K782593j975403l853378k237397J525803O81152m37088K059708
$$ plain form
3971.3 739202652 739167023 738097229 738093719 737724991 738176880 738307800 738225937 738307877 738713913 737855911
3980.9 737855911 737004929 739289322 739659882 738797607 738733215 737602310 737508698 737680283 737228165 737588501
3990.6 737588501 739895401 741323013 740546265 740285873 738989105 738451004 740555115 740943909 739456711
3999.2 739456711 739494781
4000.2 739494781
$$ packed form
3971.3G39202652l5629j069794l510l68728M51889J30920q1863Q1940M06036q58002
3980.9G37855911q50982K284393L70560q62275o4392j130905r3612J71585m52118L60336
3990.6G37588501K306900J427612p76748k60392j296768n38101K104111L88794j487198
3999.2G39456711L8070
4000.2G39494781
##END=$$ End of the data block
