##TITLE=$$ Begin of the data block
##JCAMP-DX=5.00 $$ ACD/SpecManager v 10.08
##SPECTROMETER/DATA SYSTEM=Varian
##DATE=07 Jan 2013 10:07:16
##DATA TYPE=INFRARED SPECTRUM
##DATA CLASS=XYDATA
##ORIGIN=
##OWNER=
##NPOINTS=3735
##FIRSTX=399.26403809
##LASTX=4000.35498047
##MAXX=4000.35498047
##MINX=399.26403809
##MAXY=85.13832092
##MINY=14.08802700
##XFACTOR=1.0000000000
##YFACTOR=0.000000100000000
##FIRSTY=68.28343201
##DELTAX=0.96440572
##XUNITS=1/CM
##YUNITS=TRANSMITTANCE
##XYDATA=(X++(Y..Y))
399.3F82834320j73624229k5604248J39755783R0505256K3147583J14368744n7747955
406G93635254r3731995o7134399n9407501K7640457Q141708J1831970K5676270O5407410
413.7G12059174J1192627j68542595q1927605P2162552L0932922J5173073N5046959
420.5F46097107p0879517m3438453M8274917M0553284M1652183P6967927r676819r1458626
428.2F38092003k267456M3589897J5901794n6444511j23313904o1137199l536072J9235535
435.9D70120087O4591674N6458664r030876l2038727K3813668M5462913J9768715K6473389
443.6F65619507J6513901n667801L5087814l0230560j05839768L0396576M2768860
450.4F48648529p8544350J670266n832482l1742935J1845322j710205Q8179626M0127373
$$ y = [682834320, 509210091, 483605843, 623361626, 713866882, 737014465, 851383209, 793635254, 699903259, 632768860, 573361359, 601001816, 609143524, 620975494, 646651764, 712059174, 723251801, 554709206, 472781601, 544944153, 575877075, 591050148, 646097107, 575217590, 531779137, 580054054, 620607338, 662259521, 739227448, 729550629, 638092003, 635824547, 679414444, 695316238, 638871727, 515557823, 454420624, 450884552, 470120087, 534711761, 591170425, 582139549, 550100822, 573914490, 619377403, 639146118, 665619507, 682133408, 676465607, 711553421, 681322861, 575483093, 605879669, 648648529, 570104179, 571774445, 565941963, 534199028, 546044350, 544334145, 632513771, 672641144]
458.1F72641144m9980126J3381806l9867058N141144J590652p042236Q5954513L2421647
465.8G14241486j03925400j01744652O4430580J45590668K5056152m498062j01354484
472.6F37796288j13421746m6046295n291367P7497330L0343628o3693352L7112008
479.3E54296494J13655395j5675659k6524544N883141l8585816J1328392J8720894
486.1F23098297k4090690J6184158J0657005l9449463k1717643J3294754J8009529
492.8E95985947K7799873J6598167k7488517k9885865n812530l870354L0452767L7079124
500.5F40858612j3817444j0789757O430626m92057j9531594j4766426M1127014K1647377
508.2F50666351k9454498n156479m015655l8947564q738784M2905235L0377464j0280990
$$ y = [672641144, 622661018, 636042824, 596175766, 601316910, 602907562, 595865326, 681819839, 714241486, 610316086, 508571434, 573002014, 718592682, 743648834, 739150772, 637796288, 524374542, 478328247, 473036880, 550534210, 580877838, 517184486, 554296494, 667951889, 652276230, 625751686, 631634827, 593049011, 604377403, 623098297, 599007607, 615191765, 625848770, 586399307, 564681664, 577976418, 595985947, 623785820, 640383987, 612895470, 583009605, 577197075, 573326721, 603779488, 640858612, 627041168, 616251411, 622682037, 622189980, 602658386, 587891960, 629018974, 650666351, 621211853, 616055374, 612039719, 573092155, 564353371, 607258606, 637636070, 627355080]
516F27355080l981552j6731339k0846062o497764j9449044J2267952K8982773N552864
523.7F06652908j2416153k7189483J0183334k899742l3086433r182892J2821235L1408921
531.4E76291695r104042k0375748J3875542r38187j309891k679672J80359l100395
539.1E52839661K133674L9534645R512368J601333J8028374j3947601m576836K513809
546.8F07639427j6723518j1862221O739044J3107262P329750J509857j1591301j870766
554.5E94277534r899215j8817063P324486R774399M675522m286728j148987J1232987
562.3E93132935R86290O228523m270821j3159637P790413O555137n813141l535957
570E87913742M863129N972557K91824r830475m253387R005318p684250j4110375L23982
$$ y = [627355080, 623373528, 606642189, 585796127, 579298363, 559849319, 572117271, 601100044, 606652908, 594236755, 567047272, 577230606, 574330864, 541244431, 532061539, 544882774, 576291695, 567187653, 546811905, 560687447, 559749260, 558439369, 555759697, 555940056, 552839661, 554973335, 594507980, 604020348, 605621681, 623650055, 609702454, 605125618, 607639427, 590915909, 579053688, 585792732, 598899994, 606229744, 607739601, 596148300, 594277534, 584378319, 565561256, 572885742, 582660141, 587335663, 583048935, 581899948, 593132935, 594119225, 600347748, 596076927, 582917290, 590707703, 597262840, 591449699, 587913742, 592776871, 598749428, 599041252, 589210777, 584957390, 593962708, 586278458, 572168083, 572492065]
578.6E72492065J814766k049141O138802Q59718l049545M275780j3470116J482468
586.4E68494797K2384453K2201k023392j0193481n725555J1005630P370033J8996811
594.1F10331497p103576j8478356K997284k803268J0544357K905235j6621475j3980751
601.8E67790947j0246506N29824P16514P135887j4590606k7948838K426262k019844
609.5E23793640j5531921j8173485r541130j0692520k2415428q559952j898079Q394356
617.2D45375481J7909507M280701k1258354l2330284j3752136q632088l67928J8311119
624.9D09536018J3470498L375091K4948998L9719467J5062942O72035L656159q83751
632.7E09557457r531975j6899147p072334r03587j3428536j2117500L88069J155395
$$ y = [572492065, 574306831, 572257690, 578396492, 579256210, 576206665, 580482445, 567012329, 568494797, 590879250, 590901451, 588878059, 578684578, 572959023, 583964653, 591334686, 610331497, 603227921, 584749565, 587746849, 584943581, 595487938, 598393173, 581771698, 567790947, 557544441, 558074265, 558790779, 565926666, 551336060, 523387222, 525813484, 523793640, 508261719, 490088234, 480547104, 469854584, 447439156, 438879204, 436981125, 445375481, 463284988, 467565689, 446307335, 413977051, 400224915, 391592827, 391224899, 409536018, 423006516, 426381607, 451330605, 491050072, 506113014, 506785049, 510441208, 509557457, 500025482, 483126335, 476054001, 475150414, 461721878, 449604378, 449992447, 451147842]
640.4D51147842R309349K1691971K8234978K7127113J7516327J5721703O644020k194481
648.1E75198822J5582771J2019348q443946o90575J2948189O110878M511223O897964
655.8F24134674m021835q871880k458420J8551712J4562951j0357743q118286j643181
663.5F21777992p705116r974709J2327042O205673n9244613L1707954K1737976M427300
671.2F21259499l866196n972023R870720J1517334N92346j96915Q692742k419777q353806
679.9F31123924M976006o58989o358757q011M678383M125671m712181j2892113m842491
688.6F15431442L432732N435486O097526m088897k053948M572754l46832r591942k933464
697.3F15954857J8660354N808449j3849640r820633L541718N991898j0209885k858925
$$ y = [451147842, 460457191, 482149162, 510384140, 537511253, 555027580, 570749283, 577393303, 575198822, 590781593, 602800941, 594356995, 593666420, 606614609, 612725487, 617236710, 624134674, 620112839, 611240959, 608782539, 627334251, 641897202, 631539459, 623421173, 621777992, 614072876, 604098167, 616425209, 622630882, 563386269, 595094223, 616832199, 621259499, 617393303, 611421280, 621292000, 632809334, 633401680, 633204765, 641897507, 639477730, 631123924, 636099930, 635440941, 629082184, 629074173, 633752556, 637878227, 633166046, 620273933, 615431442, 618864174, 624299660, 630397186, 626308289, 624254341, 628827095, 628480263, 618888321, 615954857, 634615211, 640423660, 626574020, 616753387, 620295105, 626287003, 616077118, 613218193]
705F13218193J810951l631592J0658036J3065834k23389j3556518j842919J2545929
712.7F32044525o769638n515709J0378456N261002J298675K83814O875229O885299
720.4F50741653k512207k699737m745941J403351l247643j3425484r9525J4724083
728.1F40138550J4223480J054611p145767j2623634p99904J0785675n672608m445686
735.8F35514717k538490o323738Q26072L927422N052757J968003N517273J482162p889061
744.5F37537117n049553N854912J2881584k419357m789582O278458J771927j285934
752.2F50779572N812683J1943969L271180p034989j900101M799271K876358M277802
760F74825745n82734k843399Q865738M695130n666504o774979K75116L281326j490860
$$ y = [613218193, 615029144, 611397552, 622055588, 635121422, 634898033, 621341515, 619498596, 632044525, 625274887, 619759178, 630137634, 635398636, 636697311, 636981125, 643856354, 650741653, 648229446, 645529709, 640783768, 642187119, 638939476, 625513992, 625414467, 640138550, 654362030, 655416641, 648270874, 635647240, 634847336, 645633011, 639960403, 635514717, 632976227, 626652489, 627478561, 631405983, 636458740, 638426743, 643944016, 645426178, 637537117, 632487564, 638342476, 651224060, 648804703, 644015121, 650293579, 652065506, 650779572, 656592255, 668536224, 671807404, 664772415, 662872314, 667671585, 670547943, 674825745, 674243011, 671399612, 680265350, 684960480, 679293976, 672518997, 672794113, 676075439, 674584579]
768.6F74584579L056412L252259k69776q65097L901215L64685r782715O19964N974656
777.3F80836182Q47549P11670K47498r17054N406876R262619k141190N127182Q012238
786G07393570p425842o943589o009521l112793M529495J1999283J3478622P786026
793.7G21695251J387482j0337906o806488l613128p470398L093032M401017P4615j64490
802.4G02258987j771392M895706K185898j2267456k449875J1734924M073791J611176
810.1G10271759j863098k210159J650085m653168Q90351N168991P589416P108307o069336
818.8G17883148p435608o222229m19006O802292M702530j954651r554062k899780j599732
827.5F99302902o586532K019043O880035k517700p060471K373200L974304o925278
$$ y = [674584579, 677640991, 680893250, 680623474, 679758377, 683659592, 684024277, 674241562, 674861526, 680836182, 681683731, 682395401, 682642899, 681725845, 687132721, 696395340, 694254150, 699381332, 707393570, 699967728, 693024139, 687014618, 683901825, 688431320, 700430603, 713909225, 721695251, 723082733, 712744827, 705938339, 702325211, 694854813, 697947845, 702348862, 702423477, 702258987, 700487595, 705383301, 707569199, 695301743, 692851868, 704586792, 708660583, 710271759, 708408661, 706198502, 707848587, 703195419, 704085770, 709254761, 716844177, 723952484, 717883148, 710447540, 704225311, 703806305, 710608597, 715311127, 713356476, 703802414, 700902634, 699302902, 692716370, 694735413, 701615448, 699097748, 692037277, 694410477, 698384781, 691459503]
835.2F91459503r734039J605072q68454j0303421q471069q854218k913361o00280J560516
843.9F52880249L812332P96051N582276k558594m630585N061493j556549l411102Q705291
852.5F64680862R111405j588516J029815M181595K52609L712006Q355942o19812n913239
861.2F83202667P616959O586151J568985L185196l952942o931992j117630P906571
868.9F98063965M125137J608200j073913q209229k153244R55963J332550n60455l175125
877.6F90913849l718643k505722r84955m824143j688919l15704j744461Q69751L352585
886.3F79353638K783508N71594P86972r23385J012573J197815K496261L44849k401276
895F85222549M252472l674240n735397o18744q66089O069412N641327j69220k680206
$$ y = [691459503, 681725464, 683330536, 682462082, 672158661, 663687592, 654833374, 651920013, 651319733, 652880249, 656692581, 657488632, 663070908, 660512314, 655881729, 660943222, 659386673, 655975571, 664680862, 673792267, 672203751, 673233566, 677415161, 677667770, 681379776, 689735718, 689115906, 683202667, 690819626, 697405777, 698974762, 702159958, 698207016, 691275024, 690157394, 698063965, 702189102, 703797302, 702723389, 694514160, 692360916, 693316879, 694649429, 694088974, 690913849, 687195206, 684689484, 683704529, 678880386, 677191467, 676875763, 675131302, 676001053, 679353638, 682137146, 682708740, 683495712, 682572327, 683584900, 684782715, 687278976, 687623825, 685222549, 689475021, 685800781, 680065384, 679446640, 678580551, 684649963, 690291290, 690122070, 687441864]
903.7F87441864J182480j914902q954086k361527n41763j578674J483612j059036n773545
912.3F67924423j0201645l772888Q461075j825028j1462707m234543k968063j616516
920F40304108P38830J653671l847885r372100l532143k018585k471085R25293P179031
928.7F29559135K746048o026344k175293j748352J537399J443329j802292r48829j003647
937.4F21581154R070167Q514443K121620K201233J53198N322190Q764953J256409n052796
946.1F53932571P14417K480469K072677L989868M9668K585373Q82644k892837O55441
954.8F64470291k2507j98135J539307k201462n741959k639999q40683J138153l88489
963.4F55114517o458816m867173m060173m610366m644471m999122O06918L138924j57509
$$ y = [687441864, 688624344, 686709442, 677755356, 675393829, 674852066, 673273392, 674757004, 673697968, 667924423, 657722778, 653949890, 662410965, 660585937, 649123230, 644888687, 641920624, 640304108, 641042938, 642696609, 638848724, 629476624, 625944481, 623925896, 621454811, 622380104, 629559135, 632305183, 626278839, 624103546, 622355194, 623892593, 625335922, 623533630, 622584801, 621581154, 630651321, 639165764, 641287384, 643488617, 643641815, 648964005, 657728958, 658985367, 653932571, 654646988, 657127457, 659200134, 663190002, 663239670, 665825043, 666707687, 663814850, 664470291, 664447784, 664249649, 665788956, 663587494, 657845535, 655205536, 654364853, 655503006, 655114517, 648655701, 643788528, 639728355, 635117989, 630473518, 625474396, 626081314, 629220238, 629062729]
972.1F29062729j730805J21079q40492l696175l411217k617721p1068K326813K600097
980.8F21743240J666146l945504n182189J977882j504021o847496l228531m437599
988.5F00241928j426849j165085r610634p308388n583114j3873902j9658661j6785583
996.2E24829712n104523J3432427K0746231R830894L381500r29603k254601K076722
1004E66008759J810722K21405l845253m596214M38690K176323p53975k499657R04350
1012.6E59865150L338395k8954m665985l641930m982528n716820K362785L744316j838607
1021.3E48435822l700066l159790k769051k681236m088325m023629m444885m211998
1029E19356842K328529j348152o776047j995162n95856k942162m203567K030830N048332
$$ y = [629062729, 627331924, 627453003, 626612511, 622916336, 619505119, 616887398, 616816330, 619143143, 621743240, 623409386, 619463882, 614281693, 616259575, 614755554, 607908058, 604679527, 600241928, 598815079, 597649994, 588039360, 580730972, 575147858, 561273956, 541615295, 524829712, 519725189, 533157616, 553903847, 563734741, 567116241, 566186638, 563932037, 566008759, 567819481, 568040886, 564195633, 559599419, 560038109, 562214432, 561460457, 558960800, 559865150, 563203545, 563174591, 558508606, 554866676, 549884148, 544167328, 546530113, 550274429, 548435822, 544735756, 541575966, 538806915, 536125679, 532037354, 528013725, 523568840, 519356842, 521685371, 520337219, 513561172, 511566010, 510970154, 508027992, 503824425, 505855255, 510903587]
1037.7E10903587K157173l11012j9378K142829m430580p112388k920990J904106M577179
1046.4E06890526N40733j963959j954460q23326R77097K458152k188529k349854K522469
1055.1E04108849j657029K252617O105652K40250j559372R20410L09219n535888l108673
1063.7E02076035L233871K040329j373634L69186K226868m82521k187424j656036J53427
1072.4E04400101m485359n666276r41543M13742M622459J277085j954804J15204k190933
1081.1D95589676j297989L98560j931038l271637J049156j815605r655304n774727
1088.8D73291092j770592l425484n196800q932914j1217957q008423o406059p502709
1096.5D20830154r760665j4733963j7754326j2927628p517433j4427071j5318374j3933106
$$ y = [510903587, 513060760, 512749748, 512730370, 514873199, 510442619, 503330231, 500409241, 502313347, 506890526, 507431259, 505467300, 503512840, 502689514, 503666611, 506124763, 503936234, 501586380, 504108849, 502451820, 504704437, 510810089, 511050339, 509490967, 510411377, 510720596, 505184708, 502076035, 505309906, 507350235, 505976601, 506345787, 508572655, 508090134, 505902710, 504246674, 504400101, 499914742, 494248466, 493306923, 493720665, 498343124, 499620209, 497665405, 497780609, 495589676, 494291687, 494690247, 492759209, 489487572, 490536728, 488721123, 479065819, 473291092, 471520500, 468095016, 462898216, 453965302, 442747345, 434738922, 428332863, 420830154, 411069489, 396335526, 378581200, 365653572, 358136139, 343709068, 328390694, 314457588]
1104.2C14457588j8449478j6203346j3161164r406414j0665988j3771191j2264462
1111B20535545o459427m808521o932087q570614p473735L51696j828232L10936J561088
1119.7A86686649L48168O205311N630950L409386l043651m79756M565830L608399l26138
1128.4B06605148k359333M66004k032528L349533j697998q723297m967347l736820
1136.1A86903362k179126n277310j787567k912502j296978j14270o227340l805180
1143.8A63303089m335852l202533n437393l194571k592449l173399J710663k173739
1151.5A40903816k3546K96030K681313J137275j002645M605884M456339L407526k184534
1160.2A54277458K572575O875496P369957P198524J332016L511810O070328Q760491
$$ y = [314457588, 296008110, 279804764, 266643600, 257237186, 246571198, 232800007, 220535545, 214076118, 209267597, 202335510, 193764896, 186291161, 186642857, 184814625, 185125561, 186686649, 187034817, 193240128, 198871078, 202280464, 199236813, 198757057, 203322887, 206931286, 206605148, 204245815, 204711819, 202679291, 206028824, 204330826, 195607529, 190640182, 186903362, 184724236, 179446926, 177659359, 174746857, 173449879, 173335609, 167108269, 163303089, 158967237, 155764704, 150327311, 147132740, 144540291, 141366892, 143077555, 140903816, 140880270, 141176300, 143857613, 144994888, 143992243, 148598127, 153054466, 156461992, 154277458, 156850033, 163725529, 171095486, 178294010, 179626026, 183137836, 189208164, 197968655]
1167.9A97968655N065746O653366J1653385P513905M534263M861527J1423149J0969315
1175.6B60643311R576568R672299Q836174R330730Q334236J2630673J4707660J3330117
1183.3C47061768O695365N556527J1263656R212609P853012P325020N883178O087570
1191D06938705P664872O196823K812500O067543J0658150Q178939L771172O642265
1198.8D58930969Q033257L618850K821961N829925O409913O242828P949982Q026046
1206.5E07863731N127259N88302P95136K487488L585624M508629K160454N172272O813011
1215.1E39101906j60103l152885j26572J344604K466469K073136k41967J917153K579651
1223.8E45801392J207580K79083j367759N84030J768989J113587p71446j302071K888222
$$ y = [197968655, 203034401, 209687767, 221341152, 228855057, 233389320, 238250847, 249673996, 260643311, 270219879, 279892178, 288728352, 298059082, 306393318, 319023991, 333731651, 347061768, 353757133, 359313660, 370577316, 379789925, 387642937, 394967957, 400851135, 406938705, 414603577, 420800400, 423612900, 429680443, 440338593, 448517532, 452288704, 458930969, 466964226, 470583076, 473405037, 479234962, 485644875, 491887703, 499837685, 507863731, 512990990, 513579292, 514374428, 516861916, 520447540, 524956169, 527116623, 532288895, 539101906, 538941803, 535788918, 535662346, 537006950, 539473419, 541546555, 541304588, 543221741, 545801392, 547008972, 547288055, 545920296, 546504326, 548273315, 549386902, 548615456, 547313385, 550201607]
1232.5E50201607K863540k104454q74290J954307N1690K580108L295136K79617j501236
1241.2E56746025k243919K242164K658654r4109j470757J263276L562889k660790j742592
1249.9E58260841N92003L03536K731666J438294P67860N34973J399002K335549J74141
1258.5E68537865l600083j400528K911225p52411K47841K949333K659454K659416Q70858
1267.2E75082970m10843k59400K334938J011353O74744K421722P26852J748124K627716
1275.9E85958176L619423K244796O8894K928695L640442J313210l00751K77558J916847
1284.6F01667290K474212K949753K881775J513062K248458L709069J110458P91664
1292.3F19345741J328659j629867P67898L813744K797050J671830J79138L366966M541855
$$ y = [550201607, 553065147, 550960693, 550086403, 552040710, 552092400, 554672508, 557967644, 558247261, 556746025, 554502106, 556744270, 559402924, 559308815, 557838058, 559101334, 562664223, 560003433, 558260841, 558852844, 559156380, 561888046, 563326340, 564094200, 564629173, 566028175, 568363724, 568537865, 564937782, 563537254, 566448479, 565696068, 565943909, 568893242, 571552696, 574212112, 575082970, 574672127, 574412727, 576747665, 577759018, 578433762, 580855484, 581582336, 583330460, 585958176, 589577599, 591822395, 591891289, 594819984, 598460426, 599773636, 599472885, 599750443, 601667290, 604141502, 607091255, 609973030, 611486092, 613734550, 617443619, 618554077, 619345741, 620674400, 619044533, 619812431, 623626175, 626423225, 628095055, 628274193, 631641159, 636183014]
1301F36183014j296501q96378K396088N79300l08609J73950R93843K557678J291275
1309.7F41673660J190033J814804j30844j128998k241973J52206L304062l42560k591248
1318.3F41699142L10364J974564K443390L492584K531509k25525j513671m31900J61514
1327F50441971K10876Q63343K38647J539993K774277J87912j713257k42462J756210
1335.7F56057510r26971l534088L13263L284912j11389J78528J723632M54865k95487
1344.4F57144775k398605k46277Q24509l571243k308960K84118j45340J11695O66198
1353.1F50360870q49151r96781J014634J033401P93915m51508k700882k831726J741257
1361.7F47114029K844467K57034j426849k227097m08630k522888k013779K060776O1493
$$ y = [636183014, 634886513, 633990135, 636386223, 636965523, 636656914, 636830864, 637824707, 640382385, 641673660, 642863693, 644678497, 644547653, 643418655, 641176682, 641328888, 644632950, 644290390, 641699142, 642009506, 643984070, 646427460, 649920044, 652451553, 652226028, 650712357, 650280457, 650441971, 650652847, 651516190, 651754837, 653294830, 656069107, 656257019, 654543762, 654301300, 656057510, 655130539, 651596451, 651909714, 655194626, 655083237, 655261765, 656985397, 657440262, 657144775, 654746170, 654499893, 655324402, 651753159, 649444199, 649728317, 649582977, 649694672, 650360870, 649511719, 648514938, 649529572, 650562973, 651356888, 650905380, 648204498, 645372772, 647114029, 649958496, 650215530, 648788681, 646561584, 646152954, 643630066, 641616287, 643677063, 643738556]
1370.4F43738556k073898j709595J527786n10406j975975k104989l720779o05431J279831
1379.1F33845100J785050j898575l489761j225243j021118J250496L801574N272751
1386.8F38320274j083564n390129k157326L91426J799393j036339N4207L46031l560105
1395.5F27683868l089637r52530P53937j546174p02629j48468j630935j873398j87607
1404.2F18306427j182632j935845k91977k693672k330093l280411k047768K215424
1411.9F06759453M78287j330719j665612N62096L43780j012229o20842l852578j854362
1420.6E97807274k418404j226005j64414O03104J236267j912651k076302j055526K15835
1429.2E91009178k239532k958641O81038j363335j274605J536179L233719K698783
$$ y = [643738556, 641664658, 639955063, 641482849, 640972443, 638996468, 636891479, 633170700, 632565269, 633845100, 635630150, 633731575, 630241814, 629016571, 627995453, 629245949, 633047523, 638320274, 637236710, 631846581, 629689255, 630080681, 631880074, 630843735, 630897942, 631243973, 627683868, 624594231, 623641701, 624395638, 622849464, 622146835, 621998367, 620367432, 618494034, 618306427, 617123795, 615187950, 614895973, 612202301, 609872208, 606591797, 604544029, 606759453, 607237740, 605907021, 604241409, 604803505, 605147285, 604135056, 603514214, 599661636, 597807274, 595388870, 594162865, 593998451, 594601555, 595837822, 593925171, 591848869, 590793343, 591009178, 588769646, 585811005, 586492043, 585128708, 583854103, 585390282, 588624001, 591322784]
1437E91322784j623497o93016j002426j136055k898140P2480K624473K51999J353607
1445.6E88272209J297569M58146k476998k35176L636856J347504r37119j301117J46103
1454.3E90207977L215638M762649o82373L06435L294944j19629J858330J010247m34227
1463F03419991L102150N882186J264878p9041J076737J33972O81076J736488L023148
1471.7F20241585N407753j210327J198425K780571l04451J235695N145073N070190
1479.4F39564514O66046j509819N9471K749253L229294K72598k34375J521606P85828
1488.1F47104416J169510K902679R78241r60846R91593Q03680k352753l458862k482452
1496.7F44695206L495102K793884k506638m99801J397705J753616r55810j828003k801514
$$ y = [591322784, 589699287, 589006271, 588003845, 586867790, 583969650, 584042130, 586666603, 586918602, 588272209, 589569778, 590027924, 587550926, 587315750, 590952606, 592300110, 591362991, 590061874, 590207977, 593423615, 598186264, 597503891, 597810326, 601105270, 600985641, 602843971, 603854218, 603419991, 606522141, 612404327, 613669205, 613590164, 614666901, 614800873, 615481949, 617218437, 620241585, 625649338, 624439011, 625637436, 628418007, 628113556, 629349251, 634494324, 639564514, 640230560, 638720741, 638780212, 641529465, 644758759, 645031357, 644796982, 646318588, 647104416, 648273926, 651176605, 652154846, 651194000, 652185593, 652989273, 650636520, 647177658, 644695206, 648190308, 650984192, 648477554, 647977753, 649375458, 651129074, 650173264, 648345261, 645543747]
1505.4F45543747j6369057J324539J0857125L960876P42798M43420M89808k767945
1513.1F44225311j388626O56891J254501J005860k404404R1171J254425k377319l66974
1521.8F41950836Q27789J319504K030411k631988j44578l64990l163223J209717O91757
1530.5F41725235k004089j235428R30099r47380K59857m82750j641998j96075J413459
1539.2F37820930K077103q09212N352250J168594n22766K052917o770096j951293J401367
1547.9F39819794O53228o92443n73197K989884K358932K969666n8365k566071L162461
1556.5F48063889K918243j3535957p999955J0771447M924545L101654Q82263K065430
1564.2F51191559J439590j729278J543655k64969k515716j287995J593247J285476
$$ y = [645543747, 629174690, 630499229, 641356354, 645317230, 646060028, 646503448, 646993256, 644225311, 642836685, 643493576, 644748077, 645753937, 643349533, 643440704, 644695129, 642317810, 641950836, 642778625, 644098129, 646128540, 643496552, 643351974, 642986984, 639823761, 641033478, 641725235, 639721146, 638485718, 639415817, 638468437, 638728294, 638245544, 636603546, 636407471, 637820930, 639898033, 639088821, 644441071, 645609665, 645086899, 647139816, 640369720, 638418427, 639819794, 640473022, 639780579, 639207382, 642197266, 644556198, 647525864, 647467499, 644901428, 648063889, 650982132, 637446175, 629446220, 640217667, 645142212, 648243866, 649126129, 651191559, 652631149, 650901871, 652445526, 652180557, 649664841, 648376846, 649970093, 651255569]
1572F51255569j088180p42264Q04596K967377l597183j372376l34244j546402K84195
1580.6F46631088l125915l881989p52106P81441k107658k514534j5640j312066k792930
1589.3F30909691m891625j230316k54593j613617j537094l090210k359924m042358
1597F11889954j990052j557846k631225l123970l907318k880860k843094o52084j778259
1605.7E90525246k161522k167092j791191l139724l957749n42297k348366k587013
1613.4E71830292l857231o39954K423058q340531k598305o64939J44119k448120l17040
1622.1E55531349P69234l630829l145599m666176j89057J33324j488762l214340k505569
1630.8E37593575P00073j931191k52342k72636j253891q1597K883377L4981k775802
$$ y = [651255569, 650167389, 649425125, 650229721, 653197098, 649599915, 648227539, 647893295, 646346893, 646631088, 643505173, 639623184, 638871078, 639652519, 637544861, 635030327, 635014687, 633702621, 630909691, 626018066, 624787750, 624533157, 622919540, 621382446, 618292236, 615932312, 611889954, 609899902, 608342056, 605710831, 602586861, 598679543, 595798683, 592955589, 592303505, 590525246, 588363724, 586196632, 584405441, 581265717, 577307968, 576765671, 574417305, 571830292, 567973061, 567333107, 569756165, 561415634, 558817329, 558152390, 558296509, 555848389, 555531349, 556300583, 552669754, 549524155, 544857979, 544668922, 544802246, 543313484, 540099144, 537593575, 538293648, 536362457, 536110115, 535837479, 534583588, 534501991, 537385368, 537420349, 534644547]
1639.5E34644547n33524j136856J413803K61230R12247K736588k78778j697312k445144
1648.1E33876801K986793J279030K446937M400216n76897n183220K893257M766960
1655.9E46889877K400704K530670K154426J842919N09949K243270N261574j113167
1663.6E62720222K045327K307510R38187J779289K810440M366989L185959L386574
1671.3E83540497q43773J236420K971801K197838L186188L501091K854843J851845
1679F00496750L032722Q30155M282532N841941O64978q93669o19850M826737M187431
1687.7F22649727J614342J983108M342880N080872K895050M386444O183319M255448
1695.4F53391190q179169M616394P462463L410645P54852j094360P449264N884552
$$ y = [534644547, 534111023, 532974167, 534387970, 534649200, 535561447, 538298035, 538019257, 536321945, 533876801, 536863594, 538142624, 540589561, 544989777, 544412880, 539229660, 542122917, 546889877, 549290581, 551821251, 553975677, 555818596, 556328545, 558571815, 563833389, 562720222, 564765549, 567073059, 568011246, 569790535, 572600975, 576967964, 580153923, 583540497, 582696724, 583933144, 586904945, 589102783, 592288971, 595790062, 598644905, 600496750, 603529472, 604359627, 608642159, 614484100, 615149078, 614255409, 613635559, 618462296, 622649727, 624264069, 626247177, 630590057, 635670929, 638565979, 642952423, 649135742, 653391190, 645212021, 649828415, 657290878, 660701523, 661456375, 660362015, 667811279, 673695831]
1703.1F73695831J348954R87014M033737L365403K283783K825851J711502TK077790
1711.8F94041367K241058N451813L346023l419037J561127L708725m771881Q97064
1719.5G03056259L593903J789016J208039P07779M2419J957627J703948n75866J004867
1728.2G14487991M140015J013718r75953K882233J911926O41556k527313q90198J384888
1736.9G22068863J162872K855301l93829l597717L002777K611465L68805K041016K195205
1745.5G32314758l36456n70145J215592K778702M523468K357482J94550K834320R30405
1754.2G46242676o1951L397675K113189q96301l89328L33862M219208R29108l968277
1762.9G51919861J763992K874069Q18253N17578J668854k115021R59625M819947J985626
$$ y = [673695831, 675044785, 676031799, 680065536, 683430939, 685714722, 688540573, 690252075, 691963577, 694041367, 696282425, 701734238, 705080261, 701661224, 703222351, 706931076, 702159195, 703056259, 706650162, 708439178, 709647217, 710354996, 710397415, 712355042, 714058990, 713483124, 714487991, 718628006, 719641724, 718665771, 721548004, 723459930, 724101486, 721574173, 720683975, 722068863, 723231735, 726087036, 725693207, 722095490, 725098267, 727709732, 728078537, 730119553, 732314758, 731978302, 731408157, 732623749, 735402451, 739925919, 742283401, 742477951, 745312271, 746242676, 746180725, 749578400, 751691589, 750795288, 750405960, 750739822, 754959030, 755888138, 751919861, 753683853, 756557922, 757376175, 757893753, 759562607, 757447586, 758407211, 763227158, 765212784]
1771.6G65212784k003555l951569J308288K640381P52564J157837r3384m01382k37122
1780.3G64384842J64032J103821J098556O83213j452408n81284J599274N54504k4414
1788.9G67530136P71027j401520l51105J892700m8980J859054P84989p20520R80453
1797.6G71296234J518326m69360j471558R47800n51529n36576J034546P68128M31671
1806.3G72967682j21536M82406L007813K633667l487854j992798J221237m5471P65686
1815G75430832J308899L72391j345749j344757l63388J739654K219162j759796j515579
1823.7G74741669J673126J385574j048507J87683K113647J910095l081970j346435
1831.4G76534882K835083O14166N1269L07160j265946k30713l30200J333695J085815
$$ y = [765212784, 763209229, 759257660, 760565948, 763206329, 763958893, 765116730, 765023346, 764621964, 764384842, 764548874, 765652695, 766751251, 767434464, 765982056, 765400772, 767000046, 767554550, 767530136, 768301163, 766899643, 766548538, 768441238, 768392258, 770251312, 771036301, 770315781, 771296234, 772814560, 772345200, 770873642, 771821442, 771269913, 770733337, 771767883, 772536011, 772967682, 772846146, 773328552, 776336365, 778970032, 775482178, 773489380, 774710617, 774665146, 775430832, 776739731, 777112122, 775766373, 774421616, 774058228, 775797882, 778017044, 776257248, 774741669, 776414795, 777800369, 776751862, 776939545, 779053192, 780963287, 777881317, 776534882, 779369965, 779984131, 780035400, 780342560, 779076614, 778845901, 778515701, 779849396, 780935211]
1840.1G80935211j065826p34253J261368J041183l952331Q35800J926727K414627K213669
1848.7G84876175j622543j087723k70310O45447J434784Q0872r58786j268158j99280
1857.4G81630478l99246m64173J017533J708145M16794j560059j635284J44500J171418
1866.1G82030106J105346J581116m49066j977234m11453K48642J179580J184540N23071
1874.8G85014648n45730p75223P5607J146851J213989k1972j40686q87223l01895K55432
1884.4G85033798j612396o81076J462936K435837R00498k024765n49698R32007J261596
1893.1G87158737L19138o26831j559906k799683l41949J369247M01001R40170l98712
1901.8G84461212n96924P38831J53580J21307r9869K73209L78036j033249p25250J520157
$$ y = [780935211, 779869385, 779135132, 780396500, 781437683, 777485352, 778321152, 780247879, 782662506, 784876175, 783253632, 782165909, 781895599, 782541046, 783975830, 784056702, 783097916, 781829758, 781630478, 781231232, 780767059, 781784592, 783492737, 783909531, 782349472, 780714188, 780858688, 782030106, 783135452, 784716568, 784267502, 782290268, 781878815, 782127457, 783307037, 784491577, 785014648, 784468918, 783693695, 783769302, 784916153, 786130142, 786108170, 785967484, 785080261, 784778366, 785033798, 783421402, 782740326, 784203262, 786639099, 787539597, 785514832, 784965134, 785897141, 787158737, 787477875, 786851044, 785291138, 782491455, 782149506, 783518753, 783919754, 784859924, 784461212, 783864288, 784603119, 784756699, 784878006, 784778137, 785051346, 785429382, 784396133, 783670883, 785191040]
1911.4G85191040J353378j80664n3100p87201n38025j22070j565018k95792O04630
1920.1G83607178L7460j14899J731491Q07572q04825M4937l06625Q926o53152o29502
1929.7G83728561L52173J03302J067047J298142J55487j703186q99582M70047p29981
1938.4G83842010j252593j030045R19495J020202j88064J034851j74561j249924R81446
1947.1G83902817J721115m65927j160813l38897O09359Q87146J18714m50363r32618
1955.8G83890533N80979Q94241n54275n64118j209564p73849L54156j49536j92032
1964.5G82276535J003647R15069q27026p52029m64020n33447L66134K4872M91943J572190
1974.1G84073868J6479j4419J385574P04193p57217k717743j730042P30973j06278
$$ y = [785191040, 786544418, 786363754, 786310654, 785523453, 784985428, 784863358, 783298340, 783002548, 783607178, 783644638, 783529739, 785261230, 786068802, 785263977, 785308914, 785002289, 785011215, 784358063, 783728561, 784080734, 784184036, 785251083, 786549225, 786704712, 785001526, 784101944, 784571991, 783842010, 782589417, 781559372, 782478867, 783499069, 783311005, 784345856, 784171295, 782921371, 783902817, 785623932, 785158005, 783997192, 783658295, 784267654, 785154800, 785273514, 784823151, 783890533, 784471512, 785365753, 784811478, 784247360, 783037796, 782263947, 782618103, 782468567, 782276535, 783280182, 784195251, 783368225, 782616196, 782152176, 781618729, 781984863, 782009735, 782501678, 784073868, 784090347, 784075928, 785461502, 786165695, 785408478, 782690735, 780960693, 781691666, 781585388]
1982.8G81585388l48739P25784P49512K8762j019439j448517p04422J225662J284103
1991.5G82078094j487808j432647r59473n42450J895828J428909K42463M49752n10330
2000.1G81162338o11496K29035o6834q04901l25928k92434j45951J269532J028289
2008.8G81441650k45208L02200K00272k368470j532898J351090J252518q45643j879043
2017.5G77676468R98382J173096k9983J265487o48193l210983j307144J585845J241837
2026.2G78744812P47223K56271r05990m4709j4724j330796j181564j41830k70615J151047
2035.8G77009125J389541j038284n51529K26135J305085k88620k569046k26441K48490
2044.5G75504456L1890N7602J448594J527328j778870l02429J124497j319199k554779
$$ y = [781585388, 781236649, 781962433, 782711945, 782740707, 781721268, 780272751, 779568329, 780793991, 782078094, 780590286, 779157639, 778198166, 777655716, 779551544, 780980453, 781222916, 781672668, 781162338, 780550842, 780779877, 780713043, 779908142, 779582214, 779289780, 779143829, 780413361, 781441650, 781196442, 781498642, 781698914, 779330444, 777797546, 779148636, 780401154, 779555511, 777676468, 778674850, 779847946, 779817963, 781083450, 780435257, 777224274, 775917130, 777502975, 778744812, 779492035, 779748306, 778842316, 778797607, 778782883, 777452087, 776270523, 776128693, 775858078, 777009125, 778398666, 777360382, 776808853, 777034988, 778340073, 778051453, 775482407, 775255966, 775504456, 775536346, 775593948, 777042542, 778569870, 776791000, 776488571, 777613068, 776293869, 773739090]
2053.2G73739090n69077J863099M87060r33380o67725m61349Q61740M71649o37588
2061.9G74153519K44827o30798k44522P87734j031112k72675J276322l33481j673050
2070.5G72276764J90811k48260j363984q98666j972504J224213J258316k113647k86255
2079.2G68066788J214218J416473o70471j406937l61099n52215O32476K03705l23868
2087.9G68219070J15815k41394m4709O19126m7226j326905K00119J513825l32794l30277
2097.5G68344650J011811n66330p0801R84039P60422J300888l91083P4005r7427q51593
2107.2G70498581J042709M44565m49676j384354p19605L98560K93427M89273L65142
2115.9G70978622J315003J9913m33579k3651m41971L00751m54865Q38013O88400j617660
$$ y = [773739090, 773170013, 775033112, 775520172, 774586792, 773919067, 773457718, 774319458, 774791107, 774153519, 774398346, 773767548, 773523026, 774310760, 773279648, 773006973, 774283295, 773949814, 772276764, 772467575, 772219315, 770855331, 769956665, 767984161, 769208374, 770466690, 768353043, 768066788, 769281006, 770697479, 770027008, 768620071, 768258972, 767706757, 768339233, 768542938, 768219070, 768334885, 768093491, 768048782, 768667908, 768620682, 767293777, 767493896, 769007721, 768674927, 768344650, 769356461, 768790131, 768719330, 769703369, 770463791, 771764679, 771373596, 771447601, 771350174, 770498581, 771541290, 771985855, 771536179, 770151825, 769432220, 769830780, 770124207, 770613480, 770978622, 772293625, 772313538, 771879959, 771856308, 771414337, 771715088, 771260223, 772098236, 772786636, 771168976]
2125.5G71168976p9575J427460l14407k108841o45523J331787J711120O11191k34909
2134.2G72867279r72595j433258M66995Q22449P07550k4262j089248N87845N6076l09067
2143.8G71679764M58526q01544M8142J601562P91779l89405k94876K99912L29895M97665
2153.5G74221420n9204o36139K17438P0725q95463q697J423111R48563m06571j012649
2163.1G73862534N09185R93576p04116q8273r18350q44574O45218j012344q8654K365
2172.8G72356567q03070K83585J095810Q37326j869965p30743J682434J610413N63354
2181.4G75025711j079636j263046j330490l05099p82471q99277J247330K555847J991882
2190.1G75160751j032333j296768L97796K012558r842j933441J172104O73523P66602
$$ y = [771168976, 771089401, 772516861, 772202454, 770093613, 769448090, 770779877, 772490997, 773102188, 772867279, 771894684, 770461426, 770928421, 771750870, 772458420, 772434158, 771344910, 771932755, 771988831, 771679764, 772138290, 771336746, 771384888, 772986450, 773778229, 773388824, 773093948, 773393860, 773723755, 774221420, 774162216, 773526077, 773743515, 773814240, 772918777, 772910080, 774333191, 775281754, 774875183, 773862534, 774371719, 775365295, 774661179, 774572906, 773654556, 772809982, 773455200, 772442856, 772354202, 772356567, 771553497, 771837082, 772932892, 773770218, 771900253, 771169510, 772851944, 774462357, 775025711, 773946075, 772683029, 771352539, 771047440, 770264969, 769365692, 770613022, 773168869, 775160751, 774128418, 772831650, 773229446, 775242004, 775232162, 773298721, 774470825, 775144348, 775910950]
2198.8G75910950O49948j054077L98712L89709o7901m64783q41904M2954J210098l39813
2208.4G75833893p50733J601410J243439R61838q23593j600342j9684Q56323R13239
2217.1G78215790j379929R8648J145935N6763P88269l65143j496963j002503O31638
2225.8G76692505M44641J46332N88608N98297P81479p28150l92456r8114l20053j095276
2235.4G76617813k439422k10419J080627R76105j66092l68652J273575P80105L96347
2244.1G77939987j012268j115494P88269N52140o72379o66656J436996N94101j171112
2252.8G76673584L18603M94156q34655j053696Q63876J720810K34452n36728q08945
2261.5G77071457l57437M47922J03759m05273N01022N5313j120147J0757l34930N38177
$$ y = [775910950, 776560898, 775506821, 775905533, 776295242, 776227341, 775762558, 774920654, 774963608, 776173706, 775833893, 775083160, 776684570, 777928009, 778889847, 778066254, 776465912, 776446228, 777302551, 778215790, 776835861, 776934509, 778080444, 778137207, 778925476, 778560333, 777063370, 776060867, 776692505, 777137146, 777283478, 777872086, 778470383, 779251862, 778523712, 778131256, 778033142, 777713089, 776617813, 774178391, 773967972, 775048599, 776024704, 775858612, 775489960, 776763535, 777543640, 777939987, 776927719, 775812225, 776600494, 777152634, 776480255, 775813599, 777250595, 777844696, 776673584, 776992187, 777486343, 776651688, 775597992, 776461868, 778182678, 778417130, 777880402, 777071457, 776714020, 777161942, 777265701, 776860428, 777361450, 777416763, 776296616, 776307373, 775972443, 776510620]
2271.1G76510620J899719O01273M32205j530533k036590L50342N96313K289n13992
2279.8G76311646J92108L31268J25809P20672M77600k89535j107483j212997N7144
2288.5G75606232K542190J329041j419525j456452o97250J176910O23169n23529q69675
2297.2G76311111p42645K32392k28959P02286j04904Q90121K621689k152939k661514
2305.8G74866638J478043J032028k152634j492767J345825P54318r65805j104431L15094
2314.5G74076309R78089m16031j297379J306687J404266m99954N66559k888566l224639
2323.2G70005341O32782j045685j376267K156983K706222j683121j763229J562042
2330.9G71195068K545700J630707j200180l816604k044983L173828K136459N14755
$$ y = [776510620, 778410339, 779011612, 779443817, 777913284, 775876694, 776227036, 776823349, 776825638, 776311646, 776503754, 776835022, 776960831, 777681503, 778159103, 777869568, 776762085, 775549088, 775606232, 778148422, 779477463, 778057938, 776601486, 775904236, 777081146, 777704315, 777180786, 776311111, 775568466, 775800858, 775571899, 776274185, 776169281, 777059402, 779681091, 777528152, 774866638, 776344681, 777376709, 775224075, 773731308, 775077133, 775831451, 774865646, 773761215, 774076309, 775054398, 774638367, 773340988, 774647675, 776051941, 775551987, 776118546, 773229980, 770005341, 770638123, 769592438, 768216171, 770373154, 773079376, 771396255, 769633026, 771195068, 773740768, 775371475, 774171295, 770354691, 768309708, 771483536, 773619995, 774134750]
2338.6G74134750N84717k181396j542054O05240M21448k143860o41250L821869K360534
2347.3G75419998q84476J89820J803589J35955j542739k663117k033462J099166R11866
2356G72436600j830750j18713J053848m004059l147125k167129K539596Q010254L18985
2364.7G73091507k458572J050720J621856j027297L47900K069092l06626M23050j17187
2373.3G74694443J389312K437668l16009O9427J045304j63575O3477J427383r06906
2382G79740524j918411L13416J057739J295776J510544R13849p35016j118393j109695
2390.7G79950333j275864j30234J150055Q72955j521911p59506R25064J221008Q70514
2399.4G81302414j335526k76870R11789M20761l50876j001511L34702J50680l10058
$$ y = [774134750, 774719467, 772538071, 770996017, 771601257, 772022705, 769878845, 769237595, 773059464, 775419998, 774535522, 774725342, 776528931, 776664886, 775122147, 772459030, 770425568, 771524734, 772436600, 770605850, 770487137, 771540985, 767536926, 764389801, 762222672, 764762268, 772772522, 773091507, 770632935, 771683655, 773305511, 772278214, 772626114, 774695206, 774388580, 774811630, 774694443, 776083755, 778521423, 778205414, 778274841, 779320145, 779156570, 779220047, 780647430, 779740524, 777822113, 778135529, 779193268, 780489044, 781999588, 782913437, 782178421, 781060028, 779950333, 778674469, 778544235, 779694290, 780567245, 779045334, 778285828, 779210892, 780431900, 781302414, 779966888, 779690018, 780601807, 781022568, 780671692, 779670181, 780004883, 780155563, 779845505]
2408.1G79845505o26068o26526P0877n646P58972N29557m65012m87289J02615J67236
2417.7G79264221l12805O7902K1972N6458N23987k40555p25861O22406Q22907p72782
2427.3G79327850j139984p93533O0806J075745K16369k8534P88956k12936l73307j56326
2437G78765106j570511j191406r1247J21383J115341J317902l2349k98233m16031m50592
2446.6G77269363K13547p23038r18426m29688O61240J404648n93720l29971M98581
2455.3G77052536p59430k90298R32922o17752j390839O26526N09567K16141q7662j009368
2465G75182343p75300j373P58667n25360k08816J18865p67364L76053j25427m90418
2474.6G73541870K87781J97677M64783l967j878586j519470L72009N18036J87149P0038
$$ y = [779845505, 779219437, 778592911, 778663788, 778658142, 779417114, 779946671, 779481659, 778994370, 779096985, 779264221, 778951416, 779019318, 779041290, 779097748, 779621735, 779381180, 778655319, 779277725, 780100632, 779327850, 778187866, 777394333, 777455139, 778530884, 778747253, 778718719, 779507675, 779294739, 778921432, 778765106, 777194595, 776003189, 775911942, 776033325, 777148666, 778466568, 778434219, 778135986, 777719955, 777269363, 777482910, 776759872, 775841446, 775411758, 776072998, 777477646, 776883926, 776553955, 777052536, 776293106, 776002808, 776935730, 776317978, 774927139, 775553665, 776063232, 776279373, 776191711, 775182343, 774407043, 774405670, 775164337, 774638977, 774430161, 774549026, 773781662, 774157715, 774032288, 773541870, 773829651, 774027328, 774492111, 774488144, 772609558, 771090088, 771462097, 771980133, 772167282, 772237320]
2484.2G72237320J833420J280365j208878q49609j180420J93405J025925q99811n78003
2492.9G71853714L74145j64566q07800N6763R42001N56412k46353k5101l22342j136474
2502.6G71080399K7084J061783M80728j289749o38581Q08106L08914o57349j509628
2511.2G69671707L11279J25351q61816l74451q93325R23004R96399l00904O01883Q81348
2520.9G71080475k30637j165390q66699J3351J21842j293640m37088J26114j271210
2529.6G66077118J45645J657791J101303K26975k03781j294022l63541M73633r75113
2538.2G66846008L84217O1798j228867j40915N68390Q10242j55258l96805K99606M78745
2547.9G67527161k50321r10797k70920J58463m62341k60392O68488j34125j55563k80075
$$ y = [772237320, 774070740, 775351105, 774142227, 773292618, 772112198, 772305603, 773331528, 772431717, 771853714, 772227859, 772063293, 771255493, 771312256, 772254257, 772810669, 772564316, 772539215, 772216873, 771080399, 771107483, 772169266, 772649994, 771360245, 770721664, 771529770, 771838684, 771181335, 769671707, 769982986, 770108337, 769246521, 768872070, 767978745, 768901749, 769898148, 769597244, 770199127, 771080475, 770849838, 769684448, 768817749, 768831100, 768952942, 767659302, 767222214, 767348328, 766077118, 766222763, 767880554, 768981857, 769208832, 769005051, 767711029, 767347488, 767821121, 766846008, 767230225, 767292023, 766063156, 765922241, 766490631, 767300873, 767145615, 766748810, 767048416, 767527161, 767276840, 766366043, 766095123, 766253586, 765791245, 765530853, 766199341, 766065216, 765909653, 765629578]
2557.5G65629578k68021N51300p47299l77426L20816N38635K98233j201401j50070
2566.2G64594345O62460N38712K24838j00021M04816n03617j397934j023254j42212
2574.9G63258133P90558J153106P49970k74200j695710j427078M79279O08978J79977
2583.6G63823013m26864n23529J335678M60052j421356k82135j38092j99051L48206
2592.2G62975922q14820r78622K7771J192245J07956j600494M63714R71070k34986
2600.9G62109756j45568R04312O24542k012253r85336O45065j86691l59421j115646
2609.6G59478760m03290J622009P86286o11420n81741n95093m67301j488800p21893
2618.3G57017517R85489l02506k28805M76227N39245M14353O3400l04031o03180L62701
$$ y = [765629578, 765361557, 765912857, 765165558, 764788132, 765108948, 765647583, 765945816, 764744415, 764594345, 765256805, 765795517, 766020355, 765920334, 766325150, 765821533, 764423599, 763400345, 763258133, 764048691, 765201797, 765951767, 765677567, 763981857, 762554779, 763034058, 763643036, 763823013, 763396149, 762872620, 764208298, 764668350, 763246994, 762964859, 762826767, 762627716, 762975922, 762161102, 761182480, 761210251, 762402496, 762510452, 760909958, 761373672, 762344742, 762109756, 761964188, 762868500, 763493042, 761480789, 760495453, 761140518, 760953827, 760594406, 759478760, 759075470, 760697479, 761483765, 760872345, 760290604, 759695511, 759228210, 757739410, 757017517, 758003006, 757700500, 757471695, 757947922, 758487167, 758901520, 758964920, 758660889, 758057709, 758420410]
2627.9G58420410p63168j082306Q0795j44882L65829Q240r17816q11691L21121K64511
2637.6G55741043j40839K06299m35409m34418j04599k67792r97772k99377R9258J78680
2647.2G53545074P51038j385269m75540Q49838k98309k47269k95334j88293n58091
2655.9G51697845N07355M40369r86252q46176k38953R11026J81122q66699j260147
2664.6G49539490l89099N48629O68641J041336l67508k70310j45340L94745P57980
2673.3G51778564j004791n54733j249313j113511L23487r0866l45841k64663j15738
2681.9G47362595j031952k31018O68411J13678K90375o256K32086J88827J27640J11771
2691.6G47826157m60587k52457k8839j94015n52063n62744P6217R03778L88718l73077
$$ y = [758420410, 757657242, 756574936, 756655731, 756510849, 756876678, 756884918, 755967102, 755155411, 755476532, 755741043, 755600204, 755806503, 755371094, 754936676, 754832077, 754564285, 753566513, 753267136, 753366394, 753545074, 754296112, 752910843, 752435303, 753285141, 752986832, 752739563, 752444229, 752255936, 751697845, 752205200, 752645569, 751659317, 750813141, 750574188, 751485214, 751666336, 750799637, 749539490, 749150391, 749699020, 750367661, 751408997, 751041489, 750771179, 750625839, 751020584, 751778564, 750773773, 750219040, 748969727, 747856216, 748179703, 748088837, 747742996, 747478333, 747362595, 746330643, 746099625, 746768036, 746881714, 747172089, 747165833, 747397919, 747586746, 747714386, 747826157, 747365570, 747113113, 747084274, 746890259, 746338196, 745775452, 745851669, 746755447, 747144165, 746771088]
2701.2G46771088r32541j508942m7989P1945m75463k95182j500702j00021J490707
2709.9G43472900Q7586j79825n5237n54428m86603q9721Q66088J17264r68780P41653
2719.5G42950897M23508j272736k53982n75485j667176m65164O03180P32040L7384
2728.2G40512466m98352m6310K77023l35998j562958r21402o22025l34396J675415
2736.9G38143463M08325n84793Q69217J2894j586075l24860R94568o30035j84555N18722
2746.5G37636871r05914q40454k72980J53580l69339j074982j023254R3002P51267
2755.2G34147797q7433j67160j110535n68008M18548n24063L5401J7700k2126J73264
2764.9G32313385k46201k41317j025849p59277J16348l1738P0877N92728O42929q32367
$$ y = [746771088, 745838547, 744329605, 744281616, 744353561, 743878098, 743582916, 742082214, 741982193, 743472900, 743560486, 743380661, 743325424, 742770996, 742284393, 742194672, 743060760, 743178024, 742209244, 742950897, 743374405, 742101669, 741847687, 741272202, 739605026, 739139862, 739743042, 740475082, 740512466, 740014114, 739967804, 740244827, 739908829, 738345871, 737424469, 736802444, 736468048, 738143463, 738551788, 737966995, 738836212, 738849106, 737263031, 736938171, 737932739, 737302704, 737118149, 737636871, 736730957, 735890503, 735617523, 735771103, 735401764, 734326782, 733303528, 733396530, 734147797, 734060364, 733893204, 732782669, 732214661, 732633209, 732109146, 732144547, 732162247, 732140121, 732313385, 732067184, 731825867, 730800018, 730040741, 730157089, 730125351, 730196228, 730788956, 731431885, 730599518]
2774.5G30599518j065369P13654J08185j242295j155166l94516N44891k24533m02069
2783.2G27482300k33002o32248k06146J64871L77350j476669j171646J112670n45654
2791.9G24871826m89960O67725j232452r13620P04422m31443q14972r25598j520004
2800.5G19915924P2556Q21838J75247q10165n68543j06430j214523j23215O12946m68064
2810.2G18307571j342697j078949J06812p5302j078568k155990j42136J837845N36728
2818.9G14915314J71737q41903j912003j191482k33841n6534k9602L70407k30866m84314
2828.5G10476913n15976r54666j174163j578904j171646K12326l68576j803665L58505
2837.2G03480148N46494k624054j881409j82266r90982j566925j538162k061005j764755
$$ y = [730599518, 729534149, 730247803, 730355988, 729113693, 727958527, 727564011, 728108902, 727884369, 727482300, 727249298, 726617050, 726410904, 726575775, 726953125, 725476456, 724304810, 725417480, 724871826, 724381866, 725049591, 723817139, 722903519, 723607941, 723176498, 722361526, 721435928, 719915924, 719988480, 720810318, 720985565, 720175400, 719606857, 719500427, 718285904, 718162689, 718775635, 718307571, 716964874, 715885925, 715992737, 715917435, 714838867, 712682877, 712540741, 714378586, 714915314, 715087051, 714245148, 712333145, 711141663, 710907822, 710851288, 710821686, 711192093, 710961227, 710476913, 709960937, 709006271, 707832108, 706253204, 705081558, 705293884, 704925308, 703121643, 703480148, 704026642, 701402588, 699521179, 699338913, 698347931, 696781006, 695242844, 693181839, 691417084]
2845.9F91417084r39255j879654k258301r29107k24381j380463l205337j862183M21067
2854.6F79159470j9989N48324J037903m69513m52576L56217m93775j769409n12314
2863.2F77384338P13807Q67614R54285j893997k717133k42004M23431J73569J06735
2871.9F75770645o87561j713333r14307q40149r98001k34451q09097J11999M16260
2880.6F70102005r78394j229400j02310J289520n23071j622086k40555k24838m46243
2889.3F66024628j029435p45544L22723n14068j029740r73663q26340m50744j072769
2897.9F59705048n96085m77982j506729p82623j24359m63104p99027q62274j077423
2906.6F53015442n07736M90646l56903j329117k128754j351776L37143q23364j512299
$$ y = [691417084, 690477829, 688598175, 686339874, 685410767, 685186386, 683805923, 680600586, 678738403, 679159470, 679139481, 679687805, 680725708, 680256195, 679803619, 680159836, 679666061, 677896652, 677384338, 678098145, 678965759, 679920044, 678026047, 675308914, 675066910, 675490341, 675663910, 675770645, 675083084, 673369751, 672455444, 671615295, 670617294, 670382843, 669573746, 669685745, 670102005, 669123611, 667894211, 667791901, 669081421, 668558350, 666936264, 666695709, 666470871, 666024628, 664995193, 664249649, 664572372, 664058304, 663028564, 662054901, 661228561, 660777817, 659705048, 659108963, 658630981, 657124252, 656341629, 656217270, 655754166, 654955139, 654092865, 653015442, 652507706, 652998352, 652641449, 651312332, 649183578, 647831802, 648168945, 647345581, 645833282]
2915.3F45833282j124038j531067o58493k91977j545029r92775l82995j87645K60925
2924F39380188m32816L37906j82228M79851K024918j430664j633683J178856J600456
2932.7F41322784K22092r07822M42734J119614O54602q2855K84958J36108k81830J399002
2942.3F44309387P42493K83279P16935r57947j137543M87823O76804l41339k22778
2951F44557114l27607J21918M85153r59854j142578n34134O60324J092224r51156j259384
2960.6F41742020J063461N50308j675415j83716J711274J593246L50037M9972J687164
2969.3F46888351J270066N1422P6370O91071J606064K238845J737213l36532n35813
2978F53687057O69480J167755J634674R30786L7384L38288O42471M45251R22165P13120
$$ y = [645833282, 644709244, 643178177, 642519684, 642227707, 640682678, 639689903, 639306908, 639119263, 639380188, 638947372, 639285278, 639103050, 639582901, 641607819, 640177155, 638543472, 639722328, 641322784, 641544876, 640637054, 641079788, 642199402, 642854004, 642771149, 643056107, 643192215, 642910385, 644309387, 645051880, 645335159, 646052094, 645094147, 643956604, 644444427, 645121231, 644779892, 644557114, 644229507, 644351425, 644836578, 643876724, 642734146, 642200012, 642860336, 643952560, 643001404, 641742020, 642805481, 643355789, 641680374, 641496658, 643207932, 644801178, 645151215, 645201187, 646888351, 648158417, 648209839, 648286209, 648977280, 650583344, 652822189, 654559402, 654222870, 653687057, 654356537, 655524292, 657158966, 658089752, 658127136, 658465424, 659107895, 659553146, 660475311, 661188431]
2987.6F61188431m26712O8283J108780J384506Q94318N18875j00403n22080L33634
2996.3F64447632l94821q97293K61840J278611J433029K03628m63562j287155r66186
3005F63615723J80206n69992L51334J530303L23182l87192J47781q8577l80249m51584
3014.6F64270935j320953j04294R57031k4490m4174K7923j026153j531525k27509Q5984
3024.3F61062775p2022j19171j528702q15277J517716Q85925j948929j330261p8659
3033F57573395n29938P41119m959j445388j335373l9368Q16498j177368n07126O60019
3042.6F54751511m28849m40368n89981m24118o53611r83200L82233J74560j126327
3051.3F50661850k20261p0343j024322m68979J23672k95105j182937j037445m08859
$$ y = [661188431, 660761719, 660830002, 661938782, 663323288, 664217606, 664736481, 664636078, 664113998, 664447632, 664052811, 663155518, 663417358, 664695969, 666128998, 666332626, 665869064, 664581909, 663615723, 663795929, 663225937, 663577271, 665107574, 665430756, 665043564, 665191345, 665102768, 664722519, 664270935, 662949982, 662845688, 663802719, 663778229, 663734055, 663761978, 662735825, 661204300, 660976791, 661062775, 660990753, 660871582, 659342880, 658527603, 660045319, 660931244, 658982315, 657652054, 657573395, 657043457, 657784576, 657779617, 656334229, 654998856, 654959488, 655775986, 654598618, 654091492, 654751511, 654322662, 653882294, 653292313, 652868195, 652214584, 651231384, 651613617, 651788177, 650661850, 650441589, 650371246, 649346924, 648877945, 649001617, 648706512, 647523575, 646486130, 646077271]
3060F46077271M16030P57599q96301j755447m08478N68390o91910m58908J49917p59201
3069.6F42998962r5596n42297o10657n89218p93381N19409N43289M44336j289062j200981
3079.2F39384804j18294j627197l09448L4141j021805r90219O41441K209702q49380
3087.9F37353745j828003K84271m67072j911468j061554n47905j00365P82166j291313
3096.6F31212502p69921J111794N4474m53835j757927j294250M00352n3940m95681
3105.3F27953568j046486o77872o54373j050453k85073r39941k32697P34711j211433
3114F22589951m52157O16036n45540k11983j241645j756249j27258j160736j801377
3122.6F15909042r1552J41105K87514J21040j199417j400833j563873l33672J447106
$$ y = [646077271, 646493301, 647250900, 646354599, 644599152, 644190674, 644759064, 644067154, 643608246, 643758163, 642998962, 642903366, 642361069, 641750412, 641161194, 640367813, 640887222, 641430511, 641874847, 640585785, 639384804, 639266510, 637639313, 637329865, 637364006, 636342201, 635351982, 635993423, 638203125, 637353745, 635525742, 635810013, 635342941, 633431473, 632369919, 631822014, 631721649, 632503815, 631212502, 630442581, 631554375, 631608849, 631155014, 629397087, 628102837, 628503189, 628449249, 627953568, 626907082, 626229210, 625574837, 624524384, 624239311, 623299370, 623066673, 623801384, 622589951, 622137794, 622753830, 622208290, 621996307, 620754662, 618998413, 618871155, 617710419, 615909042, 615817490, 615958595, 616246109, 616367149, 615167732, 613766899, 612203026, 611869354, 613316460]
3131.3F13316460J76239p45354m73976j363793j462516j037102j461907l43437q12492
3140F05792122k370415k212o6986j399651p83501j326790K12517P37686j000366j753921
3149.6E98038483j234360J162338R09195j630058j745033j000328j279984m87938N37491
3158.3E93269806q51173j220437p65304j347923r11408j58653O2256q80280k189178
3167E85007706k224503o31981Q00476P1488p49207j563034j307602o69479j729736
3175.7E77004128r29337l09143p22466o95457k40631J055908j027145k452126n53551
3184.4E71130180k42157j065292j600151q26073L3798n7373q31604j168747k07061
3193E65165520l56865k107048k317734J50795m84123j443024P79266Q1559k012215
$$ y = [613316460, 613492699, 612747345, 612273369, 610909576, 609447060, 608409958, 606948051, 606604614, 605792122, 603421707, 603419495, 603352509, 601952858, 601169357, 599842567, 600055084, 600792770, 599792404, 598038483, 596804123, 597966461, 598875656, 597245598, 595500565, 594500237, 593220253, 592732315, 593269806, 592418633, 591198196, 590432892, 589084969, 588173561, 588014908, 588077164, 587196884, 585007706, 582783203, 582151222, 582951698, 583023186, 582273979, 580710945, 579403343, 578733864, 577004128, 576074791, 575765648, 575043182, 574347725, 574107094, 575163002, 574135857, 571683731, 571130180, 570888023, 569822731, 568222580, 567396507, 567430305, 567372932, 566541328, 565372581, 565165520, 564808655, 562701607, 560383873, 560534668, 560050545, 558607521, 559386787, 559468346, 557456131]
3201.7E57456131k074661M11224K58293j635628o11572r05990n41230o40831j785202
3210.4E49930534j675987r86519P85218J13334j416931j639328r0713R9487k346039
3219.1E42773056j137505M84047n20515k150574j256981L67737q26568j79978J032181
3227.8E38584900p83501k262077l99208K23045j055527j152725q49342M2572j615906
3236.4E30732231j302528R44328m48914r76181j496391j937561q77609j67122k85606
3245.1E24184647j94016j53770q75397o37436r41505q47321r95331j462745j110650
3253.8E16966476k34565J575050n07164j496429o64940j689110m40445p210J03760
3262.5E13605423l13454j101570o23779n18227J64147o95000q62503k32353j552162
$$ y = [557456131, 555381470, 555792694, 556050987, 554415359, 553803787, 552897797, 552356567, 551715736, 549930534, 548254547, 547268028, 548053246, 548166580, 546749649, 545110321, 545019608, 545119095, 542773056, 541635551, 542119598, 541599083, 539448509, 538191528, 538559265, 537732697, 537552719, 538584900, 537801399, 535539322, 535140114, 535363159, 534307632, 533154907, 532305565, 532348137, 530732231, 529429703, 530374031, 529925117, 528948936, 527452545, 525514984, 524637375, 524470253, 524184647, 523990631, 523836861, 522961464, 522324028, 521382523, 520535202, 519539871, 518077126, 516966476, 516731911, 518306961, 517799797, 516303368, 515638428, 513949318, 513508873, 513501663, 513605423, 513291969, 512190399, 511566620, 511048393, 511212540, 510517540, 509655037, 509422684, 507870522]
3271.2E07870522j157570P44857k07634k388839r64318J279908Q46367m36020o06194
3279.8E04981079j722298k333641l13453K87933o2714j283569j130905L31612q94432
3288.5D97859612n55916p9346j064987r50470k83966J7090M1008M84161m58336n96809
3298.2D94412041J9760m59442j194649k240753n20973J62353j320534J89858O44607
3306.8D89692268o41479o11229j784096j933174P82661K52877j892967j015854q60672
3315.5D81988335j196709K65770O94389j266403j453628K51655j204224k411994l93181
3324.2D75274010r0676j220588n84030Q23631O09093r04694k435570k719917o72836
3332.9D68078423o36406j022377Q15239o68755j885872p81212l07197k5673o21414
$$ y = [507870522, 506712952, 507457809, 507250175, 504861336, 503897018, 505176926, 506023293, 505587273, 504981079, 503258781, 500925140, 500611687, 500899620, 500836906, 499553337, 498422432, 498754044, 497859612, 497303696, 497224350, 496159363, 495208893, 494924927, 494942017, 494983025, 495467186, 495008850, 494412041, 494431801, 493972359, 492777710, 490536957, 490015984, 490178337, 488857803, 489047661, 489692268, 489050789, 488439560, 486655464, 484722290, 485504951, 485757828, 483864861, 482849007, 481988335, 480791626, 481057396, 481751785, 480485382, 479031754, 479283409, 478079185, 475667191, 475274010, 475183334, 473962746, 473378716, 474202347, 474811440, 473906746, 471471176, 468751259, 468078423, 467442017, 466419640, 467234879, 466566124, 464680252, 463899040, 463591843, 463566170, 462944756]
3341.6D62944756j628685k320900o15464j04103j304893p42569j648712j639443o60896
3350.2D52279091o18324k85836K3003L65181j023483k100830j625138j152572p37152
3358.9D45123940M69055K87018l222161k459297O53419m73251p23953M74968j277847
3367.6D38851891k593346p40204j524391k426491J78490Q58574l24669j503372j498413
3376.3D29278069n63546j67236m9324j235542k423516j476593L41568p18612j793747
3384.9D21191521K99911J81046L15551Q01392k391777k195396P08389N54237j64184
3393.6D19300690n92423q02765o7062k71912j561317j433754k45819K1934j335182
3402.3D13012390j365051J03721l92150O370M34914p85294l82385k90031r68476l92761
$$ y = [462944756, 461316071, 458995171, 458379707, 458275604, 456970711, 456228142, 454579430, 452939987, 452279091, 451660767, 451374931, 451397934, 451763115, 450739632, 448638802, 447013664, 445861092, 445123940, 445592995, 445880013, 442657852, 440198555, 440851974, 440378723, 439654770, 440129738, 438851891, 436258545, 435518341, 433993950, 431567459, 431745949, 432604523, 432279854, 430776482, 429278069, 428714523, 428547287, 428497963, 427262421, 424838905, 423362312, 423703880, 422985268, 421191521, 421491432, 421672478, 421988029, 422789421, 420397644, 418202248, 418910637, 419464874, 419300690, 418708267, 417905502, 417838440, 417566528, 416005211, 414571457, 414325638, 414347572, 413012390, 411647339, 411751060, 411358910, 411365280, 411800194, 411014900, 410632515, 410342484, 409374008, 408981247]
3412D08981247J047668J46141j153717j3847n05371r32732m2457J613197J748314k262535
3421.6D08625908k722511O15806J605339J55525j26686K00920q2130j49994q96988
3430.3D07225189N5580O35910J2322J59225J05515J86882j088562o74515N31921L97645
3439.9D07547112R67521K75917l54538j45759R25483J432114O86913q5144j321106
3448.6D09928513N62629K306862O35758n26925m5890Q57811Q66203P00340j94282q32367
3458.2D14258652J465797K245140l78799r67865Q89664J022605p5569N47142J472817
3466.9D20479584p9308n54275J458358K370949J484947j10321O1341J231804O16264
3475.6D26959343L45001l9329L38211K613258J504364m7111L13797p81708M02031J058807
$$ y = [408981247, 410028915, 410175056, 409021339, 409007492, 408502121, 407569389, 407526932, 409140129, 410888443, 408625908, 405903397, 406519203, 408124542, 408280067, 408153381, 408354301, 408272171, 408122177, 407225189, 407280769, 407916679, 407929001, 408088226, 408193741, 408380623, 407292061, 406617546, 407149467, 407547112, 408514633, 408790550, 408436012, 408290253, 409215736, 410647850, 411334763, 411249619, 409928513, 410491142, 412798004, 413433762, 412906837, 412860947, 413718758, 414584961, 415285301, 415091019, 414258652, 415724449, 417969589, 417590790, 416622925, 417512589, 418535194, 418459625, 419006767, 420479584, 420400276, 419846001, 421304359, 423675308, 425160255, 425049934, 425111275, 426343079, 426959343, 427304344, 427265015, 427603226, 430216484, 431720848, 431673737, 431987534, 431205826, 431607857, 432666664]
3485.2D32666664L16887J088257J415138K031059R40743l95394J126328J073418k82021
3493.9D39981079N61905O51703J74599J586036J853066J091346q69331q99315K328110
3502.6D46459198J902084N57328Q11882O02646J087646J785316L76816o48002J749992
3511.3D54684906R24377M00467J026192k66838J100807J622200J156006J006088J52665
3520D61806870P83348K631225K217140j473159m81263J904107J047325j57318J264419
3528.6D69542694L577576J311798q49419J272660K504615N45998J236305J770058q95233
3537.3D80017052P01408J901474J029892J813736K903976J618195Q70667M89616k408333
3546D88937683K28424K332230J209297L27072P25594K994156J507988J889801J063613
$$ y = [432666664, 432983551, 434071808, 435486946, 437518005, 438458748, 438063354, 439189682, 440263100, 439981079, 440542984, 441194687, 441369286, 442955322, 444808388, 445899734, 445030403, 444131088, 446459198, 448361282, 448918610, 449730492, 450333138, 451420784, 453206100, 453582916, 452934914, 454684906, 455609283, 456009750, 457035942, 456769104, 457869911, 459492111, 460648117, 461654205, 461806870, 462590218, 465221443, 467438583, 465965424, 465484161, 467388268, 468435593, 468278275, 469542694, 473120270, 474432068, 473582649, 474855309, 477359924, 477905922, 479142227, 480912285, 480017052, 480718460, 482619934, 483649826, 485463562, 488367538, 489985733, 490856400, 491346016, 488937683, 489166107, 491498337, 492707634, 493034706, 493760300, 496754456, 498262444, 500152245, 501215858]
3554.7E01215858J72730K034683P47681J302147K089844K402076M86183O16341K770386
3563.4E13837929J212349L279991J288948o88973J316224m9973K835465J686859J417503
3572E26136322K196121J044846K1286R98955L572692J211434N79758J590347J751633
3580.7E39103394J897583J460456K046738Q83331K932129J753426k047196L317757
3588.4E51347618K537308J690826K261811K800598J656265O42509L558541M94690J840820
3597.1E68830986L606377p10869J052666L334198K994003K712974J564751l7880K070961
3605.8E85418167M953766J011314K189751K37007n51376O838112K732353j223831L472671
3614.5F05077934r16977J667290M316406L358078M504967p85522j750832L312454M139710
$$ y = [501215858, 501388588, 503423271, 504170952, 505473099, 507562943, 509965019, 510451202, 511067543, 513837929, 515050278, 518330269, 519619217, 518930244, 520246468, 520196495, 523031960, 524718819, 526136322, 528332443, 529377289, 529398575, 530397530, 533970222, 535181656, 535761414, 537351761, 539103394, 541000977, 542461433, 544508171, 545391502, 548323631, 550077057, 548029861, 551347618, 553884926, 555575752, 557837563, 560638161, 562294426, 562936935, 566495476, 566990166, 568830986, 572437363, 571726494, 572779160, 576113358, 579107361, 581820335, 583385086, 583347206, 585418167, 590371933, 591383247, 593572998, 593810005, 593258629, 600096741, 602829094, 601605263, 605077934, 604160957, 605828247, 610144653, 613502731, 618007698, 617222176, 615471344, 618783798, 622923508]
3623.1F22923508K012405J337128K014694J466446M736290O360664q011780n74836
3630.9F32264519N022354N410652K381058o6147K246399K830582L032226J915970J139145
3639.5F56176758J133423J317901K078171K029877J911926K197876O059418K913437
3647.3F75818787m183045N305023L270874m386901k426911L677139L596116M839019
3655F85510101P857285p328262j690979M446258K73056J730423Q11234J235962J293945
3663.6F94139023J510849J886673k93808L536148K558136j513214Q30841n801926J269150
3672.3F98121872Q228378Q820954j971360j5682296K717514O885681N977630j873855
3680G11224518j380615L203430O44836m48532J34125J000671N639191Q752670p807541
$$ y = [622923508, 624935913, 626273041, 628287735, 629754181, 634490471, 640851135, 632839355, 632264519, 637286873, 642697525, 645078583, 645012436, 647258835, 650089417, 653121643, 655037613, 656176758, 657310181, 658628082, 660706253, 662736130, 664648056, 666845932, 672905350, 675818787, 671635742, 676940765, 680211639, 675824738, 673397827, 677074966, 680671082, 685510101, 693367386, 686039124, 684348145, 688794403, 689067459, 690797882, 691609116, 692845078, 694139023, 695649872, 697536545, 697242737, 700778885, 703337021, 701823807, 702654648, 696852722, 698121872, 706350250, 715171204, 713199844, 697517548, 700235062, 707120743, 713098373, 711224518, 709843903, 713047333, 713692169, 713243637, 713377762, 714378433, 720017624, 728770294, 720962753]
3688.7G20962753p773132Q272476m018478m170075M314804J268235O00738o77185J07041
3697.4G18887177J580810J5869L335571N207901m030990m840622M138031L652267P84302
3706.1G28730316k80456J270065J791916p149735O368866O918106j5580520K814789
3713.8G24883347N433883J242600Q57315Q49457L20510l611602Q30078P623749p1183
3722.5G38358154p021560L172912K263947j613770l291778o89316L016357O00663O142120
3731.2G40937729l8223r345017J0477524P619400j1140213o030808N54886Q47245J208267
3739.8G35090790K876663l678665J952743J2979279p752304j7054138J0239105O368866
3747.5G41022339P168884k355423j4135895J1215744J521225j1279220J759796L294144
$$ y = [720962753, 713189621, 721462097, 717443619, 713273544, 717588348, 718856583, 719457321, 718780136, 718887177, 720467987, 720483856, 723819427, 729027328, 724996338, 720155716, 724293747, 727946014, 728730316, 728449860, 729719925, 731511841, 724362106, 730730972, 737649078, 722068558, 724883347, 730317230, 731559830, 732417145, 733266602, 733587112, 729975510, 730805588, 738429337, 738358154, 731336594, 734509506, 736773453, 735159683, 731867905, 731178589, 734194946, 734795609, 740937729, 740899506, 731554489, 742032013, 749651413, 738511200, 732480392, 733035278, 733882523, 735090790, 737967453, 734288788, 736241531, 749220810, 741468506, 724414368, 734653473, 741022339, 748191223, 745835800, 731699905, 742915649, 744436874, 733157654, 734917450, 738211594]
3755.3G38211594N238342l270874J091156O002960r978409l917923N439377K772827
3763G41589050O64902L292847j604157n859756K414779M858628K11105q338318M78516
3771.7G37707596L743744l47367m33044J049805K761383O22711R82971k25906p161942
3780.3G38699951J527176K201157N72967K427063k173233l94668J871872q18711j463775
3789G42449799r55277M06571Q773p44323j293335J747284O937789R1630o705323M52118
3798.7G42395706L709107M756012n103684r267959L141784J103134M226990P983704
3806.4G52944794j0292969p558212M639206L073349R85794j300354k165680J58539
3814.1G40484467N595245J292953j2808075L080521O234436P565537P987213j8236389
$$ y = [738211594, 743449936, 740179062, 741270218, 747273178, 737294769, 733376846, 738816223, 741589050, 742253952, 745546799, 743942642, 738082886, 740497665, 745356293, 745567398, 737229080, 737707596, 741451340, 741103973, 740670929, 741720734, 744482117, 745104828, 746087799, 745861893, 738699951, 740227127, 742428284, 743001251, 745428314, 743255081, 742860413, 744732285, 743913574, 742449799, 741494522, 741901093, 741909866, 741165543, 739872208, 741619492, 748557281, 748648911, 741943588, 742395706, 746104813, 750860825, 745757141, 736489182, 739630966, 740734100, 744961090, 752944794, 742651825, 735093613, 739732819, 742806168, 743791962, 742491608, 740325928, 740484467, 746079712, 747372665, 734564590, 737645111, 743879547, 751445084, 759432297, 741195908]
3821.8G41195908m759598M959488J084594K365876K591018m332428j556930J432571
3829.5G42980499M102707K150879j1263275L243637R393921q631439l703614R420395
3837.2G47693710j914749m570694P955094m219742o266480L538285j031037k890243
3844.9G38294144K007827J543274R59320L610535O0425o32706O097641J410523L795471
3853.6G57146454j6306381n724717R024353j006698l953781R05151K681732K255707
3861.3G45021820n117340J791077O789474m233246m687729K182389L697357P263031
3869.1G52706833j271744j1201172m80881M334260M270706r488297k125015M923096
3876.8G41667786Q3389J683044O165543k819748p935562L741455O48117O18820M111481
$$ y = [741195908, 736436310, 741395798, 742480392, 744846268, 747437286, 743104858, 741547928, 742980499, 747083206, 749234085, 737970810, 741214447, 750608368, 741976929, 738273315, 747693710, 745778961, 741208267, 749163361, 744943619, 738677139, 742215424, 741184387, 738294144, 740301971, 741845245, 742804565, 746415100, 746475525, 745842819, 751940460, 753350983, 757146454, 740840073, 735115356, 744139709, 743133011, 739179230, 740084381, 742766113, 745021820, 739904480, 741695557, 748485031, 744251785, 739564056, 741746445, 745443802, 752706833, 751435089, 740233917, 739753036, 744087296, 748358002, 738869705, 736744690, 741667786, 741751175, 743434219, 749599762, 746780014, 738844452, 742585907, 743234024, 743852844, 747964325]
3885.4G47964325j0184021J489868L687210K25144M749603j60370p669754J95084M338836
3894.1G44635925m6844m61731k0523N37414K177887p027740K917480p6599o044464
3902.8G36590805O139603j515961p0343P78656j114731K528610Q29926p6447j582489
3911.5G42507629N74494M13818j574402J042862J377411j195831l954010K219086J866531
3920.2G43277588j376572L109513J76391j052475l412857l763656L432540K416230
3927.9G42806702l38669o23551K034836L109436k638778l023377J62964k9373Q32748
3936.6G42292938J007309j092758r25217L7995K544098L047943m906540l739014J546021
3945.2G39812775K505188K508011j636200j377106J58539j221848J648636J038971
$$ y = [747964325, 737780304, 739270172, 742957382, 743182526, 747932129, 747771759, 740102005, 740297089, 744635925, 744589081, 744127350, 744106827, 744644241, 746822128, 739794388, 742711868, 742635269, 736590805, 742730408, 741214447, 741144104, 741922760, 740808029, 743336639, 744166565, 744090118, 742507629, 743082123, 743495941, 741921539, 742964401, 744341812, 743145981, 739191971, 741411057, 743277588, 741901016, 745010529, 745186920, 744134445, 740721588, 736957932, 740390472, 742806702, 742468033, 741844482, 743879318, 746988754, 744349976, 741326599, 741489563, 741460190, 742292938, 743300247, 742207489, 741282272, 741320267, 743864365, 746912308, 742005768, 738266754, 739812775, 742317963, 744825974, 743189774, 741812668, 741971207, 740749359, 742397995, 743436966]
3953G43436966q31986P0343m6691P33032j27716K4643N62057j346893q00018j396637
3962.6G40277100J46255K914963k10571k180024j743011J74866J806182K37198J3581
3971.3G41436539J113128J712418j118622k835312N4016J177292L65219m3182J23520
3980G41985016n50766M00391J177368o56128l0976J48926J07575n68848j850586N84869
3989.6G40746841J004715n82885j013031o95343J786270J875763j266861o08826J073456
3998.3G42320099O96564P03277
4000.2G43719940
$$ y = [743436966, 742604980, 742675323, 742628632, 743361664, 743233948, 743258591, 743820648, 742473755, 741673737, 740277100, 740423355, 743338318, 743127747, 740947723, 739204712, 739379578, 741185760, 741422958, 741436539, 742549667, 744262085, 743143463, 740308151, 740362167, 741539459, 741904678, 741861496, 741985016, 741434250, 741834641, 743012009, 742355881, 742324905, 742473831, 742581406, 742012558, 740161972, 740746841, 741751556, 741168671, 740155640, 739460297, 741246567, 743122330, 741855469, 741246643, 742320099, 743016663, 743719940]
##END=$$ End of the data block
