##TITLE=$$ Begin of the data block
##JCAMP-DX=5.00 $$ ACD/SpecManager v 10.08
##SPECTROMETER/DATA SYSTEM=Varian
##DATE=07 Jan 2013 10:07:10
##DATA TYPE=INFRARED SPECTRUM
##DATA CLASS=XYDATA
##ORIGIN=
##OWNER=
##NPOINTS=3735
##FIRSTX=399.26403809
##LASTX=4000.35498047
##MAXX=4000.35498047
##MINX=399.26403809
##MAXY=88.66975403
##MINY=14.21463299
##XFACTOR=1.0000000000
##YFACTOR=0.000000100000000
##FIRSTY=67.72849274
##DELTAX=0.96440572
##XUNITS=1/CM
##YUNITS=TRANSMITTANCE
##XYDATA=(X++(Y..Y))
$$ plain form
399.3 677284927 613574753 504077454 437019157 483066521 640475616 543590088 399749146
406 399749146 423890839 494902763 661653748 746251831 674729614 723411636 765821686 680557709
413.7 680557709 586793060 464184418 496630287 858755341 886697540 451854439 697455139
420.5 697455139 685763779 560130272 575255661 643598328 706473465 677465363 633411484
427.2 633411484 584129944 640380554 715796890 630975609 553944016 504407349 509509430 583012047
434.9 583012047 590520134 643504868 743982391 705697784 591948318 565082626 611383858
441.7 611383858 657633209 685612564 719155121 753440781 758558197 729246140 669550781 625773582
449.4 625773582 633351746 656101990 608310623 483332443 505995865 611687126 594350128
$$ packed form
399.3F77284927o3710174j09497299o7058297M6047364J57409095r6885528j43840942
406C99749146K4141693P1011924J66750985Q4598083p1522217M8682022M2410050q5263977
413.7F80557709r3764649j22608642L2445869L62125054K7942199m34843101K45600700
420.5F97455139j1691360j25633507J5125389O8342667O2875137k9008102m4053879
427.2F33411484m9281540N6250610P5416336q4821281p7031593m9536667N102081P3502617
434.9E83012047P508087N2984734J00477523l8284607j13749466k6865692M6301232
441.7F11383858M6249351K7979355L3542557L4285660N117416k9312057n9695359m3777199
449.4F25773582P578164K2750244m7791367j24978180K2663422J05691261j7336998
$$ plain form
456.2 594350128 572004280 623879623 609036369 534901581 499189377 558510056 519382286
462.9 519382286 457551880 569113388 632594795 549166603 550931053 617844696 651917419
469.7 651917419 645766983 629825211 491306305 456418800 627768631 663740158 614019165
476.4 614019165 629487724 581946754 635435448 717603378 661932831 634251137 619407692
483.2 619407692 643217773 662168884 614930153 606441307 623709106 626728973 599985924 565920639
490.9 565920639 547760887 580101814 637811737 618450127 612953224 660150299 631460724 593668976
498.6 593668976 616333008 621084366 624090614 637427635 617847595 597800217 590830002 610817909
506.3 610817909 607174644 564346466 559551201 577993279 608167305 604196587 596217117 636698380
$$ packed form
456.2E94350128k2345848N1875343j4843254p4134788l5712204N9320679l9127770
462.9E19382286o1830406J11561508O3481407q3428192J764450O6913643L4072723
469.7F51917419o150436j5941772j38518906l4887505J71349831L5971527m9720993
476.4F14019165J5468559m7540970N3488694Q2167930n5670547k7681694j4843445
483.2F19407692K3810081J8951111m7238731q488846J7267799L019867k6743049l4065285
490.9E65920639j8159752L2340927N7709923j9361610n496903M7197075k8689575l7791748
498.6E93668976K2664032M751358L006248J3337021j9580040k0047378o970215J9987907
506.3F10817909l643265m2828178m795265J8442078L0174026l970718p979470M0481263
$$ plain form
514 636698380 641340027 629958496 601579857 532197151 546823082 599977684 594628944 578832932
521.7 578832932 603934555 612587013 572057381 544615517 564373055 572344475 541700363 536223335
529.5 536223335 573632126 607993584 616716156 596365280 573056145 573494949 587698631 596098480
537.2 596098480 593174324 581099510 565704613 568538246 590595818 606423225 614704552 614236107
544.9 614236107 606583366 597438354 563837090 540693398 564908066 588927155 597759895 598597755
552.6 598597755 585645485 575643349 565279121 572794342 577713165 548719902 533068542 533129234
560.3 533129234 538428535 559622192 583834305 609218864 613520584 589171677 586198311 596127663
568 596127663 598427658 604444885 589170494 579946175 588229256 583087006 591436081 603244133
$$ packed form
514F36698380M641647j1381531k8378639o9382706J4625931N3154602n348740j5796012
521.7E78832932K5101623Q652458m0529632k7441864J9757538P971420l0644112n477028
529.5E36223335L7408791L4361458Q722572k0350876k3309135M38804J4203682Q399849
537.2E96098480k924156j2074814j5394897K833633K2057572J5827407Q281327m68445
544.9F14236107p652741r145012l3601264k3143692K4214668K4019089Q832740Q37860
552.6E98597755j2952270j0002136j0364228P515221M918823k8993263j5651360O0692
560.3E33129234N299301K1193657K4212113K5384559M301720k4348907k973366R929352
568E96127663K299995O017227j5274391r224319Q283081n142250Q349075J1808052
$$ plain form
575.8 603244133 592466393 578564644 570089722 572887383 575231209 578141518 580543327 582055511
583.5 582055511 581605759 560788345 551355896 563712234 579496956 587197647 574828377 568305473
591.2 568305473 564216652 565853424 590447845 607889977 609387589 595237389 579498291 577531242
598.9 577531242 567028503 556795502 546539574 540089874 558662224 576154404 575671158 556279411
606.6 556279411 532767982 523018608 523165245 529028091 507860146 477306824 472745094 456033211
614.3 456033211 436268044 439735489 434719925 428118744 448396797 454403267 432240219 425443001
622 425443001 418797531 400683365 405000916 424354820 431660919 442444305 470126152 487158546
629.8 487158546 485580025 494711571 516030807 525235329 518436661 514140396 501968727 480310555
$$ packed form
575.8F03244133j0777740j3901749q474922K797661K343826K910309K401809J512184
583.5E82055511m49752k0817414r432449J2356338J5784722P700691j2369270o522904
591.2E68305473m088821J636772K4594421J7442132J497612j4150200j5739098j967049
598.9E77531242j0502739j0233001j0255928o449700J8572350J7492180m83246j9391747
606.6E56279411k3511429r749374J46637N862846k1167945l0553322m561730j6711883
614.3D56033211j9765167L467445n015564o601181K0278053O006470k2163048o797218
622D25443001o645470j8114166M317551J9353904P306099J0783386K7681847J7032394
629.8D87158546j578521R131546K1319236R204522o798668m296265j2171669k1658172
$$ plain form
637.5 480310555 454090157 428191032 430723495 449236298 474406967 500448380 515463524 545197906
645.2 545197906 566149178 568905983 577487373 597250366 602038841 593090057 605111809 605355453
652.9 605355453 598726692 609782257 622311554 627183342 615265083 615657043 623302574 615265350
660.6 615265350 613480949 615771484 613257675 605120125 608889771 635472107 654736710 638057938
668.3 638057938 634315681 624637260 624094124 633758545 632773552 625310135 621345062 617070351 602614632
677 602614632 608665009 632590981 635299950 626215973 619693642 622754517 624807167 622010269 620193100
685.7 620193100 620253220 626664314 619979553 610119820 619663773 628172226 625117722 628259544 630299416
694.4 630299416 622414246 623634644 627325478 631878395 635750999 630608940 627539482 625154305
$$ packed form
637.5D80310555k6220398k5899125K532463J8512803K5170669K6041413J5015144K9734382
645.2E45197906K0951272K756805Q581390J9762993M788475q948784J2021752K43644
652.9F05355453o628761J1055565J2529297M871788j1918259L91960P645531q037224
660.6F15265350j784401K290535k513809q137550L769646K6582336J9264603j6678772
668.3F38057938l742257r678421n43136R664421r84993p463417l965073m274711j4455719
677F02614632O050377K3925972K708969r083977o522331L060875K052650k796898j817169
685.7F20193100O0120O411094o684761r859733R543953Q508453l054504L141822K039872
694.4F30299416p885170J220398L690834M552917L872604n142059l069458k385177
$$ plain form
702.1 625154305 623185654 620447006 622611580 625930061 621401520 622071571 626119003 631188316 627604027
710.8 627604027 619643669 620636826 619657364 621024857 621819801 626899376 639318275 637336044 634264183
719.5 634264183 645546951 655654755 656195145 653366318 649203568 637946930 631411819 640469742
727.2 640469742 649696960 650447159 643097382 634400826 636518440 636488190 632530212 641723709 649185715
735.8 649185715 638698654 631138382 639143028 646616669 645537949 637686195 637994957 645416641
743.6 645416641 640696259 637798767 639537315 644193192 654966736 652469177 643767929 643661499
751.3 643661499 651122818 665974045 676320496 676659317 674377975 666895752 668573990 687683640
759 687683640 696788483 685635605 668582230 670243835 686880951 687291031 679952621 673856354
$$ packed form
702.1F25154305j968651k738648K164574L318481m528541O70051M047432N069313l584289
710.8F27604027p960358R93157r79462J367493P94944N079575J2418899j982231l071861
719.5F34264183J1282768J0107804N40390k828827m162750j1256638o535111R057923
727.2F40469742R227218P50199p349777q696556K117614l0250l957978R193497P462006
735.8F49185715j0487061p560272Q004646P473641j078720p851754L08762P421684
743.6F45416641m720382k897492J738548M655877J0773544k497559q701248j06430
751.3F43661499P461319J4851227J0346451L38821k281342p482223J678238J9109650
759F87683640R104843j1152878j7053375J661605J6637116M10080p338410o096267
$$ plain form
766.7 673856354 671674347 678790054 680231247 678875580 678504486 676379471 677724075 676291733 672294235
775.4 672294235 672849274 673941193 675417099 676357117 678811722 693311157 702350159 695635223 693591843
784.1 693591843 698177109 699371948 700660095 701562042 698311462 704073334 708654404 701826477 703012695
792.7 703012695 708997803 713309174 716129837 717150879 705299301 689692688 697243958 701811905
800.5 701811905 698928909 701704865 701031189 699576797 695830307 697953262 704324265 707554169 703004913
809.1 703004913 702383499 710419693 703899612 694893112 695378342 709664230 720678482 715379410
816.9 715379410 716155624 708305130 696166382 695427399 701813965 711750717 714762650 711399536 707365646
825.5 707365646 712180557 713107681 699950485 686862488 687050934 693947220 692329941 696204834
$$ packed form
766.7F73856354k182007P115707J441193j355667l71094k125015J344604j432342l997498
775.4F72294235N55039J091919J475906R40018K454605J4499435R039002o714936k043380
784.1F93591843M585266J194839J288147R01947l250580N761872M581070o827927J186218
792.7G03012695N985108M311371K820663J021042j1851578j5606613P551270M567947
800.5G01811905k882996K775956o73676j454392l746490K122955O371003L229904m549256
809.1G03004913o21414Q036194o520081r006500M85230J4285888J1014252n299072
816.9G15379410P76214p850494j2138748p38983O386566R936752L011933l363114m033890
825.5G07365646M814911R27124j3157196j3087997J88446O896286j617279L874893
$$ plain form
833.3 696204834 698686523 689598007 679347687 673622437 671001663 665794983 670156937 670371170
841 670371170 657145309 649036560 652097168 664291000 668668289 663533707 663259201 665425568 661028290
849.6 661028290 656768188 653907471 652570724 663042831 670365448 674939880 682521591 679076385
857.4 679076385 673686905 680875549 685804214 682679749 688906403 688002090 684951324 692972183 696169510
866 696169510 697793198 699941711 708254776 707873001 700511932 699024506 693079910 691802521 686334991
874.7 686334991 684871063 688055038 678249207 673319702 677967682 686791992 690358658 686295624
882.4 686295624 682525482 679625244 677902985 676561661 674325333 674666214 684862823 689386139
890.2 689386139 681724014 678221817 680394440 680537033 681138992 686422043 686630478 686204453 687058182
$$ packed form
833.3F96204834K481689r088516j0250320n725250k620774n206680M361954K14233
841F70371170j3225861q108749L060608J2193832M377289n134582k74506K166367m397278
849.6F61028290m260102k860717j336747J0472107P322617M574432P581711l445206
857.4F79076385n389480P188644M928665l124465O226654r04313l050766Q020859L197327
866F96169510J623688K148513Q313065l81775p361069j487426n944596j277389n467530
874.7F86334991j463928L183975r805831m929505M647980Q824310L566666m063034
882.4F86295624l770142k900238j722259j341324k236328L40881J0196609M523316
890.2F89386139p662125l502197K172623J42593O01959N283051K08435m26025Q53729
$$ plain form
898.8 687058182 685793991 686056442 683448105 681868820 679341736 673479385 670954132 676531143 680629196
907.5 680629196 677740707 678460922 676894150 672112961 667140656 661042480 659164276 665394135 665276642
916.2 665276642 652393951 652346268 653007507 646753998 646601715 644752121 643388138 635610847 629958763
924.9 629958763 631012917 626668625 624333115 625484581 629690094 628128967 617959747 614631233
932.6 614631233 620699921 624688034 624387398 623024597 623065834 631216583 637991791 640406418 637566872
941.3 637566872 639528275 653180618 653993225 652218475 651088104 649739914 659593201 666416550
949 666416550 669791718 668553772 668765717 667146301 656997986 657584000 660897751 657721863 656164169
957.7 656164169 660289078 665397415 662267761 657288971 654478607 648814011 641833572 638503227
$$ packed form
898.8F87058182j264191K62451k608337j579285k527084n862351k525253N577011M098053
907.5F80629196k888489P20215j566772m781189m972305o098176j878204O229859j17493
916.2F65276642j2882691m7683O61239o253509j52283j849594j363983p777291n652084
924.9F29958763J054154m344292k335510J151466M205513j561127j0169220l328514
932.6F14631233O068688L988113l00636j362801M1237Q150749O775208K414627k839546
941.3F37566872J961403J3652343Q12607j774750j130371j348190R853287O823349
949F66416550L375168j237946K11945j619416j0148315N86014L313751l175888j557694
957.7F56164169M124909N108337l129654m978790k810364n664596o980439l330345
$$ plain form
965.4 638503227 634560661 631307144 635354767 638360291 636433563 632892342 629811974 630893631
973.1 630893631 631024323 622701683 616251526 618189087 618165627 616998138 618509827 620041695 618384743
981.8 618384743 616459541 619123955 616697845 608500328 606577492 605911942 599505005 591826630 584362411
990.5 584362411 582976494 585087166 576025391 560120430 543310661 528636818 525383186 536198769
998.2 536198769 554019661 566920090 573288612 571392632 568798790 572218781 570292168 564227638
1005.9 564227638 563457832 563306236 556087723 551177826 555345650 558676491 556977654 557001762 559611206
1014.6 559611206 559076042 557179031 552355995 547764549 545345306 540108986 536574402 533977470
1022.3 533977470 533583183 534335785 533653793 533242264 530689583 526359253 519691200 515584221 514146347
$$ packed form
965.4F38503227l942566l253517M047623L005524j926728l541221l080368J081657
973.1F30893631J30692q322640o450157J937561k3460j167489J511689J531868j656952
981.8F18384743j925202K664414k426110q197517j922836o65550o406937p678375p464219
990.5E84362411j385917K110672r061775j5904961j6809769j4673843l253632J0815583
998.2E36198769J7820892J2900429O368522j895980k593842L419991j926613o064530
1005.9E64227638p69806j51596p218513m909897M167824L330841j698837K4108K609444
1014.6E59611206n35164j897011m823036m591446k419243n236320l534584k596932
1022.3E33977470l94287P52602o81992m11529k552681m330330o668053m106979j437874
$$ plain form
1031 514146347 512341080 511297569 515830345 525076370 521581116 509743614 502873154 502233620 506275520
1039.6 506275520 510690308 512904053 509185219 503542595 499976959 503041458 510743027 507957382
1047.4 507957382 498087845 499373970 505955391 502402000 498301430 501708755 512428932 519920540
1055.1 519920540 514667320 507906456 503664742 502323914 502303848 502574348 504225616 505894623 507965317
1063.7 507965317 508654480 509177170 507611542 503404236 499036446 500090103 501828194 499407997 503239250
1072.4 503239250 504011078 496536713 491208229 494890442 498872147 493248253 491728516 493622055
1080.1 493622055 493241196 494146690 497260017 499111977 497966461 493039894 482740364 477866859
1087.9 477866859 474235916 470939484 468253098 461631432 457390785 442128601 426739388 424339104
$$ packed form
1031E14146347j805267j043511M532776R246025l495254j1837502o870460o39534M041900
1039.6E06275520M414788K213745l718834n642624l565636L064499P701569k785645
1047.4E07957382r869537J286125O581421l553391m100570L407325J0720177P491608
1055.1E19920540n253220o760864m241714j340828k0066K70500J651268J669007K070694
1063.7E07965317O89163N22690j565628m207306m367790J053657J738091k420197L831253
1072.4E03239250P71828p474365n328484L682213L981705n623894j519737J893539
1080.1D93622055l80859R05494L113327J851960j145516m926567j0299530m873505
1087.9D77866859l630943l296432k686386o621666m240647j5262184j5389213k400284
$$ plain form
1095.6 424339104 418972206 406480713 390799751 379238815 368638000 353313866 337239571
1102.3 337239571 325408058 312002010 297740517 287377548 273641415 256031857 240377750
1109.1 240377750 232561073 222595901 211697598 204091225 197751503 194087238 190723763 190662613
1116.8 190662613 184738903 187099934 194467049 192342739 192730198 193636894 196752129 198371429 201372795
1125.5 201372795 202665272 202475796 206633835 205949478 204467487 201971817 200589867 197365074 191878433
1134.1 191878433 187539673 185823727 187904453 185652752 181470089 173385944 171042118 166737137
1141.9 166737137 157671270 156810446 153587236 153869467 151756229 149854431 147502661 143333435 145219021
1150.5 145219021 143740339 146432924 144815187 142146330 145531349 151648722 157389812 155961990
$$ packed form
1095.6D24339104n366898j2491493j5680962j1560936j0600815j5324134j6074295
1102.3C37239571j1831513j3406048j4261493j0362969j3736133j7609558j5654107
1109.1B40377750p816677r965172j0898303p606373o339722l664265l363475o1150
1116.8A90662613n923710K361031P367115k124310L87459R06696L115235J619300L001366
1125.5B01372795J292477j89476M158039o84357j481991k495670j381950l224793n486641
1134.1A91878433m338760j715946K080726k251701m182663q084145k343826m304981
1141.9A66737137r065867q60824l223210K82231k113238j901798k351770m169226J885586
1150.5A45219021j478682K692585j617737k668857L385019O117373N741090j427822
$$ plain form
1158.3 155961990 158110886 160045738 163674793 165637074 169931717 180266151 183792038 187949581
1166 187949581 190700397 195364017 202288074 209712124 217381744 223973751 233402977 239422684 247925282
1174.6 247925282 256848030 265474110 276368179 286661110 299476910 312508736 324810295 334561996
1182.4 334561996 344733963 353603058 362023468 371970253 377099915 383280830 392304611 401528587
1190.1 401528587 411091309 416544685 417702141 422334023 430167274 438407593 448139877 453405533
1197.8 453405533 458099899 466082458 472854271 479061737 485451012 489565506 493134041 499226341
1205.5 499226341 503473854 506616898 511823540 517607536 518993034 518510971 522963333 525324478
1213.2 525324478 528795280 538054008 543295555 540446091 538376312 541894951 539852257 534616661
$$ packed form
1158.3A55961990K148896J934852L629055J962281M294643J0334434L525887M157543
1166A87949581K750816M663620O924057P424050P669620O592007R429226O019707Q502598
1174.6B47925282Q922748Q626080J0894069J0292931J2815800J3031826J2301559R751701
1182.4C34561996J0171967Q869095Q420410R946785N129662O180915R023781R223976
1190.1D01528587R562722N453376J157456M631882P833251Q240319R732284N265656
1197.8D53405533M694366P982559O771813O207466O389275M114494L568535O092300
1205.5D99226341M247513L143044N206642N783996J385498m82063M452362K361145
1213.2E25324478L470802R258728N241547k849464k069779L518639k042694n235596
$$ plain form
1220.9 534616661 535035820 539905319 545262070 546508026 547070465 546444473 547256050 549162598 547304306
1229.6 547304306 547848587 548883400 549055481 550227280 549763718 549264336 550030289 551308594 552446251
1238.3 552446251 554080200 554516487 553290138 554129524 556014061 555139160 556334648 562327957 564482994
1247 564482994 562221794 560922279 560442123 560446854 560432663 560536880 561762695 564239883 566329956 566643944
1256.6 566643944 567196884 568269539 567063980 567816353 571861534 571535416 568750343 568620567 570752106
1265.3 570752106 572558823 572317467 573364220 574909019 574714890 575507545 577286644 579496498 582909660
1274 582909660 585272408 585567932 586802788 590112839 593277817 596498566 599405975 600369263 601603851
1282.7 601603851 602417336 602631569 602940483 603459778 606336250 609976158 614037323 617938461 618769722
$$ packed form
1220.9E34616661M19159M869499N356751J245956N62439o25992Q11577J906548j858292
1229.6E47304306N44281J034813J72081J171799m63562m99382P65953J278305J137657
1238.3E52446251J633949M36287j226349Q39386J884537q74901J195488N993309K155037
1247E64482994k261200j299515m80156M731j4191J04217J225815K477188K090073L13988
1256.6E66643944N52940J072655j205559P52373M045181l26118k785073j29776K131539
1265.3E70752106J806717k41356J046753J544799j94129P92655J779099K209854L413162
1274E82909660K362748K95524J234856L310051L164978L220749K907409R63288J234588
1282.7F01603851Q13485K14233L08914N19295K876472L639908M061165L901138Q31261
$$ plain form
1291.3 618769722 617305222 617115898 618461723 620042000 624003944 628170853 630165138 630375252 631293411
1300 631293411 634207535 634304543 633029099 634240227 636988869 638227234 638374023 640367737 641712723
1308.7 641712723 641391907 641513596 642035522 643048325 644236603 643261108 643387680 645098190 645325012
1317.4 645325012 646367874 645815659 646364975 648123703 647527542 649273453 649473267 648218994 649060593
1326 649060593 649864349 651129990 649806595 648420029 651560822 655104141 656797714 657494659 654920883
1334.7 654920883 651399231 650635910 649923401 651338730 654084625 654384842 656141281 655701218 654163437
1343.4 654163437 655136185 656192932 656117325 654059906 652017746 650539093 650606537 650978699 650544510
1352.1 650544510 652754593 652242966 650665665 650905914 648464355 648236847 649286270 647829971 647327728
$$ packed form
1291.3F18769722j464500j89324J345825J580277L961944M166909J994285K10114R18159
1300F31293411K914124R7008j275444J211128K748642J238365J46789J993714J344986
1308.7F41712723l20816J21689N21926J012803J188278r75495J26572J710510K26822
1317.4F45325012J042862n52215N49316J758728n96161J745911J99814j254273Q41599
1326F49060593Q03756J265641j323395j386566L140793L543319J693573O96945k573776
1334.7F54920883l521652p63321p12509J415329K745895L00217J756439m40063j537781
1343.4F54163437R72748J056747p5607k057419k042160j478653O7444L72162m34189
1352.1F50544510K210083n11627j577301K40249k441559k27508J049423j456299n02243
$$ plain form
1360.8 647327728 649309921 648527145 646892014 648790054 647817154 645338516 642536697 638958740 639656715
1369.4 639656715 642205353 641513977 639611969 640523605 639157410 636715698 637323227 636677399 635435982
1378.1 635435982 634418030 633351517 632501907 631873894 630988655 631000137 631814270 634102058 637031631
1386.8 637031631 635196037 633190308 632342873 632123032 630528679 628857918 632229652 631728249 625747528
1395.5 625747528 622132187 621815224 625067062 623036766 620482140 620530548 619586067 618415489 620009422
1404.2 620009422 620613937 616924248 615535660 613160934 611540375 609367294 606924133 608391533
1411.9 608391533 608917274 607229424 604310493 603903122 604073448 601969376 601540337 600577049 598609200
1420.6 598609200 597064095 596542282 594391518 592132263 592550888 592197533 592205505 590310135 589055977
$$ packed form
1360.8F47327728J982193p82776j635131J898040r72900k478638k801819l577957O97975
1369.4F39656715K548638o91376j902008R11636j366195k441712O07529o45828j241417
1378.1F35435982j017952j066513q49610o28013q85239J1482Q14133K287788K929573
1386.8F37031631j835594k005729q47435k19841j594353j670761L371734n01403n980721
1395.5F25747528l615341l16963L251838k030296k554626M8408r44481j170578J593933
1404.2F20009422O04515l689689j388588k374726j620559k173081k443161J467400
1411.9F08391533N25741j687850k918931m07371J70326k104072m29039r63288j967849
1420.6E98609200j545105n21813k150764k259255M18625l53355P972j895370j254158
$$ plain form
1429.2 589055977 588384132 587730446 588942299 587047691 584608688 584739418 586719856 584637871 583828621
1437.9 583828621 588013000 588560486 585698624 583638916 585892258 587158318 584737053 585706024 587102013
1446.6 587102013 588641663 588729973 588679657 589404678 588845711 591834869 592943497 592176933 592893143
1455.3 592893143 593304214 597099190 598921890 600068016 601603317 602548218 603318062 605708656 610301247
1464 610301247 615431442 614718552 612618866 611265602 611923103 615660934 619357567 621847763 617179146
1472.6 617179146 616889725 624988670 628805580 631599808 632168808 634064293 637413445 640657425 642972260
1481.3 642972260 641049271 643374252 647102280 647811050 649522247 650359955 648801575 647736435 649135742
1490 649135742 650121384 649461823 650099792 650061798 650183029 649536896 645152206 645743790 645800323 646396332
$$ packed form
1429.2E89055977o71845o53686J211853j894608k439003J30730J980438k081985q09250
1437.9E83828621M184379N47486k861862k059708K253342J266060k421265R68971J395989
1446.6E87102013J539650Q8310n0316P25021n58967K989158J108628p66564P16210
1455.3E92893143M11071L794976J822700J146126J535301R44901P69844K390594M592591
1464F10301247N130195p12890k099686j353264O57501L737831L696633K490196m668617
1472.6F17179146k89421Q098945L816910K794228N69000J895485L349152L243980K314835
1481.3F42972260j922989K324981L728028P08770J711197Q37708j558380j065140J399307
1490F49135742R85642o59561O37969l7994J21231o46133m384690N91584N6533N96009
$$ plain form
1499.6 646396332 649635849 650762558 651090317 650448303 648612213 649255676 644315643 640582809 646366425
1508.3 646366425 646933746 644975815 645068741 645641098 642946167 643637238 645117035 644633713 645309525
1517 645309525 639916191 640951691 646376953 649132080 644644165 644312515 647866821 647716980 643053589
1525.7 643053589 641167297 638745041 638867645 642307587 643565979 642564240 643704224 645910568
1533.4 645910568 638759880 639072151 640882645 639922562 641091766 642501144 639454308 643031693 642793427
1542.1 642793427 638409424 640687943 643943176 640946198 639222298 639204178 641622925 642009201 638177567
1550.7 638177567 639806213 641363297 640558701 638835144 640748825 645005646 652202225 657221375
1558.5 657221375 643639374 641059189 647606964 651649323 651453400 651006393 652879028 653200912 653217926
$$ packed form
1499.6F46396332L239517J126709L27759o42014j836090O43463m940033l732834N783616
1508.3F46366425N67321j957931R2926N72357k694931O91071J479797m83322O75812
1517F45309525n393334J035500N425262K755127m487915l31650L554306j49841m663391
1525.7F43053589j886292k422256J22604L439942J258392j001739J139984K206344
1533.4F45910568p150688L12271J810494r60083J169204J409378l046836L577385k38266
1542.1F42793427m384003K278519L255233k996978j723900j8120K418747L86276l831634
1550.7F38177567J628646J557084q04596j723557J913681M256821P196579N019150
1558.5F57221375j3582001k580185O547775M042359j95923m47007J872635L21884J7014
$$ plain form
1567.1 653217926 652730255 652449188 650641022 650104446 650346069 650793915 653066406 655280991 655969315
1575.8 655969315 649066544 648496170 648027649 645485992 644722214 644377441 644738770 644233704 642845306
1584.5 642845306 640436020 639308319 638788071 634681396 630160828 625639877 624484024 623438454
1592.2 623438454 620798302 618727226 616611061 615616760 613858986 612835503 609631920 605458794
1599.9 605458794 602570572 600619049 598758125 594667358 592326317 589895554 587535973 584915276
1607.6 584915276 584234314 582969475 578580856 577160263 573695450 569990692 567694321 567947807 567145729
1616.3 567145729 558460693 559536400 559601021 558385773 555892868 555430794 554305649 548394051 546824036
1625 546824036 546751556 547655373 544445648 542040482 540430069 540138512 540454979 537590256 537410011
$$ packed form
1567.1F53217926m87671k81067j808166n36576K41623M47846K272491K214585O88324
1575.8F55969315o902771n70374m68521k541657p63778l44773L61329n05066j388398
1584.5F42845306k409286j127701n20248m106675m520568m520951j155853j045570
1592.2F23438454k640152k071076k116165r94301j757774j023483l203583m173126
1599.9F05458794k888222j951523j860924m090767k341041k430763k359581k620697
1607.6E84915276o80962j264839m388619j420593l464813l704758k296371K53486q02078
1616.3E67145729q685036J075707O4621j215248k492905m62074j125145n911598j570015
1625E46824036p2480R03817l209725k405166j610413k91557L16467k864723j80245
$$ plain form
1633.7 537410011 536432304 532734299 532601547 534195442 535070114 535749702 535923424 534271812 536124229
1642.4 536124229 535550117 536567001 541080513 540314598 535025253 531871948 535805817 539796028 544017220
1651 544017220 546386108 547647133 549562454 548233643 548775711 548752441 551321106 553962135 556106300
1659.7 556106300 557702599 560898933 563804817 562441978 565664177 567558289 569523277 571906395
1667.4 571906395 575245323 578016281 579181252 582979240 580961533 584305458 591135635 595113449
1675.1 595113449 592719002 592754784 596568260 600071716 602611389 605396423 610472603 615864258 621570549
1683.8 621570549 621264763 618379326 621418762 623573608 626881714 629494324 631933823 636289711
1691.5 636289711 639771881 643684235 647276764 650931549 648992233 653489227 659170380 663466568
$$ packed form
1633.7E37410011r77707l698005j32752J593895Q74672O79588J73722j651612J852417
1642.4E36124229n74112J016884M513512p65915n289345l153305L933869L990211M221192
1651E44017220K368888J261025J915321j328811N42068k3270K568665K641029K144165
1659.7E56106300J596299L196334K905884j362839L222199J894112J964988K383118
1667.4E71906395L338928K770958J164971L797988k017707L343925O830177L977814
1675.1E95113449k394447L5782L813476L503456K539673K785034N076180N391655N706291
1683.8F21570549l05786k885437L039436K154846L308106K612610K439499M355888
1691.5F36289711L482170L912354L592529L654785j939316M496994N681153M296188
$$ plain form
1699.3 663466568 672421112 667001343 669257584 672934418 676895523 680332184 683031693 685382919
1707 685382919 685176697 687544022 690406723 693974838 697706070 698503036 699573898 699332428 699635391
1715.6 699635391 705617142 712195129 704670105 703616028 707568130 709214401 710984955 712941055
1723.4 712941055 713163147 713790817 714124069 714216461 715974960 720240860 720456467 716930161 718535385
1732 718535385 721129227 724183960 719889374 719104919 722201004 724609451 727352753 726684723 723438644
1740.7 723438644 725622787 727852936 730984268 733810806 734872437 734710541 732580566 730403442
1748.4 730403442 734036713 741675110 745016861 743474503 745897903 748412704 750505600 752680817
1756.2 752680817 751244812 751054001 750886841 748419724 750075073 753321381 753531570 756322174 759339218
$$ packed form
1699.3F63466568Q954544n419769K256241L676834L961105L436661K699509K351226
1707F85382919k06222K367325K862701L568115L731232P96966J070862k41470L02963
1715.6F99635391N981751O577987p525024j054077L952102J646271J770554J956100
1723.4G12941055K22092O27670L33252R2392J758499M265900K15607l526306J605224
1732G18535385K593842L054733m294586p84455L096085K408447K743302o68030l246079
1740.7G23438644K184143K230149L131332K826538J061631j61896k129975k177124
1748.4G30403442L633271P638397L341751j542358K423400K514801K092896K175217
1756.2G52680817j436005j90811j67160k467117J655349L246308K10189K790604L017044
$$ plain form
1764.8 759339218 760275726 760522537 760529938 757868271 758973541 762078400 763235474 763181229 760262070
1773.5 760262070 761651764 762958450 762049789 763359909 764196930 765116730 763857498 762405167 765927048
1782.2 765927048 767464371 767074051 766699677 766092834 767967072 770150833 770617981 771104736 770315399
1790.9 770315399 769789047 767329178 765874176 769633484 771924667 771216965 771729050 774010620 774230576
1799.5 774230576 770532150 770498886 770971985 770495911 771781693 771379471 769596329 770374146 772351532
1808.2 772351532 774608536 776905441 776331482 775973969 775099411 773693695 774496536 776126938 777622223
1816.9 777622223 776234207 774067001 772910538 772929764 775477295 775765762 775591049 778247833 778029251
1825.6 778029251 776605453 778906708 782082520 781506119 776995392 777743835 779200745 779617004 780346832
$$ packed form
1764.8G59339218R36508K46811P401k661667J105270L104859J157074n4245k919159
1773.5G60262070J389694J306686r08661J310120Q37021R19800j259232j452331L521881
1782.2G65927048J537323l90320l74374o06843J874238K183761M67148M86755p89337
1790.9G70315399n26352k459869j455002L759308K291183p07702N12085K281570K19956
1799.5G74230576l698426l3264M73099m76074J285782m02222j783142P77817J977386
1808.2G72351532K257004K296905n73959l57513q74558j405716Q02841J630402J495285
1816.9G77622223j388016k167206j156463J9226K547531K88467j74713K656784k18582
1825.6G78029251j423798K301255L175812n76401m510727P48443J456910M16259P29828
$$ plain form
1834.3 780346832 779428406 779379196 779480362 778913422 779456177 779551926 780303116 779676666 781247482 785177994
1843.9 785177994 780977020 780243988 782057724 782816620 783096390 783319244 783109741 782452011 783583832
1852.6 783583832 784490509 783630371 781730957 780400314 780952835 781761780 781599655 782329712 783720856
1861.3 783720856 782370758 781335220 782523651 783990173 783694611 782132721 782736969 781743698 781556015
1869.9 781556015 784544907 785782394 785381470 785584335 785387955 784224854 784793015 784922943 784470444
1878.6 784470444 785065765 785743790 786749268 786583099 785722656 784497147 783373413 783032150 783184433
1887.3 783184433 784868774 786786499 786516037 785274429 785424957 786773224 788496246 788041229 784329453
1896 784329453 781959152 782081070 783792801 784841461 784952469 784882812 785150833 785330963 784957123 785876389
$$ packed form
1834.3G80346832r18426m9210J01166n66940N42755R5749P51190o26450J570816L930512
1843.9G85177994m200974p33032J813736P58896K79770K22854k09503o57730J131821
1852.6G83583832R06677q60138j899414j330643N52521Q08945j62125P30057J391144
1861.3G83720856j350098j035538J188431J466522k95562j561890O04248r93271j87683
1869.9G81556015K988892J237487m00924K02865j96380j163101N68161J29928m52499
1878.6G84470444N95321O78025J005478j66169q60443j225509j123734l41263J52283
1887.3G83184433J684341J917725k70462j241608J50528J348267J723022m55017l711776
1896G84329453k370301J21918J711731J048660J11008o9657K68021J80130l73840R19266
$$ plain form
1905.6 785876389 785665054 783917389 783294220 784059906 785005341 785735321 786313934 785306320 784826050
1914.3 784826050 784372940 784224930 784902649 783562012 784007187 785784912 786606827 785747452 784849930
1923 784849930 785862274 786425629 785471573 783760529 784408035 784524078 783351440 784449234 785697021
1931.7 785697021 785558014 785169678 786215439 786165848 784784012 784786301 784853745 783806686 782287521 782319641
1941.3 782319641 783578415 785583801 786661072 785499039 784276047 785015411 785757523 785438995 784965363
1950 784965363 783550339 784275055 786153412 784895782 784000244 784194565 784464417 784176865 783652573
1958.7 783652573 784168167 783806839 783042221 783229752 783819885 783942947 784825363 785560913 784489670
1967.3 784489670 784140396 783357239 781789932 782315674 784747467 785728378 784901886 784456558 783391800
$$ packed form
1905.6G85876389k11335j747665o23169P65686R45435P29980N78613j007614m80270
1914.3G84826050m53110j48010O77719j340637M45175J777725Q21915q59375q97522
1923G84849930J012344N63355r54056j711044O47506J16043j172638J097794J247787
1931.7G85697021j39007l88336J045761m9591j381836K289O7444j047059j519165L2120
1941.3G82319641J258774K005386J077271j162033j222992P39364P42112l18528m73632
1950G84965363j415024P24716J878357j257630q95538J94321K69852k87552n24292
1958.7G83652573N15594l61328p64618J87531N90133J23062Q82416P35550j071243
1967.3G84489670l49274p83157j567307N25742K431793R80911q26492m45328j064758
$$ plain form
1976 783391800 782072144 781814270 781983185 781360321 780603638 781785431 782720566 782926712 784097290
1984.7 784097290 783993988 783678055 783232956 780441818 779048615 778965225 778989105 779722977 779606171 779774628
1994.3 779774628 780199432 782074661 783303223 781728439 781219559 781091156 781435394 782710495 782478104
2003 782478104 781266174 781393814 782499771 781714783 780846252 781245499 781143951 781625595 781329651 777863312
2012.7 777863312 775414505 776856918 779254990 779918594 778533478 778437500 780035629 781362686 781311340
2021.3 781311340 779140625 778237076 779253159 779593887 779662552 780616913 780717392 779229584 778902893
2030 778902893 778861923 778220901 777421494 776014175 776231232 777537689 776210175 774192657 774437943
2038.7 774437943 775581284 777358627 778239746 777912979 778068619 777961273 776654968 774575195 775608826
$$ packed form
1976G83391800j319656k57874J68915o22864p56683J181793R35135K06146J170578
1984.7G84097290j03302l15933m45099k791138j393203q3390K3880P33872j16806J68457
1994.3G79774628M24804J875229J228562j574784n08880j28403L44238J275101k32391
2003G82478104j211930J27640J105957p84988q68531L99247j01548M81644k95944l466339
2012.7G77863312k448807J442413K398072O63604j385116r5978J598129J327057n1346
2021.3G81311340k170715r03549J016083L40728O8665R54361J00479j487808l26691
2030G78902893m0970o41022p99407j407319K17057J306457j327514k017518K45286
2038.7G74437943J143341J777343Q81119l26767J55640j07346j306305k079773J033631
$$ plain form
2047.4 775608826 777692947 777373962 777204514 776615677 775854874 776161575 776585617 777263260 778125763
2056.1 778125763 777138290 775607986 775368576 775646973 776618805 775992355 775413895 776045303 775043411
2064.7 775043411 773027954 772296906 774308090 775364075 775026932 774152985 772275772 772502670 772765503
2073.4 772765503 771909561 770894012 770284119 770523682 770153503 769833374 769814529 770213165 771332321
2082.1 771332321 771747818 770439224 769558868 769992294 769649582 768433151 766844330 766095200 767675095
2090.8 767675095 769656754 769565201 769295120 768981171 768480988 769115067 769203110 769949112 770448380 770579605
2100.4 770579605 770346909 769697189 771590500 771760788 771011963 770988770 769990540 769923935 770397415 770881653
2110.1 770881653 770028458 770508423 772065125 772053680 771751099 772061310 773939972 773788528 773033371
$$ packed form
2047.4G75608826K084121l18985j69448n88837p60803L06701M24042O77643Q62503
2056.1G78125763r87473j530304k39410K78397R71832o26450n78460O31408j001892
2064.7G75043411k015457p31048K011184J055985l37143q73947j877213K26898K62833
2073.4G72765503q55942j015549o09893K39563l70179l20129j8845L98636J119156
2082.1G71332321M15497j308594q80356M33426l42712j216431j588821p49130J579895
2090.8G67675095J981659r1553k70081l13949n00183O34079Q8043P46002M99268J31225
2100.4G70579605k32696o49720J893311J70288p48825k3193r98230o6605M73480M84238
2110.1G70881653q53195M79965J556702j1445l02581L10211J878662j51444p55157
$$ plain form
2118.7 773033371 773398666 773031235 773144531 772739334 772044067 771664124 772475739 773798065 773969421
2127.4 773969421 772136765 769788895 769713287 770164719 770917664 771240921 771837692 772270203 771180191
2136.1 771180191 771696930 771768341 771995468 772971649 772431335 771944199 772089386 773623657 774479675 773650742
2145.8 773650742 773758316 774100113 773462143 773145676 773135529 772993164 773400192 773889008 774464264 774675827
2155.4 774675827 774257278 773432159 773807526 775300903 774791336 774937744 775807343 774843292 775087967
2164.1 775087967 775883484 775247345 775332260 775422440 774340057 774109879 774342804 774166641 773161926 772828293
2173.7 772828293 773246841 772033920 772194672 773003922 773011932 773291473 772064590 771745605 773170319
2182.4 773170319 773720932 773723526 773183594 771653824 771218796 772191238 774109955 776141968 776431351
$$ packed form
2118.7G73033371L65295l67431J13296m05197o95267l79943Q11615J322326J71356
2127.4G73969421j832656k347870p5608M51432P52945L23257N96771M32511j090012
2136.1G71180191N16739P1411K27127R76181n40314m87136J45187J534271Q56018q28933
2145.8G73650742J07574L41797o37970l16467j0147j42365M07028M88816N75256K11563
2155.4G74675827m18549q25119L75367J493377n09567J46408Q69599r64051K44675
2164.1G75087967P95517o36139Q4915R0180j082383k30178K32925j76163j004715l33633
2173.7G72828293M18548j212921J60752Q09250Q010K79541j226883l18985J424714
2182.4G73170319N50613K594n39932j529770m35028R72442J918717K032013K89383
$$ plain form
2191.1 776431351 776147003 775350723 775551453 775767212 774964294 775750961 775720673 776062622 776639709 776170044
2200.7 776170044 776188583 775491791 775420532 775465775 776023865 778175964 778812180 777031250 776449127 778121567
2210.4 778121567 778857727 778424225 778264923 779571838 779370499 778250580 779196854 778479156 777724838
2219 777724838 777806473 777964706 779311523 779524307 778387299 777754517 778301239 778509140 778666611 778056412
2228.7 778056412 776759491 776760025 777352753 778938217 779475479 778403473 777097626 776267776 776377411
2237.4 776377411 776255112 776981201 777957153 778835831 778781281 777867203 778160248 778072968 778365631 777222672
2247 777222672 774580994 775472870 777401962 777993698 778242416 777853775 778483200 779869232 779499664
2255.7 779499664 778428268 777873459 777103348 776442032 776775513 778598709 780055008 778707047 776855392
$$ packed form
2191.1G76431351k84348p96280K00730K15759q02918P86667l0288L41949N77087m69665
2200.7G76170044J8539o96792p1259M5243N58090K152099O36216j780930n82123J672440
2210.4G78121567P36160m33502j59302J306915k01339j119919R46274p17698p54318
2219G77724838Q1635J58233J346817K12784j137008o32782N46722K07901J57471o10199
2228.7G78056412j296921N34N92728J585464N37262j072006j305847q29850J09635
2237.4G76377411j22299P26089R75952Q78678n4550r14078K93045q7280K92663j142959
2247G77222672k641678Q91876J929092N91736K48718l88641O29425J386032l69568
2255.7G79499664j071396n54809p70111o61316L33481J823196J456299j347961j851655
$$ plain form
2264.4 776855392 777470322 778469467 778054657 777942810 778715363 779467392 779756012 778868332 778087921 778397675
2274 778397675 777985001 777440872 777165146 777170639 777376862 777434158 778725586 778532715 776887665 776488571
2283.7 776488571 776759186 777473602 778249359 778554230 777573242 778246994 779881210 779563980 778803329
2292.3 778803329 777686310 778647766 779513626 778317108 777436142 776123657 775110397 775449448 777066650
2301 777066650 776503601 776314240 778185196 776913071 775756607 776701508 777140579 776281967 776326370 776749420
2310.7 776749420 775889740 776400223 775756683 774387436 774937286 775662231 773784409 770649719 771113358
2319.3 771113358 773120270 774971848 773284912 769281235 769158401 768750763 769471664 774150925 774956970
2328 774956970 771158752 770793762 774047394 776805878 774798737 771527939 773330307 774811401 774430923
$$ packed form
2264.4G76855392O14930R99145m14810j11847P72553P52029K88620q87680p80411L09754
2274G78397675m12674n44129k75726N493K06223N7296J291428j92871j645050l99094
2283.7G76488571K70615P14416P75757L04871r80988O73752J634216l17230p60651
2292.3G78803329j117019R61456Q65860j196518q80966j312485j013260L39051J617202
2301G77066650n63049j89361J870956j272125j156464R44901M39071q58612M4403M23050
2310.7G76749420q59680N10483o43540j369247N49850P24945j877822l134690M63639
2319.3G71113358K006912J851578j686936m003677j22834m07638P20901M679261Q06045
2328G74956970l798218l64990L253632K758484k007141l270798J802368J481094l80478
$$ plain form
2336.7 774430923 774223862 773175659 772374954 773191147 772703018 770409622 769594650 768478012 769775925
2345.4 769775925 774134445 777204361 776533585 774782028 776695023 778965454 777290955 775182724
2353.1 775182724 775972214 777306747 773545227 769918594 771229172 770621948 765308533 763998947 767277451
2361.8 767277451 769965363 770862274 770847244 770541077 771725311 775368271 774165497 774126434 777663269
2370.4 777663269 777202911 774552155 772904205 776458740 779749527 778604889 777495728 777557755 777816544
2379.1 777816544 779167404 781718521 781170807 780381851 781040497 780623245 781288910 782536240 783122025
2387.8 783122025 782389526 782813339 784117355 782597427 780503082 779811554 779651489 779043045 779838791
2396.5 779838791 780601044 780807495 781900558 780929184 781057434 783012848 782526550 780763397 780680313
$$ packed form
2336.7G74430923k07061j048203q00705Q16193m88129k293396q14972j116638J297913
2345.4G69775925M358520L069916o70776j751557J912995K270431j674499k108231
2353.1G75182724P89490J334533l761520l626633J310578o07224n313415j309586L278504
2361.8G67277451K687912Q96911j5030l06167J184234L642960j202774l9063L536835
2370.4G77663269m60358k650756j647950L554535L290787j144638j109161O2027K58789
2379.1G77816544J350860K551117n47714p88956O58646m17252O65665J247330N85785
2387.8G83122025p32499M23813J304016j519928k094345o91528j60065o08444P95746
2396.5G79838791P62253K06451J093063r71374J28250J955414m86298j763153q3084
$$ plain form
2405.2 780680313 780668335 779133835 778917007 779918671 781108398 781347427 781344223 781753845 780442963
2413.8 780442963 778731995 777841644 778827744 780802383 782300949 782966843 782192078 781524277 781309433
2422.5 781309433 781059647 779668350 779400406 781075211 780675659 779131317 778149109 777532578 777772064
2431.2 777772064 778796616 779421158 779358215 778885727 778670578 779155350 778771744 778177567 777573700 777873611
2440.8 777873611 779490204 778687134 776614609 776904831 778786163 779740906 779219971 778575668 778298416
2449.5 778298416 777246552 777011108 777964096 777867508 778604889 779248428 779008942 778159256 776644516
2458.2 776644516 777294540 777596664 776481171 776098938 776419373 776467743 775444717 774231949 773870697
2466.9 773870697 775193253 775769806 775257721 775229492 775646591 776362534 775862122 775487442 775748749 776356354
$$ packed form
2405.2G80680313j1978j534500k16828J001664J189727K39029l204M09622j310882
2413.8G80442963j710968q90351R86100J974639J498566O65894p74765o67801k14844
2422.5G81309433k49786j391297k67944J674805l99552j544342r82208o16531K39486
2431.2G77772064J024552O24542o2943m72488k15149M84772l83606n94177o03867K99911
2440.8G77873611J616593q03070k072525K90222J881332R54743n20935o44303k77252
2449.5G78298416j051864k35444R52988r6588P37381O43539k39486q49686j514740
2458.2G76644516O50024L02124j115493l82233L20435M8370j023026j212768l61252
2466.9G73870697J322556N76553n12085k8229M17099P15943n00412l74680K61307O07605
$$ plain form
2476.5 776356354 776831436 775395660 773202438 772824860 774128418 774211731 774085541 774502792 774961395
2485.2 774961395 775486450 775053558 774677429 773492203 772406769 773320923 774365311 773654785 772580719
2493.9 772580719 772886658 772993393 773086853 773016815 772281494 772018661 772685165 773497696 772876129 772102127
2503.5 772102127 772797394 772964249 770641479 769364624 770167084 771527557 772173386 770499115 770793381
2512.2 770793381 770615616 768860703 769423370 769741516 770425491 770782166 771056671 772048798 772162323
2520.9 772162323 771692505 770215378 769697495 770233078 770814056 770645294 769467087 769175186 769049530
2529.6 769049530 768544540 768425598 768277283 767379227 767136154 767912521 769214630 769805450 768106766
2538.2 768106766 767082443 768168564 769254684 768225708 767389832 768226089 768502045 768875809 768851242
$$ packed form
2476.5G76356354M75082j435776k193222l77578J303558Q3313j26190M17251M58603
2485.2G74961395N25055m32892l76129j185226j085434R14154J044388p10526j074066
2493.9G72580719L05939J06735R3460p0038p35321k62833O66504Q12531o21567p74002
2503.5G72102127O95267J66855k322770j276855Q02460J360473O45829j674271K94266
2512.2G70793381j77765j754913N62667L18146O83975L56675K74505R92127J13525
2520.9G72162323m69818j477127n17883N35583N80978j68762j178207k91901j25656
2529.6G69049530n04990j18942j48315q98056k43073P76367J302109N90820j698684
2538.2G68106766j024323J086121J086120j028976q35876Q36257K75956L73764k4567
$$ plain form
2546.9 768851242 769124222 769145966 767716446 767110977 767287827 767504959 767687607 767608871 766607056 766802979
2556.6 766802979 767979202 767159653 765748215 765067520 765054245 764651184 765480499 766656036 766047440
2565.2 766047440 766086502 766053543 766484451 766662903 765723343 765811081 765519180 763858109 762814331 764029236
2574.9 764029236 764709244 764507370 765244827 765601273 764576187 763033066 763624725 763783722 763841629
2583.6 763841629 765689087 765085983 764552460 764774094 763551254 763224258 763762054 765007095 764462433
2592.2 764462433 762196503 762054749 762744904 763821564 764275131 763174362 762364960 761520462 761536179
2600.9 761536179 762203369 762413559 761905518 760404510 759819717 760422134 761283875 761913376 762054825
2609.6 762054825 761079559 759568710 759603806 760600662 761080322 760768509 760821304 759941711 758117828 758680725
$$ packed form
2546.9G68851242K72980K1744j429520o05469J76850K17132J82648p8736j001815J95923
2556.6G66802979J176223q19549j411438o80695j3275m03061Q29315J175537o08596
2565.2G66047440L9062l2959M30908J78452r39560Q7738k91901j661071j043778J214905
2574.9G64029236O80008k01874P37457L56446j025086j543121N91659J58997N7907
2583.6G63841629J847458o03104n33523K21634j222840l26996N37796J245041n44662
2592.2G64462433k265930j41754O90155J076660M53567j100769q09402q44498J5717
2600.9G61536179O67190K10190n08041j501008n84793O02417Q61741O29501J41449
2609.6G62054825r75266j510849L5096R96856M79660l11813N2795q79593j823883N62897
$$ plain form
2619.3 758680725 759462357 758099976 757764587 759341888 758848419 757591400 758058243 758677292 758961411
2627.9 758961411 758097000 757814560 757439499 756662521 757344742 757919388 757509460 755754166 756384811
2636.6 756384811 757777634 756520538 756280212 756020050 756091995 756661453 755374374 754957733 755743866
2645.3 755743866 754658508 754982300 756890793 754928207 753305740 754155197 754264908 753391190 752637329
2654 752637329 753250198 752771378 752110825 753205185 753756104 752075729 751470032 753828201 753846664 751413574
2663.6 751413574 749551849 749072342 749467621 750425262 751990509 752582779 753287430 752699814 751283112
2672.3 751283112 751260834 751330414 751558380 750881805 749996719 749451370 748889999 748984985 749218750 749045258
2681.9 749045258 747799454 747416840 748385925 748419800 747781601 747633743 747465057 747486191 748289261 748420410
$$ packed form
2619.3G58680725P81632j362381l35389J577301m93469j257019M66843O19049K84119
2627.9G58961411q64411k82440l75061p76978O82221N74646m09928j755294O30645
2636.6G56384811J392823j257096k40326k60162P1945N69458j287079m16641P86133
2645.3G55743866j085358L23792J908493j962586j622467Q49457J09711q73718p53861
2654G52637329O12869m78820o60553J094360N50919j680375o05697K358169J8463k433090
2663.6G51413574j861725m79507L95279R57641J565247N92270P04651n87616j416702
2672.3G51283112k2278O9580K27966o76575q85086n45349n61371R4986K33765j73492
2681.9G49045258j245804l82614R69085L3875o38199j47858j68686K1134Q03070J31149
$$ plain form
2691.6 748420410 747771912 747027740 746951675 747639771 747996140 748190155 748164368 747288666 746339722 746705704
2701.2 746705704 746247177 744862289 744371185 743259125 743555527 745424881 744893112 743815308 744616928
2709.9 744616928 744987488 745074234 744790573 742647247 741453629 742011108 742810287 742878571 742728729 742821121
2719.5 742821121 741672058 741408310 742775421 743300018 742317276 741745682 742113876 741722260 741460876
2728.2 741460876 740831909 740182953 740654373 740747604 740200195 739357605 739024429 738332138 738026581 739692154
2737.9 739692154 739573059 737609253 736990051 737515335 738776245 738531265 736837234 737160950 738359299
2746.5 738359299 738220673 737384338 737654114 737888184 736747589 735633240 734982147 735785522 735583801
2755.2 735583801 734270401 733812561 732960968 733908768 734757538 733951950 733257904 732820435 732888260 733082809
$$ packed form
2691.6G48420410o48498p44172p6065O88096L56369J94015k5787q75702r48944L65982
2701.2G46705704m58527j384888m91104j112060K96402J869354n31769j077804Q01620
2709.9G44616928L70560Q6746k83661k143326j193618N57479P99179O8284j49842R2392
2719.5G42821121j149063k63748J367111N24597r82742n71594L68194l91616k61384
2728.2G41460876o28967o48956M71420R3231n47409q42590l33176o92291l05557J665573
2737.9G39692154j19095j963806o19202N25284J260910k44980j694031L23716J198349
2746.5G38359299j38626q36335K69776K34070j140595j114349o51093Q03375k01721
2755.2G35583801j313400m57840q51593R47800Q48770q05588o94046m37469O7825J94549
$$ plain form
2764.9 733082809 734710770 734630051 731917191 731026535 732069550 732627335 731982574 732360077 732319946
2773.5 732319946 731207123 731039734 730855637 730168228 729366226 729308243 729693756 729762726 728774185 727489090
2783.2 727489090 727558746 727846069 726739731 725963287 727694244 727120590 725435867 727857361 728367233
2791.9 728367233 725790634 724704285 724157791 723574677 723575439 723490677 723304977 722744522 721958847 721453705
2801.5 721453705 721356354 722257156 722324219 721542206 720018768 718267136 719008331 719812546 718587875
2810.2 718587875 715692673 714576874 715973053 715871124 715036621 714239426 714680634 714942856 713739624
2818.9 713739624 714330521 715499039 714611588 711939774 711092758 711821823 711564941 711519012 711277618
2827.6 711277618 711665573 712095184 710741043 708945007 706948624 705732193 705934677 705877380 706213531
$$ packed form
2764.9G33082809J627961q0719k712860q90656J043015N57785o44761L77503m0131
2773.5G32319946j112823j67389j84097o87409q02002n7983L85513O8970r88541j285095
2783.2G27489090O9656K87323j106338p76444J730957n73654j684723K421494N09872
2791.9G28367233k576599j086349n46494n83114P62q4762j85700n60455p85675n05142
2801.5G21453705r7351R00802O7063p82013j523438j751632P41195Q04215j224671
2810.2G18587875k895202j115799J396179j01929q34503p97195M41208K62222j203232
2818.9G13739624N90897J168518q87451k671814q47016P29065k56882m5929k41394
2827.6G11277618L87955M29611j354141j796036j996383j216431K02484n7297L36151
$$ plain form
2836.2 706213531 706516953 704910278 703081665 702477341 702024994 700443726 698632660 696248703 693808670
2844.9 693808670 693662567 693072815 690783005 687680817 684997559 683233719 681949005 681975861 681419983
2853.6 681419983 681745758 682309036 681606140 681458359 680722656 680575333 681226273 681986771 681322632 680384369
2863.2 680384369 680043259 677762985 677400894 677910004 677296906 676571732 675273743 675429153 674686661
2871.9 674686661 672833405 673087616 674078064 672396774 670536652 671511841 672191467 672120361 671477966
2880.6 671477966 670586395 669585648 668878250 669584579 669220276 668040695 666835022 666684113 667631149
2889.3 667631149 666702423 665554352 665494919 665363312 664836578 664485474 664033661 661495209 658938370
2897.9 658938370 658959503 659197388 658519821 657184906 655411148 655662766 656254730 654741898 654149399
$$ packed form
2836.2G06213531L03422j606675j828613o04324m52347j581268j811066k383957k440033
2844.9F93808670j46103n89752k289810l102188k683258j763840j284714K6856n55878
2853.6F81419983L25775N63278p02896j47781p35703j47323O50940P60498o64139r38263
2863.2F80384369l41110k280274l62091N09110o13098p25174j297989J55410p42492
2871.9F74686661j853256K54211R90448j681290j860122R75189O79626p1106o42395
2880.6F71477966q91571j000747p07398P06329l64303j179581j205673j50909R47036
2889.3F67631149r28726j148071n9433j31607n26734l51104m51813k538452k556839
2897.9F58938370K1133K37885o77567j334915j773758K51618N91964j512832n92499
$$ plain form
2906.6 654149399 654051437 652462311 652163696 652430954 650908890 650128174 650209351 648945999 646652145
2915.3 646652145 645784225 645629501 644153976 642569275 640567856 640141907 640621719 641014938 642020645
2924 642020645 640681381 640261688 639994621 640048676 641307220 639725037 640126953 641807709 642775421
2932.7 642775421 643757629 643417206 643663559 643463821 643087311 642593384 643178940 645586090 646527557
2941.3 646527557 646440964 646140976 646455307 647253799 647762833 648156738 647751694 647547836 647272644 646142273
2951 646142273 645599365 645281219 644430389 644140091 644131775 644711075 645362778 644595032 643944550 643667297
2960.6 643667297 643450851 642994690 642801743 643577271 644639282 646478729 647254791 647822647 649842987
2969.3 649842987 650510635 650185089 650570602 651420517 652121964 652828598 653686142 654177322 654212036 654282990
$$ packed form
2906.6F54149399r7962j589126k98615K67258j522064p80716Q1177j263352k293854
2915.3F46652145q67920j54724j475525j584701k001419m25949M79812L93219J005707
2924F42020645j339264m19693k67067N4055J258544j582183M01916J680756R67712
2932.7F42775421R82208l40423K46353j99738l76510m93927N85556K407150R41467
2941.3F46527557q6593k99988L14331P98492N09034L93905m05044k03858k75192j130371
2951F46142273n42908l18146q50830k90298q316N79300O51703p67746o50482k77253
2960.6F43667297k16446m56161j92947P75528J062011J839447P76062N67856K020340
2969.3F49842987O67648l25546L85513Q49915P01447P06634Q57544M91180L4714P0954
$$ plain form
2979 654282990 655163116 656185226 656589203 656964493 658178101 660030212 661351852 661712875 661743927
2987.6 661743927 662025528 662279358 662784729 664073792 666026840 666905289 665397873 664450150 665959320
2996.3 665959320 666819916 665282593 664448090 665759506 667131271 667425537 666471329 665332031 665266113
3005 665266113 664811020 663696365 664601898 665794983 664698715 664895782 667130508 667500916 666605606
3013.7 666605606 666647034 666345596 666484146 666730728 665132828 664423065 664613953 663913651 662990570 661867752
3023.3 661867752 661907349 663361588 663360291 661319427 660617752 662502594 663201523 660803833 658796692
3032 658796692 657850800 657644882 658769608 658115692 657382355 657383804 656947174 658319855 658896866 658208313
3041.6 658208313 657713089 657494812 657166061 654521561 652398376 652515030 653045578 653430328 652859802
$$ packed form
2979F54282990Q80126J022110M03977L75290J213608J852111J321640L61023L1052
2987.6F61743927K81601K53830N05371J289063J953048Q78449j507416r47723J509170
2996.3F65959320Q60596j537323q34503J311416J371765K94266r54208j139298o5918
3005F65266113m55093j114655R05533J193085j096268J97067K234726L70408q95310
3013.7F66605606M1428l01438J38550K46582j597900p09763J90888p00302r23081j122818
3023.3F61867752L9597J454239j297k040864p01675J884842O98929k397690k007141
3032F58796692r45892k05918J124726o53916p33337J449m36630J372681N77011o88553
3041.6F58208313m95224k18277l28751k644500k123185J16654N30548L84750n70526
$$ plain form
3050.3 652859802 651672440 651305313 650914459 649595718 649589539 649663086 649144211 648769836 647103577 647033386
3060 647033386 647966843 647599640 646659927 645236664 646098328 647720184 647549820 646777039 645055161
3068.6 645055161 644338608 644304276 642602615 642244263 643309326 642658997 641926117 642579346 642923279
3077.3 642923279 642016373 641195450 641558075 640813751 639352608 639149323 637971535 637625008 638768272
3086 638768272 638354950 637739105 636761131 636003036 635909348 635773430 636650162 636076012 634575539 633705177
3095.6 633705177 633202896 634007759 634567337 633916245 632397766 631665459 630219841 627458458 627694893
3104.3 627694893 628723717 629080811 630278320 630054512 628512611 627166367 626971207 627108498 625643539
3113 625643539 624837112 625346375 624709625 623927650 623237762 622152100 621680107 621000175 619415627 617632141
$$ packed form
3050.3F52859802j187362l67127l90854j318741o179P3547n18875l74375j666259p0191
3060F47033386R33457l67203r39713j423263Q61664J621856j70364p72781j721878
3068.6F45055161p16553l4332j701661l58352J065063o50329p32880O53229L43933
3077.3F42923279r06906q20923L62625p44324j461143k03285j177788l46527J143264
3086F38768272m13322o15845r77974p58095r3688j35918Q76732n74150j500473q70362
3095.6F33705177n02281Q04863N59578o51092j518479p32307j445618k761383K36435
3104.3F27694893J028824L57094J197509k23808j541901j346244j95160J37291j464959
3113F25643539q06427N09263o36750p81975o89888j085662m71993o79932j584548j783486
$$ plain form
3122.6 617632141 617313499 617404594 616770630 616782112 615942230 614607925 614351921 613492432 612771492 613344612
3132.3 613344612 613535538 613560371 613149529 610720253 608864098 608855515 608857803 607345047 605049477 605625648
3141.9 605625648 607125397 606569748 605011177 603244438 604150696 605268822 602782173 600584717 599321060
3150.6 599321060 598443871 598768387 597840843 596906738 596841583 595095673 592643356 591881752 593067818
3159.3 593067818 593582153 592347603 591556892 590736618 588822670 587899246 588032722 587004700 585463409
3168 585463409 584937019 585379028 586168671 586268044 584471779 582333221 581664314 580584946 579378166
3176.6 579378166 578824234 578194427 577554398 576390266 575744095 575710373 575377769 574759293 573772049 572596817
3186.3 572596817 571481133 570109558 568005524 566960831 566937561 567006569 567393456 567084351 565665283
$$ packed form
3122.6F17632141l18642R1095o33964J1482q39882j334305k56004q59489p20940N73120
3132.3F13344612J90926K4833m10842k429276j856155q583K288j512756k295570N76171
3141.9F05625648J499749n55649j558571j766739R06258J118126k486649k197456j263657
3150.6E99321060q77189L24516r27544r34105o5155j745910k452317p61604J186066
3159.3E93067818N14335j234550p90711q20274j913948r23424J33476j028022j541291
3168E85463409n26390M42009P89643R9373j796265k138558o68907j079368j206780
3176.6E79378166n53932o29807o40029j164132o46171l3722l32604o18476r87244j175232
3186.3E72596817j115684j371575k104034j044693k3270O9008L86887l09105j419068
$$ plain form
3195 565665283 563860283 563482475 562271118 560228386 560075035 560447388 560956421 559506645 558235435
3203.6 558235435 558390770 557282372 556805382 555397835 553973465 554451714 553734665 551318626 549363365
3212.3 549363365 549298325 549347267 548641129 547677498 546376915 545594215 545499496 544883537 544553261 544997482
3222 544997482 542733307 539465408 538874779 539644661 539254990 538263588 538782463 538645058 538119431 537571259
3231.6 537571259 535713959 533748131 532956619 534407234 534292717 532455673 531832848 531418419 531350021
3240.3 531350021 529643631 528116951 528527908 526592751 524424553 525476990 525733681 524059525 522830200
3249 522830200 522599411 523076172 521750488 519392090 518356018 518494186 520161972 520512581 519194794
3257.7 519194794 518474655 518202553 518225060 517675209 517142410 516379623 514244766 512137451 511745262
$$ packed form
3195E65665283j805000l77808j211357k042732j53351L72353N09033j449776j271210
3203.6E58235435J55335j108398m76990j407547j424370M78249p17049k416039j955261
3212.3E49363365o5040M8942p06138r63631j300583p82700r4719o15959l30276M44221
3222E44997482k264175l267899n90629P69882l89671r91402N18875j37405n25627n48172
3231.6E37571259j857300j965828p91512J450615j14517j837044o22825m14429o8398
3240.3E31350021j706390j526680M10957j935157k168198J052437K56691j674156j229325
3249E22830200k30789M76761j325684k358398j036072J38168J667786L50609j317787
3257.7E19194794p20139k72102K2507n49851n32799p62787k134857k107315l92189
$$ plain form
3266.3 511745262 512671738 513705292 513827248 511287537 508644638 508698692 509050179 508483696 507180061
3275 507180061 506316910 506077881 505571938 505935402 505422821 503422432 502638206 502627220 503000183 503971062
3284.7 503971062 504342613 502693825 501051559 501052780 499384651 498380470 499312439 499040108 498770447
3293.3 498770447 497704887 496668282 496235886 495314064 495370102 495685768 496065063 495743217 494776573
3302 494776573 493248978 491183624 491311150 491828537 491419983 490812683 490228882 490158424 489014854 487547264
3311.7 487547264 486876564 486343498 485535545 484615936 483876915 484058342 485287628 484834404 483560524
3320.3 483560524 482862816 481301498 479806709 477803459 475545692 474869041 474350319 473123093 472526703
3329 472526703 472923241 472705193 471783829 471969261 472433853 471373596 469242287 467838326 467670746
$$ packed form
3266.3E11745262R26476J033554J21956k539711k642899N4054L51487n66483j303635
3275E07180061q63151k39029n05943L63464n12581k000389p84226j0986L72963R70879
3284.7E03971062L71551j648788j642266J221j668129j004181R31969k72331k69661
3293.3D98770447j065560j036605m32396r21822N6038L15666L79295l21846r66644
3302D94776573j527595k065354J27526N17387m08554o07300n83801p0458j143570j467590
3311.7D87547264o70700n33066q07953r19609p39021J81427J229286m53224j273880
3320.3D83560524o97708j561318j494789k003250k257767o76651n18722j227226n96390
3329D72526703L96538k18048r21364J85432M64592j060257k131309j403961j67580
$$ plain form
3337.7 467670746 466662140 465618019 465725021 464421959 462502632 461209641 460408936 460900574 460428543
3346.4 460428543 458085480 456091003 455102081 454351273 453811150 453413849 452828979 452535782 451311455
3355.1 451311455 449055862 447868500 446882515 445644913 446160889 446820717 445456467 444258842 442964439
3363.7 442964439 441356201 441585197 441550674 439472885 437101402 436690903 436652451 434859848 434204559
3372.4 434204559 434514847 433635979 431742554 429669571 429752502 430707550 430378265 429732971 427753296
3381.1 427753296 425044174 424169769 423719330 423378029 423783455 422667427 421565247 422493401 423833160
3389.8 423833160 423924217 422127419 420772858 420666237 420128860 419451942 418456154 416532173 415846481
3398.4 415846481 417136879 416781197 415151100 414051743 413166351 413815804 414415512 414158287 413731766
$$ packed form
3337.7D67670746j008606j044121J07002j303062j919327j292991q00705M91638m72031
3346.4D60428543k343063j994477r88922p50808n40123l97301n84870k93197j224327
3355.1D51311455k255593j187362r85985j237602N15976O59828j364250j197625j294403
3363.7D42964439j608238K28996l4523k077789k371483m10499l8452j792603o55289
3372.4D34204559L10288q78868j893425k072983Q2931R55048l29285o45294j979675
3381.1D27753296k709122q74405m50439l41301M05426j116028j102180R28154J339759
3389.8D23833160R1057j796798j354561j06621n37377o76918r95788j923981o85692
3398.4D15846481J290398l55682j630097j099357q85392O49453N99708k57225m26521
$$ plain form
3407.1 413731766 412974281 411774673 410394897 410928040 411072235 409936523 409846649 409380836 408656120
3415.8 408656120 408509712 408881645 409308586 410441589 411660995 409723320 408232727 408711052 408218651
3424.5 408218651 408254662 408597832 408898354 409662933 409242210 409001122 408549004 407662621 409135323 410494766
3434.1 410494766 409806137 408742943 408030319 407899704 408477135 408968124 409297371 409718742 408447914
3442.8 408447914 408227005 409523087 410412483 411934662 411312408 411048622 411769371 412414589 414599190
3451.5 414599190 414715309 414193382 414719696 415525932 415719414 415370865 417047768 417895050 417646217
3460.2 417646217 418451729 420141220 420275040 419765320 421318245 421541252 422208252 422835236 423028069
3468.8 423028069 425377426 425354958 424416351 424968147 426497765 428997688 429881783 429037628 428096886
$$ packed form
3407.1D13731766p57485j199608j379776N33143J44195j135712q9874m65813p24716
3415.8D08656120j46408L71933M26941J133003J219406j937675j490593M78325m92401
3424.5D08218651L6011L43170L00522P64579m20723k41088m52118q86383J472702J359443
3434.1D10494766o88629j063194p12624j30615N77431M90989L29247M21371j270828
3442.8D08447914k20909J296082Q89396J522179o22254k63786P20749O45218K184601
3451.5D14599190J16119n21927N26314Q06236J93482l48549J676903Q47282k48833
3460.2D17646217Q05512J689491J33820n09720J552925K23007O67000O26984J92833
3468.8D23028069K349357k2468r38607N51796J529618K499923Q84095q44155r40742
$$ plain form
3477.5 428096886 428261108 429454994 430976715 432657204 434180984 433602180 433739738 435965004 435864677
3486.2 435864677 436452522 437352791 436209869 437687874 440049171 440824852 441687012 443128815 443467178
3494.9 443467178 443579254 444733009 444641571 443762474 443899384 445823479 448412323 448962364 446945457
3503.6 446945457 446764908 449683495 451822510 453476105 455706940 456197739 454909554 455234222 456974525
3512.2 456974525 458421326 459361382 459223099 459767838 460808296 461027489 462873573 465146332 466607323
3520.9 466607323 468776054 469264107 467575569 467995071 470533600 472565002 472705460 473085060 474426727
3529.6 474426727 474988708 475115700 475609093 477030869 478290520 480386505 482368126 481469002 482214165
3538.3 482214165 483968010 485044899 486891441 488363991 489269676 490639229 490900726 488529778 489247742
$$ packed form
3477.5D28096886J64222J193886J521721J680489J523780n78804J37558K225266j00327
3486.2D35864677N87845R00269j142922J478005K361297P75681Q62160J441803L38363
3494.9D43467178J12076J153755r1438q79097J36910J924095K588844N50041k016907
3503.6D46945457j80549K918587K139015J653595K230835M90799j288185L24668J740303
3512.2D56974525J446801R40056j38283N44739J040458K19193J846084K272759J460991
3520.9D66607323K168731M88053j688538M19502K538529K031402J40458L79600J341667
3529.6D74426727N61981J26992M93393J421776J259651K095985J981621q99124P45163
3538.3D82214165J753845J076889J846542J472550R05685J369553K61497k370948P17964
$$ plain form
3547 489247742 492918129 496132011 498446159 499182243 500587463 500731087 502131653 504298859 503409386
3555.6 503409386 504506340 507573357 509198265 509747543 510329857 510839081 513718796 515868301 514450531
3564.3 514450531 517318840 519328728 520535278 523730927 522211876 524066010 526538696 528214188
3572 528214188 529668007 531204185 533355980 534150085 536282997 537115974 538122139 540846939 541565208
3580.7 541565208 542637711 545825081 547813072 547738838 552274742 555964203 553088608 553491020 554501953
3589.4 554501953 557835350 560869408 564033508 565977859 565619240 569601860 570668869 571559105 573403015
3598.1 573403015 573282433 577498169 580422020 581579971 583647995 584701347 586897545 590447769
3605.8 590447769 593582954 592873039 593709679 593733063 594860497 603116341 607197113 605239983 608083725
$$ packed form
3547D89247742L670387L213882K314148P36084J405220J43624J400566K167206q89473
3555.6E03409386J096954L067017J624908N49278N82314N09224K879715K149505j417770
3564.3E14450531K868309K009888J206550L195649j519051J854134K472686J675492
3572E28214188J453819J536178K151795P94105K132912Q32977J006165K724800P18269
3580.7E41565208J072503L187370J987991p4234M535904L689461k875595M02412J010933
3589.4E54501953L333397L034058L164100J944351l58619L982620J067009Q90236J843910
3598.1E73403015j20582M215736K923851J157951K068024J053352K196198L550224
3605.8E90447769L135185p09915Q36640K3384J127434Q255844M080772j957130K843742
$$ plain form
3614.5 608083725 607017479 610081940 616086121 617818985 620903664 620046158 618975372 621413383
3622.2 621413383 622797661 624769135 628841553 631979446 632082863 637628784 645878296 637056351
3629.9 637056351 635395889 638725662 645599899 648749084 645929642 648160706 652354202 655538635
3637.6 655538635 655987701 656963806 659098587 661388702 663621063 663440704 664813614 669673157 676865158
3646.3 676865158 677069550 673336868 678531799 679487000 677286301 675003738 678648300 682711105 686541595
3655 686541595 693689499 687125626 685811157 691261139 692625580 694614563 695155487 695497894 696468124
3663.6 696468124 697567825 698601761 698455353 702650452 707614441 708972702 708265610 698335724 698322067
3672.3 698322067 707591248 719985428 724626770 704958115 701792297 708214264 714717484 712376022
$$ packed form
3614.5F08083725j066246L064461O004181J732864L084679q57506j070786K438011
3622.2F21413383J384278J971474M072418L137893J03417N545921Q249512q821945
3629.9F37056351j660462L329773O874237L149185k819442K231064M193496L184433
3637.6F55538635M49066R76105K134781K290115K232361j80359J372910M859543P192001
3646.3F76865158K04392l732682N194931R55201k200699k282563L644562M062805L830490
3655F86541595P147904o563873j314469N449982J364441J988983N40924L42407R70230
3663.6F96468124J099701J033936j46408M195099M963989J358261p07092r929886j3657
3672.3F98322067R269181J2394180M641342j9668655l165818O421967O503220k341462
$$ plain form
3680 712376022 711142044 714471588 715647812 715959930 715818481 716449814 720857010 729501877 722673721
3688.7 722673721 714647064 725171280 721189194 716961365 720914612 719000320 719262619 721193314
3696.4 721193314 722026520 722551422 723348618 726988907 731077652 727976990 722911758 725977173 729281464
3705.1 729281464 730379639 729046326 729473572 733504028 727555389 732282791 738420181 724757919
3712.8 724757919 727799911 733245773 735254974 735216827 735714569 737205429 733439713 732972336 739852829
3721.5 739852829 738949814 732549362 736843338 738440933 737195129 734346619 733828659 738107300 737659225
3730.2 737659225 741792984 743486404 735862198 743346252 749745941 740900955 734887543 735480042
3737.9 735480042 734135056 735059433 739189529 734973068 736719284 751810379 753040695 732845383
$$ packed form
3680G12376022j233978L329544J176224L12118j41449O31333M407196Q644867o828156
3688.7G22673721q026657J0524216l982086m227829L953247j914292K62299J930695
3696.4G21193314Q33206N24902P97196L640289M088745l100662n065232L065415L304291
3705.1G29281464J098175j333313M27246M030456n948639M727402O137390j3662262
3712.8G24757919L041992N445862K009201l8147M97742J490860l765716m67377O880493
3721.5G39852829r03015o400452M293976J597595j245804k848510n17960M278641m48075
3730.2G37659225M133759J693420p624206P484054O399689q844986o013412N92499
3737.9G35480042j344986R24377M130096m216461J746216J5091095J230316k0195312
$$ plain form
3745.6 732845383 740119171 745677719 753296432 750514450 733121490 744660110 743731613 732948227
3753.3 732948227 738435364 742621765 744860382 739030457 740706787 747364731 741274109 739451218
3761 739451218 743298340 743093948 742350464 747134399 745588913 738242645 740245438 745518951 746847000
3769.7 746847000 740308456 741553345 744910812 745171051 743753662 742695236 744709549 745058823 747590866
3778.4 747590866 749121628 743257141 743387070 742712784 743416214 746615829 744230118 742986755 745130234
3787.1 745130234 746147461 744800491 744352264 745931396 744696655 742889633 742688751 744622803 748907089
3795.8 748907089 746258850 741554565 742896118 746309052 754126511 751512299 739051056 742139053
3803.5 742139053 743568192 746180191 750599670 741576157 737003632 741940765 744807587 744644547
$$ packed form
3745.6G32845383P273788N558548P618713k781982j7392960J1538620r28497j0783386
3753.3G32948227N487137M186401K238617n829925J676330O657944o090622j822891
3761G39451218L847122k04392p43484M783935j545486p346268K002793N273513J328049
3769.7G46847000o538544J244889L357467K60239j417389j058426K014313L49274K532043
3778.4G47590866J530762n864487J29929o74286P03430L199615k385711j243363K143479
3787.1G45130234J017227j346970m48227J579132j234741j807022k00882J934052M284286
3795.8G48907089k648239m704285J341553L412934P817459k614212j2461243L087997
3803.5G42139053J429139K611999M419479r023513m572525M937133K866822j63040
$$ plain form
3811.2 744644547 744195404 743271484 744489670 752031097 753364792 738973389 741810989 747404404
3818.9 747404404 752495880 758676682 743725967 739922180 745332718 745341721 746517410 750041199 746854401
3827.6 746854401 744977036 744578094 748313141 752070465 739439850 740700684 751155090 746395569
3835.3 746395569 742657700 750857544 749924316 744518509 751009293 747372131 742733536 747016373
3843 747016373 745210114 742710876 745807800 746250687 745835571 747714920 746271667 747339325 752899780
3851.7 752899780 750580292 752843552 736767120 736379700 747591324 747162018 743808746 743724136 744600067
3860.4 744600067 748833160 744735031 742927399 749677887 746884613 741933441 744059219 748616714
3868.1 748616714 757800827 753042755 739666443 740428238 746145554 753124542 743562317 739744186
$$ packed form
3811.2G44644547m49143r23920J218186P541427J333695j4391403K837600N593415
3818.9G47404404N091476O180802j4950715l803787N410538R003J175689L523789l186798
3827.6G46854401j877365l98942L735047L757324j2630615J260834J0454406m759521
3835.3G46395569l737869Q199844r33228n405807O490784l637162m638595M282837
3843G47016373j806259k499238L096924M42887m15116J879349j443253J067658N560455
3851.7G52899780k319488K263260j6076432l87420J1211624m29306l353272q4610Q75931
3860.4G44600067M233093m098129j807632O750488k793274m951172K125778M557495
3868.1G48616714R184113m758072j3376312P61795N717316O978988r562225l818131
$$ plain form
3875.8 739744186 743158646 743084259 744865494 749434586 745789566 738046875 743244171 745070801 745347824
3884.5 745347824 750505600 741968384 742432022 744511642 744636917 750267792 750140152 741773148 741731415
3893.2 741731415 746547089 745427399 743182678 744631577 748125305 749662323 740250778 743881226
3900.9 743881226 745849915 741862488 748976746 746945267 743999939 743090744 742735519 746076431 746175919
3909.6 746175919 746548386 746903915 746355438 745757980 745094528 745533524 745301971 743615875 742349777
3918.2 742349777 745618362 746099319 744052277 747578125 749189529 749255371 746281052 742010193 744906311
3926.9 744906311 747072601 746467667 745173111 744402847 745742950 743664398 741926193 743840790 744324570
3935.6 744324570 744936295 747108459 747747421 746524124 744774857 745857925 749103165 745216293 741157761
$$ packed form
3875.8G39744186L414460p4387J781235M569092l645020p742691N197296J826630K77023
3884.5G45347824N157776q537216M63638K079620J25275N630875j27640q367004m1733
3893.2G41731415M815674j119690k244721J448899L493728J537018r411545L630448
3900.9G43881226J968689l987427P114258k031479k945328r09195l55225L340912R9488
3909.6G46175919L72467L55529n48477n97458o63452M38996k31553j686096j266098
3918.2G42349777L268585M80957k047042L525848J611404O5842k974319m270859K896118
3926.9G44906311K166290o04934j294556p70264J340103k078552j738205J914597M83780
3935.6G44324570O11725K172164O38962j223297j749267J083068L245240l886872m058532
$$ plain form
3944.3 741157761 742111893 743900757 746356201 744235077 742679520 742211075 739775848 744065781 746437531
3953 746437531 744476318 744182434 743199463 744506073 745435181 744746094 744280853 744309921 745143967 744050522
3962.6 744050522 744734344 746658859 746324692 744760818 742712936 742079391 741341400 741791229 744709702
3971.3 744709702 745047684 744630432 745603485 745003967 743320541 742200928 742470245 741974411 741340179
3980 741340179 743105850 744474411 744149323 743904495 744256439 743464890 743212204 743784409 742997894 743242950
3989.6 743242950 743156433 743266907 743314209 741562576 742563782 744524841 744240036 743424606 744360199
3998.3 744360199 746262512 746669540
4000.2 746669540
$$ packed form
3944.3G41157761R54132J788864K455444k121124j555557m68445k435227M289933K371750
3953G46437531j961213k93884r82971J306610R29108o89087m65241K9068Q34046j093445
3962.6G44050522O83822J924515l34167j563874k047882o33545p37991M49829K918473
3971.3G44709702L37982m17252R73053n99518j683426j119613K69317m95834o34232
3980G41340179J765671J368561l25088k44828L51944p91549k52686N72205p86515K45056
3989.6G43242950q6517J10474M7302j751633J001206J961059k84805q15430R35593
3998.3G44360199J902313M07028
4000.2G46669540
##END=$$ End of the data block
