##TITLE=$$ Begin of the data block
##JCAMP-DX=5.00 $$ ACD/SpecManager v 10.08
##SPECTROMETER/DATA SYSTEM=Varian
##DATE=07 Jan 2013 10:17:48
##DATA TYPE=INFRARED SPECTRUM
##DATA CLASS=XYDATA
##ORIGIN=
##OWNER=
##NPOINTS=3735
##FIRSTX=399.26403809
##LASTX=4000.35498047
##MAXX=4000.35498047
##MINX=399.26403809
##MAXY=70.40434265
##MINY=2.79227233
##XFACTOR=1.0000000000
##YFACTOR=0.000000100000000
##FIRSTY=34.54347229
##DELTAX=0.96440572
##XUNITS=1/CM
##YUNITS=TRANSMITTANCE
##XYDATA=(X++(Y..Y))
399.3C45434723j51464443m9684248J5322647J35206823N1020641j4998626Q5898628
$$ 345434723 193970280 144286032 159608679 294815502 345836143 330837517 416736145
406D16736145O5109482l3881989p2099533o6536617k7664452N1295452J0370980J580467
$$ 416736145 481845627 447963638 375864105 309327488 281663036 332958488 343329468 344909935
413.7C44909935R9022636q5443573j45882778m1504783K5635929J23991432J22464332
$$ 344909935 443932571 358488998 212606220 171101437 196737366 320728798 443193130
420.5D43193130P9339715N9955711j02524300j41699104q64563n1235771j8920098
$$ 443193130 522532845 582488556 479964256 338265152 337400589 286164818 267244720
427.2B67244720O7334900K2139550Q2893028M978218o4360848M8244782L2286644m3084831
$$ 267244720 334579620 356719170 439612198 444590416 380229568 428474350 460760994 417676163
434.9D17676163p4323807j4450455j164284j2022190J9096356j7046375q693428M1170749
$$ 417676163 343352356 328901901 327737617 315715427 334811783 317765408 309071980 350242729
442.7C50242729q066826k8767299L688068O574135M1661987o939850p5096035k3699474
$$ 350242729 342175903 313408604 317096672 323670807 365332794 358392944 283296909 259597435
450.4B59597435L0986767J22152424L2923050q4009705l4871330k8369427n4254322
$$ 259597435 290584202 412736626 445659676 361649971 326778641 298409214 244154892
457.1B44154892n987492J43717442J5615806r7900657K6782226L6161652j0398369
$$ 244154892 238167400 381884842 397500648 299599991 326382217 362543869 352145500
463.9C52145500o36329P931022J4395485j5620308k1018600j0290947l4681664k4866066
$$ 352145500 351509171 359440193 373835678 358215370 337196770 326905823 292224159 267358093
471.6B67358093L8992214M4316769j1405716m4220428m384442N4197979J5874100o902885
$$ 267358093 306350307 350667076 339261360 295040932 290656490 344854469 360728569 353825684
479.3C53825684j7308770k39563L7811776L2085914m2598495m5462284L8991565J9468117
$$ 353825684 336516914 336277351 374089127 406175041 363576546 318114262 357105827 376573944
487C76573944L7524681k8872032r7286987R997444q545189k4115105Q3620072L5736732
$$ 376573944 414098625 385226593 287939606 297937050 289391861 265276756 348896828 384633560
494.7C84633560k5294609j4818497k2004623m829884o19163o550465J3133316J0376358
$$ 384633560 359338951 344520454 322515831 317685947 317066784 310516319 323649635 334025993
502.5C34025993K130928O914483j2309418k1295109o241570K893181l861618J5698376
$$ 334025993 336156921 343071404 330761986 309466877 303225307 306118488 302256870 317955246
510.2C17955246L6694450Q10242j2492142n922279j2993698j0710335J621590K0912132
$$ 317955246 354649696 355459938 342967796 337045517 324051819 313341484 314963074 335875206
517.9C35875206M496651q511772J7888679K2316322r360580j6099739n3673j7763405
$$ 335875206 340371857 331860085 349748764 372065086 362704506 346604767 346551094 328787689
525.6C28787689k8320293j2178040L554592K3276101R461402j2833557l2444L016796
$$ 328787689 300467396 288289356 291843948 315120049 324581451 311747894 311715450 314732246
533.3C14732246j4505157j4302292n349178q680287l15418Q957539O557560J6470565
$$ 314732246 300227089 285924797 280575619 271895332 271579914 280537453 287095013 303565578
541C03565578K1917630J2663154j372299j1496277j1684189p235565L215256K915039
$$ 303565578 325483208 338146362 336774063 325277786 313593597 306358032 309573288 312488327
548.7C12488327j6275043l727437K3186131R677296r959812k68193O717110p641659
$$ 312488327 296213284 292485847 315671978 325349274 315389462 315121269 321838379 314196720
556.5C14196720J5907421K3142395m2332020j6821003L6544152P858734j5539131j4822235
$$ 314196720 330104141 353246536 310914516 294093513 330637665 338496399 322957268 308135033
564.2C08135033P198600J9235650Q555221j825981k3102169j5904656J4495583J4764919
$$ 308135033 315333633 334569283 343124504 341298523 318196354 302291698 316787281 331552200
571.9C31552200p437095j5546303q626824N265198N950546q981170l139305N85632
$$ 331552200 324115105 308568802 299941978 305207176 311157722 302176552 299037247 299622879
579.6B99622879K106514J4816132R147567j2346210q533230Q053341J1195736J9072609
$$ 299622879 301729393 316545525 325693092 313346882 304813652 312866993 324062729 343135338
587.3C43135338l435745k0136357q008842j0085106m665814O665993J1903649Q689918
$$ 343135338 339699593 319563236 311554394 301469288 296803474 303469467 315373116 324063034
595C24063034O330948j2862263k6951389l563900J3804321J8688412M69494J707210
$$ 324063034 330393982 317531719 290580330 287016430 300820751 319509163 319978657 321685867
602.8C21685867p288189l5447979k417144O096878j7557125j6917191k883816O555386
$$ 321685867 314397678 278949699 276532555 282629433 265072308 248155117 245271301 251826687
610.5B51826687l906231j3610764k2716789j5567760j2174721J0709534K1008644o237068
$$ 251826687 247920456 234309692 211592903 196025143 183850422 194559956 215568600 209331532
618.2B09331532M723243r934253k3983937j6548233j9613628K7637J6254540J3479519
$$ 209331532 214054775 204120522 180136585 163588352 143974724 144002361 160256901 173736420
625.9A73736420m017639M398727K2118988L5209312K8801175J26686J52950j1965771
$$ 173736420 169718781 174117508 196236496 231445808 260246983 260373669 260526619 248560848
633.6B48560848k2203007k298564N643711r257450j1945248L18680k972336P486343
$$ 248560848 226357841 224059277 229702988 220445538 208500290 208818970 205846634 213332977
641.3B13332977K1495838K1205674J0823364J5795307L2171993J0064679j014901J4755211
$$ 213332977 234828815 256034489 266857853 282653160 314825153 324889832 323874931 338630142
649C38630142J4628449M434166n154000j0141449o645202J3734321J7401085l149910
$$ 338630142 353258591 357692757 352538757 342397308 335752106 349486427 366887512 363737602
656.8C63737602j9705086j5405006K513428O580124J0597191k612305j452675J8065948
$$ 363737602 344032516 328627510 331140938 337721062 348318253 345705948 344253273 362319221
664.5C62319221J905022m791794K641793l284607r849816k927131J5922165J3570366
$$ 362319221 364224243 359432449 362074242 358789635 348939819 346012688 361934853 375505219
672.2C75505219j3413239j8187904L658676J5295486J6514588R054031j1674690j6151696
$$ 375505219 362091980 343904076 347562752 362858238 379372826 388426857 376752167 360600471
679.9C60600471J169358J5893249J0925103K427139j5735932j9494934Q148842Q609009
$$ 360600471 361769829 377663078 388588181 391015320 375279388 355784454 363933296 372542305
687.6C72542305L384094j565094j2760925J309929m00734l084641k464141p559395
$$ 372542305 375926399 374361305 361600380 362910309 362509575 359424934 356960793 349401398
695.3C49401398K601852N844574Q535385l171196j5143966M90608M570656J000633
$$ 349401398 352003250 357847824 366383209 363212013 348068047 348558655 353129311 354129944
703.1C54129944j0067291q994179J1637230N060119k833023k73208O778869Q037529
$$ 354129944 344062653 335068474 346705704 351765823 348932800 348659592 355438461 363475990
710.8C63475990o523857J216049Q096924m174728m000015Q100242J4007836P930755
$$ 363475990 356952133 358168182 366265106 362090378 358090363 366190605 380198441 388129196
718.5C88129196j115074k542496Q483200L280716q139381n203171o948509k030487
$$ 388129196 387014122 384471626 392954826 396235542 388096161 382892990 375944481 373913994
726.2C73913994O707535J0537872J471939r762268N430374P766914j0707397j3886871
$$ 373913994 380621529 391159401 392631340 382869072 388299446 396066360 385358963 371472092
733.9C71472092j114693K975311l099022Q06542K760467J728897M738884J1029320
$$ 371472092 370357399 373332710 370233688 371040230 373800697 375529594 380268478 391297798
741.6C91297798N988350q610001N91889P022781l316498n022506J354713Q338356L320503
$$ 391297798 397286148 388676147 389268036 396290817 392974319 387951813 389306526 397644882 400965385
750.3D00965385K032929Q824463O400299O402740N129700k043533k612114l21655M379539
$$ 400965385 402998314 411822777 418223076 424625816 429755516 427711983 425099869 424778214 429157753
759D29157753L685837P78045O894379K203484j243897K37923o160278m544983k105866
$$ 429157753 432843590 433621635 440516014 442719498 441475601 441713524 435553246 431008263 428902397
767.7D28902397N064125M038735l667908O360931K476464n449448K834969O769561
$$ 428902397 433966522 438005257 434337349 440698280 443174744 437725296 440560265 447329826
775.4D47329826L189240l386727K96784P296524M999924M758300L362313K432213Q035125
$$ 447329826 450519066 447132339 447429123 454725647 459725571 464483871 467846184 470278397 478313522
784.1D78313522K814827j954498k24953k864990K269173K061729L596230R326019l789520
$$ 478313522 481128349 479173851 478948898 476083908 478353081 480414810 484011040 493337059 489547539
792.7D89547539j5394821o142197M364929J35613J501884M616089O685982L896904
$$ 489547539 474152718 468010521 472375450 472511063 474012947 478629036 485315018 489211922
800.5D89211922r935532L861809J2798309r42268k323837k329827q056145j0367927
$$ 489211922 479276390 483138199 495936508 494994240 492670403 490340576 482284431 471916504
808.2D71916504R589386J2388191m706192J771660o772232j2092552K732315P672500
$$ 471916504 481505890 493894081 489187889 490959549 484187317 472094765 474827080 482499580
815.9D82499580J2220650R271088j639061r841652p520905K166825k404557n115203
$$ 482499580 494720230 503991318 502352257 492510605 484989700 487156525 484751968 479636765
823.6D79636765k456246j154861M068336K531967L844185l990669q970833J85661o761016
$$ 479636765 477180519 476025658 480093994 482625961 486470146 482479477 473508644 473694305 466933289
832.3D66933289j641884k537346k0156632j4979057k829170K177582n325432n130501
$$ 466933289 465291405 462754059 442597427 427618370 424789200 426966782 421641350 416510849
840D16510849n99594p661247p502480r791412m602204M621354k27089j918755K05231
$$ 416510849 415911255 408250008 400747528 390956116 386353912 390975266 390748177 388829422 389034653
848.7C89034653m15840l183899L085823R091034P391433J1552620M837570k024879
$$ 389034653 388618813 385434914 388520737 397611771 405003204 416555824 421393394 419368515
856.4D19368515J475525l494492j746788P760277P888413K284393R31091J0434418
$$ 419368515 420844040 417349548 415602760 423363037 431251450 433535843 434466934 444901352
864.1D44901352J0176430n469628p585144j007690L757744P001953Q291664J637306
$$ 444901352 455077782 449608154 442023010 441015320 444773064 451775017 460066681 461703987
871.8D61703987r990272o349984K386437P796249O571312J666641J804619M0055m93546
$$ 461703987 451713715 445363731 447750168 455546417 462117729 463784370 465588989 465629044 465135498
880.5D65135498p377205r279518j686401l59955M561844M179954n509033p327614m352569
$$ 465135498 457758293 448478775 446792374 446432419 450994263 455174217 449665184 442337570 437985001
889.2D37985001p303048n238075O129418Q806228M818230K912064J70707m567947l726425
$$ 437985001 430681953 425443878 431573296 440379524 445197754 448109818 448280525 443712578 439986153
897.9D39986153J926613M734039J070862j817246K71073n013466n68352M112854p658882
$$ 439986153 441912766 446646805 447717667 445900421 446171494 441158028 440589676 444702530 437043648
906.5D37043648r061127q12035N484238l488197j1077118k200356n45387n676460r189491
$$ 437043648 427982521 427170486 432654724 429166527 418089409 415889053 415343666 409667206 400477715
915.2D00477715n922738q103675q528099j003838m23393m50669j0631294q291740o78482
$$ 400477715 394554977 386451302 377923203 376919365 376495972 376045303 365414009 357122269 356443787
923.9C56443787p744751J193733M356727k639846m628716m361839L85170K166977m71382
$$ 356443787 348699036 349892769 354249496 351609650 346980934 342619095 343004265 345171242 344699860
932.6C44699860k421265M068794M700508K335854L854790J876182L490524M890252
$$ 344699860 342278595 346347389 351047897 353383751 357238541 359114723 362605247 367495499
940.3C67495499N874138L722190N365067J1390610P000847J733207L357392Q857956
$$ 367495499 373369637 377091827 382456894 393847504 400848351 402581558 405938950 414796906
948D14796906J0078620N563775L537139J440926l202782m947281k501831M70543P42836
$$ 414796906 424875526 430439301 433976440 435417366 432214584 427267303 424765472 425236015 425978851
956.7D25978851o337661n061188K523117j804962k408982l329467p632866n272026
$$ 425978851 419641190 414580002 417103119 415298157 412889175 409559708 401926842 396654816
964.4C96654816l082199k311020k948799k262993l398781k076264l374443p743454
$$ 396654816 393572617 391261597 388312798 386049805 382651024 380574760 377200317 369456863
972.1C69456863J08948K435188j668167m038543k407227N911675L954353j933594m181557
$$ 369456863 369565811 372000999 370332832 366294289 363887062 369798737 373753090 371819496 367637939
980.8C67637939m323806m333840o675758k330551q02040k893067o056595o706009k39715
$$ 367637939 363314133 358980293 352304535 349973984 349171944 346278877 340222282 333516273 333276558
989.5C33276558l296471n471573n864830j1029472j2390404j7530670j2924213p0858
$$ 333276558 329980087 324508514 318643684 307614212 295223808 277693138 264768925 264698067
997.2B64698067R100723J4225636J0115299M696083k195263m147892k829628J162166
$$ 264698067 273798790 288024426 298139725 302835808 300640545 296492653 293663025 294825191
1004.9B94825191P05014q105679j900692K4643l312759n86968j775436N86700N25551
$$ 294825191 295530205 287424526 285523834 285548477 282235718 281648750 279873314 280460014 280985565
1013.6B80985565p75318l507366k261887J329785l461266o790314n952339k700920
$$ 280985565 280210247 276702881 274440994 275770779 272309513 265519199 259566860 256865940
1021.3B56865940n079727k011147K648182m440784m574852k357598l572731l192958
$$ 256865940 251786213 249775066 252423248 247982464 243407612 241050014 237477283 234284325
1029B34284325J33972N51300j903935n9089L47576j649132l655605k912235l200379
$$ 234284325 234418297 234969597 233065662 233006573 233354149 231705017 228049412 225137177 221936798
1037.7B21936798j435490j489009m656659J623021J800232m787732k971019L561630
$$ 221936798 220501308 219012299 214355640 215978661 217778893 212991161 210020142 213581772
1045.4B13581772L36761j964187P152118L368245p257958m910583J712513J522407
$$ 213581772 213918533 211954346 219106464 222474709 215216751 210306168 212018681 213541088
1053.1B13541088M908981P072335k647457k800465k72598j942005Q73527m81701j669254
$$ 213541088 218450069 225522404 222874947 220074482 219801884 217859879 218733406 218251705 216582451
1061.8B16582451J230526J309204N8556j642495l581199Q69751J53904n262452l416729
$$ 216582451 217812977 219122181 219180737 217538242 213957043 214826794 214980698 209718246 206301517
1070.5B06301517p90119m91619j545124l87153l273392k837506M521008J485310m102478
$$ 206301517 205511398 205019779 203474655 203087502 199814110 196976604 201497612 202982922 198880444
1079.2A98880444j688557L022137K006378J178264J78261m796924k638607K923793
$$ 198880444 197191887 200214024 202220402 203398666 203576927 198780003 196141396 199065189
1086.9A99065189l045234r823571l175125J884442N129699J802445o119270n930443
$$ 199065189 196019955 186196384 183021259 184905701 190035400 191837845 185718575 179788132
1094.6A79788132r510804o263313p741251j2142839m895497o704168q469257p350846
$$ 179788132 170277328 164014015 156272764 144129925 139234428 132530260 124061003 116710157
1102.3A16710157m204378l335724q720188r145899o535644o955052q981785o351242
$$ 116710157 112505779 109170055 100449867 91303968 84768324 77813272 68831487 62480245
1110F2480245o389952j841407J623106j646786k916865k486854J240831q50582L979997
$$ 62480245 56090293 54248886 55871992 54225206 51308341 48821487 50062318 49211736 53191733
1118.7E3191733M039245j990700l020439m091244K878604M91939K651582O893191K033563
$$ 53191733 57230978 55240278 52219839 48128595 51007199 51499138 54150720 61043911 63077474
1127.4F3077474O42719l176427j584139P22995K4114j584464L65491O47874m346456
$$ 63077474 63720193 60543766 58959627 59682622 59706736 58122272 58487763 59135637 54789181
1136.1E4789181m105911o5332K362900o066017n958162k59657M05975N00335o487505
$$ 54789181 50683270 50617938 52980838 46914821 40956659 40697002 41102977 41603312 35115807
1144.8C5115807n511551j140256L280237J320374k175376J139426k443767j662171
$$ 35115807 29604256 28464000 31744237 33064611 30889235 32028661 29584894 27922723
1152.5B7922723K162102J331076r93955L153975K447660m270518k666108O03377M029935
$$ 27922723 30084825 31415901 30421946 33575921 36023581 31753063 29086955 29690332 33720267
1161.1C3720267m64802q61962K176163K560900M514217K392316J361637m08845L083782
$$ 33720267 33255465 32393503 34569666 37130566 41644783 44037099 45398736 44989891 48073673
1169.8D8073673J494446L475728P935977L042746N029902M310675Q507046P781973
$$ 48073673 49568119 53043847 60979824 64022570 69052472 73363147 81870193 89652166
1177.5H9652166L200074O162700P310534Q401022L559465N305061M465981K908516
$$ 89652166 92852240 99014940 106325474 114726496 118285961 123591022 128057003 130965519
1185.3A30965519O501207N699644P033196L956728M659233M036989J402474O224136
$$ 130965519 137466726 143166370 150199566 154156294 158815527 162852516 164254990 170479126
1193A70479126Q861732M755612J285591M231682K278175J154957L215027O733360Q791580
$$ 170479126 179340858 184096470 185382061 189613743 191891918 193046875 196261902 202995262 211786842
1201.6B11786842N179425M764957K177124R57909L837127M780713J101322Q21857L652668
$$ 211786842 216966267 221731224 223908348 224866257 228703384 233484097 234585419 235407276 239059944
1210.3B39059944J122570K560787M037419M306068J407910m88358J278477N71766K733860
$$ 239059944 240182514 242743301 246780720 251086788 252494698 252006340 253284817 253856583 256590443
1219B56590443J065025J065788n81016j488304r5559m204177K544803O243191J248703
$$ 256590443 257655468 258721256 258140240 256651936 256556377 252352200 254897003 261140194 262388897
1227.7B62388897k626953k561608p22675o58169M357014K908154j335469j846332J301746
$$ 262388897 259761944 257200336 256477661 255819492 260176506 263084660 261749191 259902859 261204605
1236.4B61204605J507378p68891K888127k23217J099548K471561p78942J300221n38330
$$ 261204605 262711983 261943092 264831219 264608002 265707550 268179111 267400169 268700390 268162060
1245B68162060k899609k135010L697300K527562j739865J766339J197414o91738O24466
$$ 268162060 265262451 263127441 266824741 269352303 267612438 269378777 270576191 269884453 270508919
1253.7B70508919K500896j499119j892585M135952K281589k388134k057304q6746K5978
$$ 270508919 273009815 271510696 269618111 273754063 276035652 273647518 271590214 271503468 271529446
1262.4B71529446L327884L340569j17321l93715j132183q27809M34857N510120N828133
$$ 271529446 274857330 278197899 278080578 277686863 276554680 275726871 276161728 281671848 287499981
1271.1B87499981k07481m03977J357136K530632M015465K174320l30429J968841L771859
$$ 287499981 287292500 286888523 288245659 290776291 294791756 296966076 296635647 298604488 302376347
1279.8C02376347K440548J55353J087380M015598L746223M050961K842121K314529
$$ 302376347 304816895 304972248 306059628 310075226 313821449 317872410 320714531 323029060
1287.5C23029060K364579K042808L419304L581085L167420R53521K172432L390999
$$ 323029060 325393639 327436447 330855751 334436836 337604256 338557777 340730209 344121208
1295.2C44121208J672821K887116M103088K756615J147537J599007K63824L260193
$$ 344121208 345794029 348681145 352784233 355540848 356688385 358287392 358551216 361811409
1302.9C61811409N206985j26991Q9073K942238K516976j714783k85378K531243j41678
$$ 361811409 367018394 366891403 366980476 369922714 372439690 370724907 370439529 372970772 372829094
1311.6C72829094K894669M148178K142982j2855p06330J522408n84412o07185R72290
$$ 372829094 375723763 379871941 382014923 382002068 381295738 382818146 382233734 381626549 382598839
1320.3C82598839K376823K956734P03125K02293k299499j228829M078942K677078p75948
$$ 382598839 384975662 387932396 388635521 388837814 386538315 385309486 389388428 392065506 391289558
1328.9C91289558n98907J597824K364655k28272k95944Q31947l22151K56729L4981
$$ 391289558 390690651 392288475 394653130 394424858 394128914 394960861 394638710 394895439 394930420
1337.6C94930420r45168M64898J109924J17836p40585j31073J493606M87480k632065
$$ 394930420 393985252 394450150 395560074 395677910 394937325 394806252 396299858 396787338 394155273
1346.3C94155273j991195l92494n95551Q30116J083870Q65479J77726k55584L9024
$$ 394155273 392164078 391771584 391176033 392006149 393090019 393955498 394133224 393877640 393916664
1355C93916664k188034k017288n92880j971894k078361K14348J050987J003075k38381
$$ 393916664 391728630 389711342 389118462 387146568 385068207 385282555 386333542 387336617 387098236
1363.7C87098236k044029p21512l344383k736321K116318q5411l410683k486953K393798
$$ 387098236 385054207 384332695 380988312 378251991 380368309 380282898 376872215 374385262 376779060
1372.3C76779060J199990m621964k919388j327171J727066J033592j973877m54521
$$ 376779060 377979050 373357086 370437698 369110527 370837593 371871185 369897308 369442787
1380.1C69442787o28586j004943J029090P14837j457596J157989J375237j210175J672936
$$ 369442787 368814201 367809258 368838348 369553185 368095589 369253578 370628815 369418640 371091576
1388.7C71091576M63409j601639K16370J124344K11220J345748j20506k471733m71382
$$ 371091576 371554985 369953346 370169716 371294060 371505280 372851028 372730522 370258789 369787407
1397.4C69787407J800613j026802m164772j028366m95796k055054l345413j242905
$$ 369787407 371588020 370561218 366396446 365368080 364872284 362817230 359471817 358228912
1405.1C58228912K148438k77023j747361k791290l87573J364403n87922O07834k3842
$$ 358228912 360377350 360100327 358352966 355561676 355174103 356538506 355950584 356558418 356534576
1413.8C56534576l225936l612214O32477J508293r62715j24512K288323K625389l29895
$$ 356534576 353308640 349696426 350328903 351837196 350874481 350749969 353038292 355663681 355333786
1422.5C55333786j26457j215210m42047L580513J30157r44176J588288M880028J825943
$$ 355333786 355207329 353992119 353550072 357130585 357260742 356316566 357904854 362784882 364610825
1431.2C64610825l883095j794319J966629K359466L322335L978805k952385M9629K465020
$$ 364610825 360727730 358933411 360900040 363259506 366581841 370560646 367608261 367657890 370122910
1439.8C70122910J074218J399269J691018J692695J784096J024055J164818K230988
$$ 370122910 371197128 372596397 374287415 375980110 377764206 378788261 379953079 382184067
1447.6C82184067k4491K59247J505394m79774R66453J092453N66979J267700J635628
$$ 382184067 382159576 382418823 383924217 383444443 384410896 385503349 386070328 387338028 388973656
1456.2C88973656K346801J103135L038139j791191O11000M112244L596916M477234
$$ 388973656 391320457 392423592 395461731 393670540 394281540 398393784 401990700 406467934
1464D06467934J405220j923371L94211J450386J336823K354355L082923j059608J134262
$$ 406467934 407873154 405949783 406343994 407794380 409131203 411485558 414568481 413508873 414643135
1472.6D14643135O132736N510407M977836K845383J888199K621918L565902M506264
$$ 414643135 420775871 426286278 431264114 434109497 435997696 438619614 442185516 446691780
1480.3D46691780K747574O99043K253418J920510N111l59115o99273J48850K149963
$$ 446691780 449439354 450138397 452391815 454312325 454317436 453958321 453259048 453407898 455557861
1489D55557861J699028k721939J051445K791863j797753j939315R35096j871414r0217
$$ 455557861 457256889 454534950 455586395 458378258 456580505 454641190 455576286 453704872 453614655
1497.7D53614655k627526m311638l60489k47001j744004l533020N25933O031952N519523
$$ 453614655 450987129 446675491 446315002 446068001 444323997 440790977 441316910 447348862 452868385
1506.4D52868385j3114433r233208n526542l853340J66625j202354p71294L91465j162949
$$ 452868385 439753952 430520744 424994202 421140862 421307487 420105133 419333839 419725304 418562355
1515.1D18562355o804543r837265L521157K781944O79398l565674m530144J095657
$$ 418562355 411757812 401920547 405441704 408223648 408903046 405337372 400807228 401902885
1522.8D01902885L285675M013596k044792l343468k105369j214638l06168K19460j52054
$$ 401902885 405188560 409202156 407157364 403813896 401708527 400493889 400187721 400407181 400255127
1531.5D00255127q44879j383438p987175J854057J289177k5139L392563m295578m711189
$$ 400255127 399410248 398026810 390039635 391893692 393182869 393157730 396550293 392254715 387543526
1540.1C87543526O98089J02272l19442K028884J261826o216469L30086J897736J932678
$$ 387543526 388241615 388343887 388024445 390053329 391315155 385098686 385428772 387326508 389259186
1548.8C89259186P46918m74396K343063K208214L100738m97283Q17947M286423Q62808
$$ 389259186 390006104 389531708 391874771 394082985 397183723 396686440 397504387 401790810 402653618
1557.5D02653618o388436L979149K382889K672691L250809J279106J088066J705513
$$ 402653618 396265182 400244331 402627220 405299911 408550720 409829826 410917892 412623405
1565.2D12623405P14379J24206O57311M469032o80199k553367K25906p38754j67122
$$ 412623405 413337784 413461990 414119301 418588333 417908134 415354767 415580673 414841919 414674797
1573.9D14674797N64613J154862m458122Q78295N41878k399940k772827l455429k079010
$$ 414674797 415239410 416394272 411936150 412814445 413356323 410956383 408183556 404728127 402649117
1582.6D02649117k855454j760483n59387K98424o30722l040962k950020m348183k575455
$$ 402649117 399793663 398033180 397473793 397772217 397141495 394100533 391150513 386802330 384226875
1591.2C84226875k115822j834297l008041l671379k261048m221839l253861l470192
$$ 384226875 382111053 380276756 377268715 373597336 371336288 367114449 363860588 360390396
1599C60390396k440414l672066m192467l952064k984391l1700k815895k169800l984222
$$ 360390396 357949982 354277916 350085449 346133385 343148994 343117294 340301399 338131599 334147377
1607.6C34147377k909813n480232o222363q03394m747143q58822k88429j163540k245388
$$ 334147377 331237564 325757332 319534969 318731575 313984432 313125610 312837181 311673641 309428253
1616.3C09428253o323051j01261k932587r34582k701530j036702j492118n384217k338676
$$ 309428253 303105202 303003941 300071354 299136772 296435242 295398540 293906422 288522205 286183529
1625B86183529k348213k8534m841652O88171O00224k568016l142414k631703J902848
$$ 286183529 283835316 283806782 278965130 279653301 280253525 277685509 274543095 271911392 273814240
1633.7B73814240k344513K8228k785625k144299J200066l43571j957054l489876K153836
$$ 273814240 271469727 271497955 268712330 266568031 267768097 267424526 265467472 261977596 264131432
1642.4B64131432p24297p72953r30004k127075L580703o7234M615193p29790J211052
$$ 264131432 263407135 262634182 261704178 259577103 263157806 263090572 267705765 266975975 268187027
1651B68187027L919659M057254r217357j449490L992176N86224L553905K332306K665673
$$ 268187027 272106686 276163940 266946583 265497093 269489269 270075493 273629398 275961704 278627377
1659.7B78627377K088642K774429P286148l060398J012745J777897K415180K881317
$$ 278627377 280716019 283490448 290776596 287716198 288728943 290506840 292922020 295803337
1667.4B95803337J627464K328244J017761N463123J694508L247146K593422L550072
$$ 295803337 297430801 299759045 300776806 306239929 307934437 311181583 313775005 317325077
1675.1C17325077M210301M33998M487877L998374P148362K931251K148247M560356
$$ 317325077 321535378 321969376 326457253 330455627 337603989 340535240 342683487 347243843
1682.9C47243843m652977Q964615N456581M866524M712791M356423L999901L941192
$$ 347243843 342590866 351555481 357012062 361878586 366591377 370947800 374947701 378888893
1690.6C78888893N124130L391648O227112N812950M242477J901245P499581Q887214
$$ 378888893 384013023 387404671 393631783 399444733 403687210 405588455 413088036 421975250
1698.3D21975250N371895O192665M615135Q424912O526947N366440P398185O130982
$$ 421975250 427347145 433539810 438154945 446579857 453106804 458473244 465871429 472002411
1706D72002411M422951L748588N504723M017334M570007N053177K890778N469398L589439
$$ 472002411 476425362 480173950 485678673 489696007 494266014 499319191 502209969 507679367 511268806
1714.7E11268806L61252M257164L138275O5728L497390M130288K518272J285896Q09517
$$ 511268806 511630058 515887222 519025497 519091225 522588615 526718903 529237175 530523071 531332588
1723.4E31332588L75176K183304L267593J635055J203652L332405J197929q13980L111801
$$ 531332588 531707764 533891068 537158661 538793716 539997368 543329773 544527702 543713722 546825523
1732E46825523L856087j387825p633743M787674O399460K949638J402702L33634K551117
$$ 546825523 550681610 549293785 541660042 546447716 552847176 555796814 557199516 557533150 560084267
1740.7E60084267M888839J861878J55868L603478M522285K935677M212074M241371
$$ 560084267 564973106 566834984 566990852 570594330 575116615 578052292 582264366 586505737
1748.4E86505737J411896N179977L907013J686593M110260L633384L566551K994919
$$ 586505737 587917633 593097610 597004623 598691216 602801476 606434860 610001411 612996330
1756.2F12996330L148499L501243L005257K520638L057060J335r36279K740860K146568
$$ 612996330 616144829 619646072 622651329 625171967 628229027 628230362 627294083 630034943 632181511
1764.8F32181511K291374K049637J028519p79992J492348M172440M593124j731567
$$ 632181511 634472885 636522522 637551041 636771049 638263397 642435837 647028961 645297394
1772.5F45297394n727043L914756J088791k158813L078918K304764K711105Q15659
$$ 645297394 639570351 643485107 644573898 642415085 645494003 647798767 650509872 651325531
1780.3F51325531j580276K78244J676712L353042P08466o75965N89676J034699J434784
$$ 651325531 649745255 650023499 651700211 655053253 655761719 655085754 655675430 656710129 658144913
1788.9F58144913K164077J523896o08139j893692J421432L244705k79541r40704N90134
$$ 658144913 660308990 661832886 661224747 659331055 660752487 663997192 663717651 662776947 663367081
1797.6F63367081J927948J287689k163544J185684O36063P52029N99595K09960J576844
$$ 663367081 665295029 666582718 664419174 665604858 666240921 666992950 667592545 667802505 669379349
1806.3F69379349n31998J153259J733475O0043o80160J142120K783356R56955L97415
$$ 669379349 668847351 670000610 671734085 671794128 671113968 672256088 675039444 675996399 676393814
1815F76393814r31396o17218O7749J550750J812592j468735m52270p64161K440873
$$ 676393814 675462418 674845200 674912949 676463699 678276291 676807556 676355286 675591125 678031998
1823.7F78031998N642929l774185k817231K215729J298676P80639j785812J684952
$$ 678031998 683674927 679900742 677083511 679299240 680597916 681378555 679592743 681277695
1831.4F81277695K510376L32412Q67005K41470J378555K66571k497177m6081J750412
$$ 681277695 683788071 684120483 684987488 685228958 686607513 686874084 684376907 684330826 686081238
1840.1F86081238K027817j358796o72454m74396k443314L934098J459655L69187O58416
$$ 686081238 688109055 686750259 686077805 685603409 683160095 687094193 688553848 688923035 689581451
1848.7F89581451R8191K93045L98330K026291Q41294J261978K72522j740112j234208
$$ 689581451 689679642 689972687 690371017 692397308 693238602 694500580 694773102 693032990 691798782
1857.4F91798782r67636O2180O1493K332535K107009J1292k60849j43280J642151J059189
$$ 691798782 690831146 690893326 690954819 693287354 695394363 695405655 695144806 695001526 696643677 697702866
1867.1F97702866o83289k939606j968155K346421L379135P33566j046905l33252j242981
$$ 697702866 697019577 694079971 692111816 694458237 697837372 698570938 697524033 697190781 695947800
1875.7F95947800m28162J82343J327285K90070j515732Q00552P69578J137084j64489
$$ 695947800 695519638 695701981 697029266 697319336 695803604 696604156 697373734 698510818 698346329
1884.4F98346329k70615O30722k22320K836151J455688l330688j587830J021042J211166
$$ 698346329 698075714 698706436 698484116 701320267 702775955 699445267 697857437 698878479 700089645
1893.1G00089645M17023n70450k170944N5008K018433J908645l02658j505203n51834
$$ 700089645 700506668 699936218 697765274 697820282 699838715 701747360 701444702 699939499 699387665
1901.8F99387665N3634R38721O11801l4942j190186p59430m14123N10101J624832n42145
$$ 699387665 699441299 700380020 700991821 700956879 699766693 699007263 698593140 699103241 700728073 700185928
1911.4G00185928r36813j248245J275253J382828K87170J218949k703782j29852J991120
$$ 700185928 699249115 698000870 699276123 700658951 700946121 702165070 699461288 699331436 701322556
1920.1G01322556J221694J178132L21045q90580l324737n51758J886291p71179k147217
$$ 701322556 702544250 703722382 704043427 703152847 699828110 699276352 701162643 700391464 698244247
1928.8F98244247M78898J661911p30591j074372k0752J508255J43662N72281J855011
$$ 698244247 698723145 700385056 699654465 698580093 698559341 700067596 700211258 700783539 702638550
1937.5G02638550j222992j238098L01971O76422r29031q44956P74918L79334k14005
$$ 702638550 701415558 700177460 700479431 701155853 700226822 699381866 700156784 700536118 700322113
1946.1G00322113j570816m02145K26287J065827J394729r37576k296982j160583O23627
$$ 700322113 698751297 698349152 698575439 699641266 701035995 700098419 697801437 696640854 697264481
1954.8F97264481J68686J846466L80096n19562J931076m69742l07540l68805j702271
$$ 697264481 697433167 699279633 699659729 699140167 701071243 700601501 700293961 699925156 698222885
1963.5F98222885j344986j51825O30265j265793O43005J286926O57425M99268k64664
$$ 698222885 696877899 696726074 697356339 696090546 696733551 698020477 698677902 699177170 698912506
1972.2F98912506R42230k65503j067657o7520M64477L27149j35498q5602j506958j621094
$$ 698912506 699854736 699589233 698521576 698454056 698918533 699245682 699110184 699024582 697517624 695896530
1981.8F95896530M85153J314011q51440j670228M55857p49207j568145K97851P54013
$$ 695896530 696381683 697695694 696844254 695174026 695629883 694880676 693312531 693610382 694364395
1990.5F94364395J753845k3040k047348q3313l5096j69067Q38699L6698k053223j110382
$$ 694364395 696118240 696095200 694047852 693964539 693929443 693760376 694599075 694635773 692582550 691472168
2000.1F91472168J629639J019058o96182j126328L72162J38092o86035Q01697P65304
$$ 691472168 693101807 694120865 693424683 692298355 692670517 692808609 692122574 692924271 693689575
2008.8F93689575L36075j293106q16650q3161j085281L02276p80944K31170K138825
$$ 693689575 694025650 692732544 691915894 691832733 690747452 691049728 690268784 690499954 692638779
2017.5F92638779l23792j213760p15866o58417q10547J10931N32380M64782j129303
$$ 692638779 692314987 691101227 690385361 689726944 688916397 689027328 689559708 690024490 688895187
2026.2F88895187o62918J086045j884232q58231J281815o11954j484298J51367J368332
$$ 688895187 688232269 689318314 687434082 686575851 687857666 687245712 685761414 685912781 687281113
2034.9F87281113j027375j226883n48706j293716K00348J796341L80859m78363L92609
$$ 687281113 686253738 685026855 684478149 683184433 683384781 685181122 685561981 685083618 685476227
2043.5F85476227k146836j993103R62525R93194j09329r91516j16730K38037k60314
$$ 685476227 683329391 681336288 682298813 683292007 683182678 682191162 682074432 682312469 682052155
2052.2F82052155j197892r59854R38950J72119p72705j45493l86047r28269j9454J190795
$$ 682052155 680854263 679894409 680833359 681005478 680232773 680087280 679701233 678772964 678753510 679944305
2061.9F79944305P8736k189560n77240K370224N05371j662140j361008k73132o18591
$$ 679944305 680023041 677833481 677256241 679626465 680131836 678469696 677108688 676835556 676216965
2070.5F76216965j869355j834564r56039L00751R33609M5852o96411N27878j424484
$$ 676216965 674347610 672513046 671557007 671857758 672791367 672837219 672140808 672668686 671244202
2079.2F71244202j551590J804428n08042j381607o93435r32846q50449r74579J650849
$$ 671244202 669692612 671497040 670988998 669607391 668913956 667981110 667130661 666156082 667806931
2087.9F67806931K150268l8452j620026r2773P63931j68533O67038O21261m9209j919327
$$ 667806931 669957199 669918747 668298721 668205948 668969879 668801346 669468384 670089645 670040436 668121109
2097.5F68121109m54941J282578L2043l87115q33359K156525J628952p37839J329346
$$ 668121109 667666168 668948746 668980789 668593674 667760315 669916840 671545792 670807953 672137299
2106.2F72137299J443939n81970j813508j163864o6681K142411J211166o82602L15323
$$ 672137299 673581238 672999268 671185760 670021896 669955215 672097626 673308792 672626190 672941513
2114.9F72941513N55496J072388m21982l28522l6163q80203l08304p97272R13315N01785
$$ 672941513 673497009 674569397 674147415 673818893 673782730 672902527 672594223 671796951 672710266 673212051
2124.5F73212051j196060j45111O90231J10321j700592j031646N04760M99573Q81882
$$ 673212051 672015991 671870880 672561111 672671432 670970840 669939194 670443954 670943527 671825409
2133.2F71825409K089996Q67615k003403k444534j793365j95084K107468J553039P21512
$$ 671825409 673915405 674783020 672779617 670335083 668541718 668346634 670454102 672007141 672728653
2141.9F72728653K065659o18897j656036J28555r80682P46536J012726N68237O25229
$$ 672728653 674794312 674175415 672519379 672647934 671667252 672413788 673426514 673994751 674619980
2150.6F74619980j356430k72293J761474Q85086o18591Q86765m5243p23724O54144
$$ 674619980 673263550 672991257 674752731 675637817 675019226 675905991 675860748 675137024 675791168
2159.3F75791168J283264J819306j734543j085968k59934r40551J010513K07214J640015
$$ 675791168 677074432 678893738 677159195 676073227 675813293 674872742 675883255 676090469 677730484
2167.9F77730484P52792k245636j112289J720810j5869k202683M25644l16620m52499
$$ 677730484 678483276 676237640 675125351 676846161 676830292 674627609 675053253 674736633 674284134
2176.6F74284134q7357Q46634k40783k253876K323685J271209r07745m34570N8288
$$ 674284134 674196777 675043411 674802628 672548752 674872437 676143646 675235901 674801331 674859619
2185.3F74859619J778107J248550Q66928j579132j169815K16675K8992J281357J421966
$$ 674859619 676637726 677886276 678753204 677174072 676004257 676220932 676249924 677531281 678953247
2194F78953247K008972L54614j265029o64597J393585K104569L68347M27627Q20237
$$ 678953247 680962219 681316833 680051804 679387207 680780792 682885361 683253708 683681335 684501572
2202.6F84501572O73599j317291j875687j05972J124801J449814P10907j79291j337432
$$ 684501572 685175171 683857880 681982193 681876221 683001022 684450836 685161743 684982452 683645020
2211.3F83645020O92443K399292N87311j991730j539306J602j079865J572113K655869
$$ 683645020 684337463 686736755 687324066 685332336 683793030 683794632 682714767 684286880 686942749
2220F86942749j42364j398621k48261J030503q65937j84631R46579J901322J121978
$$ 686942749 686800385 685401764 685153503 686184006 685318069 685133438 686080017 687981339 689103317
2228.7F89103317k695923j336441J031571J034012Q6212l36762j29165j22147L68118
$$ 689103317 686407394 685070953 686102524 687136536 687222748 686885986 686756821 686634674 687002792
2237.4F87002792r2544q93021j493759j5335J419830P23954m73557L052J195373m55169
$$ 687002792 686910248 686017227 684523468 684508133 685927963 686651917 686178360 686181412 687376785 686921616
2247F86921616p99485o06079n66025P56379P60193j60523j195602K81601J668014J46713
$$ 686921616 686122131 685516052 684950027 685706406 686466599 686306076 685110474 685392075 687060089 687206802
2256.7F87206802r51385k69318L65067O11801M14123o86187l20816l64228l21197K95868
$$ 687206802 686255417 685986099 686351166 686962967 687377090 686690903 686370087 686005859 685684662 685980530
2266.3F85980530N77392J511307j43890j450196L33863K038955Q45261j121597j061173
$$ 685980530 686557922 688069229 687925339 686475143 686809006 688847961 689693222 688571625 687510452
2275F87510452r62600M46777J579285k3346p88575N22309J01623m58908o76117j986465
$$ 687510452 686547852 686994629 688573914 688550568 687761993 688284302 688385925 687927017 687250900 685264435
2284.6F85264435M23279K241592J802292N63736j966171p85447L58353K1820K35748
$$ 685264435 685687714 687929306 689731598 690295334 688329163 687543716 687902069 687923889 688159637
2293.3F88159637j78451o1188N57938J134262O08368j040421j412430j82571r5596
$$ 688159637 687981186 687919998 688477936 689612198 690220566 689180145 687767715 687585144 687489548
2302F87489548o69327K0981J155243K29721P248Q43124j755295j242141R29260N30472
$$ 687489548 686820221 686841202 687996445 688226166 688233414 689076538 687321243 686079102 687008362 687538834
2311.6F87538834j38932L28980K418670N92042j310578k542190o99158K447586J42593
$$ 687538834 687399902 687728882 690147552 690739594 689429016 686886826 686187668 688635254 688777847
2320.3F88777847j198806k178116J745910R50547j770020K578125k373199k816544
$$ 688777847 687579041 685400925 687146835 688097382 686327362 688905487 686532288 683715744
2328F83715744K362061N41305m10766N90438N5848r09043r66263K10419L303528J225738
$$ 683715744 686077805 686619110 686208344 686798782 686854630 685945587 684979324 685189743 688493271 689719009
2337.7F89719009o0577j044998k389984P0877R54437L909226J939697j805573k559967
$$ 689719009 689658432 688613434 686223450 686294327 687248764 691157990 693097687 691292114 688732147
2346.3F88732147K63977K278443O17752J514511p57523l306579r20029L147430K600556
$$ 688732147 688996124 691274567 691892319 693406830 692649307 689342728 688422699 691570129 694170685
2355F94170685l431244j273270k113495l18603p32269k252274M280930L068313J594849
$$ 694170685 690739441 689466171 687352676 687034073 686301804 684049530 688330460 691398773 692993622
2363.7F92993622j16882M071273M134293k229996j765365l868866l139191J154480
$$ 692993622 692876740 696948013 701082306 698852310 697086945 693218079 690078888 691233368
2371.4F91233368L192444K890091k78473k691879K75192R62753j080627J668396J764755
$$ 691233368 694425812 697315903 697037430 694345551 694620743 695583496 694502869 696171265 697936020
2380.1F97936020P6141l25393r49631l71781K44980L63083O8054L60413j90353k14234
$$ 697936020 698012161 697686768 696737137 696365356 696610336 696973419 697041473 697401886 697211533 696997299
2389.7F96997299l40423j84632K731324R85794k675095j792755L26156J586991J092071
$$ 696997299 696656876 696472244 699203568 700189362 697514267 695721512 696047668 697634659 698726730
2398.4F98726730j397552j892471M21524N78079k12937p37686K85950J486587n12847
$$ 698726730 697329178 695436707 695858231 696436310 696223373 695485687 695771637 697258224 696745377
2407.1F96745377m77829R21020j58920j194306p06634k74658O27441N26199q3160N57327
$$ 696745377 696267548 697188568 697029648 695835342 695128708 694854050 695481491 696007690 695924530 696481857
2416.7F96481857j474533j701202M92859J71661r89914J74561J362457j207275j125031
$$ 696481857 695007324 693306122 693798981 693970642 692980728 693155289 694517746 693310471 692185440
2425.4F92185440J80283J092605J994705l50036j082077j101227k31934M72107j500930
$$ 692185440 692365723 693458328 695453033 695102997 694020920 692919693 692687759 693159866 691658936
2434.1F91658936j183091J281510N43594j314316k60925j038666o58417J188279J066513
$$ 691658936 690475845 691757355 692300949 690986633 690725708 689687042 689028625 690216904 691283417
2442.8F91283417N57785j620636j184540J71585k43454n26657n19791r1476J00250
$$ 691283417 691841202 690220566 689036026 689207611 688964157 688437500 687917709 687826233 687926483
2451.5F87926483K77405o9809K93274J52359Q5297q87528j501694M80881M19693K14233
$$ 687926483 688203888 688134079 688427353 688579712 688665009 687777481 686275787 686756668 687176361 687390594
2461.1F87390594q66546j003037l95202m42124L54157q63037M84695k22931j856994
$$ 687390594 686524048 685521011 685125809 684683685 685037842 684174805 684659500 684436569 682579575
2469.8F82579575o6376n63812j225739K4033K319946l33176k394714j06125l56674
$$ 682579575 682513199 681949387 680723648 680747681 683067627 682734451 680339737 680233612 679876938
2478.5F79876938m61044M47616J630936L77121j481476j540375n48477R57870J63804
$$ 679876938 679415894 679863510 681494446 681871567 680390091 678849716 678301239 679259109 679422913
2487.1F79422913j133576k066498r6588J185990l88184r55505q76923P57294j8997
$$ 679422913 678289337 676222839 676126251 677312241 676924057 675968552 675091629 675848923 675829926
2495.8F75829926j738739p51572R37042K71835r35745N70679j80893r97238l09448
$$ 675829926 674091187 673339615 674276657 674548492 673612747 674183426 674002533 673005295 672695847
2504.5F72695847R4223o09513j287307J251907M50287r31168J602097J266250n32608
$$ 672695847 672790070 672180557 670893250 672145157 672595444 671664276 673266373 674532623 674000015
2513.2F74000015m74930j845016k635345p81937O5384J76315R41696K402573o3019
$$ 674000015 673525085 671680069 669044724 668262787 668328171 668504486 669446182 671848755 671785736
2521.9F71785736k704315m35944M5014L73077k18887j024018K47498j37100q97980
$$ 671785736 669081421 668645477 668690491 669063568 668844681 667820663 668068161 667931061 667033081
2530.5F67033081j563492l78113P32499J297683P39136j670532p52640P3319j46180
$$ 667033081 665469589 665091476 665823975 667121658 667860794 666190262 665437622 665510941 665364761
2539.2F65364761O62079N31159j058045q88977R66110p9803j309662j413574J35116
$$ 665364761 666026840 666557999 665499954 664610977 665577087 665497284 664187622 662774048 662909164
2547.9F62909164J746521J53504j353913j285858P72934J897888L67051q50144j500168
$$ 662909164 664655685 664809189 663455276 662169418 662942352 664840240 665207291 664357147 662856979
2556.6F62856979m03747J440506L42712j092071j080399j399994k04620N45349K25601
$$ 662856979 662453232 663893738 664236450 663144379 662063980 660663986 660459366 661004715 661230316
2565.2F61230316O34461K136M32052M91028j852035j657715P02438R58710m98886j311264
$$ 661230316 661864777 661866913 662298965 662789993 660937958 659280243 659982681 660941391 660442505 659131241
2574.9F59131241l65219l91083o32782J02005q89511M50210Q66013p67975Q76389L22799
$$ 659131241 658766022 658374939 657742157 657844162 656954651 657404861 658270874 657502899 658379288 658702087
2584.5F58702087j844558k021866J96915J786193N91736o01654j471710m77829j83716
$$ 658702087 656857529 654835663 655032578 656818771 657410507 656808853 655337143 654859314 654675598
2593.2F54675598o16302j35956N40619P78274k72751p73468k462463k066345O17142
$$ 654675598 654059296 653923340 654463959 655242233 654969482 654196014 651733551 649667206 650284348
2601.9F50284348K033386M86603k165375L00369K7084j203765P96051l04566j694031
$$ 650284348 652317734 652804337 650638962 650939331 650966415 649762650 650558701 650254135 648560104
2610.6F48560104k304306o39724J161728J47018p14111k84195M67682L10287n08499
$$ 648560104 646255798 645616074 646777802 646924820 646210709 645926514 646394196 646704483 646195984
2619.3F46195984j738052o71692K81448K30942k14844k187195l88794J291886M0664
$$ 646195984 644457932 643786240 644067688 644298630 644083786 641896591 641507797 642799683 642840347
2627.9F42840347m19082p19910r83276q62847L98522L61480j322021m38957J163520
$$ 642840347 642421265 641701355 640718079 639855232 640253754 640615234 639293213 638854256 640017776
2636.6F40017776n67893j439324n27038n98259Q95767J16958k886276j184311J644898
$$ 640017776 639449883 638010559 637483521 636885262 637781029 637897987 635011711 633827400 635472298
2645.3F35472298k24190j876144j23597K72637n1918j17684q80050j234856k2583J139641
$$ 635472298 635248108 633371964 633248367 633521004 633469086 633351402 632471352 631236496 631213913 632353554
2654.9F32353554J70326m23622j465950j520538m87290j106872k17438O78711M48494
$$ 632353554 632523880 632100258 630634308 629113770 628626480 627519608 627302170 627980881 628429375
2663.6F28429375m62952j501923q28857m94919k84309j94969j61438J60293p46116
$$ 628429375 627966423 626464500 625635643 625140724 624856415 624661446 624500008 624660301 623914185
2672.3F23914185q79212l18298k79732l95737k24075O42128r86099j758461P06558
$$ 623914185 623034973 622716675 622436943 622041206 621817131 622459259 621473160 619714699 620421257
2681F20421257K29721r42421l38287r70001r08585J522522R63707j166649j008034
$$ 620421257 620650978 619708557 619370270 618400269 617491684 619014206 619977913 618811264 617803230
2689.6F17803230j669998O63300J391906j080474o20156j708298q34388J258011P33261
$$ 617803230 616133232 616796532 618188438 617107964 616487808 614779510 613945122 615203133 615936394
2698.3F15936394j029587k093468k0866J179542J009484r85565k029496j317329o77757
$$ 615936394 614906807 612813339 612792473 613972015 614981499 613995934 611966438 610649109 609971352
2707F09971352N24215l55262n3254j100540k209091q77P02896J60103n74837l26538
$$ 609971352 610495567 610140305 610087051 608986511 606777420 606776543 607479439 607639542 607064705 606738167
2716.6F06738167r87091r63784l59878r66263p64542K12899J814041j07765j660233
$$ 606738167 605751076 604787292 604427414 603461151 602696609 602909508 604723549 604615784 602955551
2725.3F02955551q31642M23775N93033j769982j246490m43116M03672o80504p73659
$$ 602955551 602123909 602547684 603140717 601370735 600124245 599681129 600084801 599404297 598630638
2734E98630638J413803j822395q02078R55276n62820o51436k228050j119614j5335
$$ 598630638 600044441 598222046 597419968 598375244 597812424 597160988 594932938 593813324 593797989
2742.7E93797989q6899P47223Q40988K15912r02748q74405q80470j409874j273232
$$ 593797989 593711090 594458313 595299301 595515213 594612465 593738060 592857590 591447716 590174484
2751.4E90174484l99093N70411O82412p74041j161194l26347m79050J58730K7161n65072
$$ 590174484 589775391 590345802 591028214 590254173 589092979 588766632 588287582 588446312 588473473 587908401
2761E87908401l78875l55721n53741q22411q70666n17235J13716j193199n70641N20974
$$ 587908401 587529526 587173805 586620064 585797653 584926987 584409752 584523468 583330269 582759628 583280602
2770.7E83280602n48745p5416q66852j409836n92575K23732r94110k230644l87993
$$ 583280602 582731857 582656441 581789589 580379753 579787178 580010910 579016800 576786156 576398163
2779.3E76398163k29340K11792m37698j686478K69165N09911j715279k450371l89823
$$ 576398163 576168823 576380615 575942917 574256439 574525604 575035515 573320236 570869865 570480042
2788E70480042N44738q9798j122856j093445q8234m35142j01891m24804j108284j693955
$$ 570480042 571024780 570934982 569812126 568718681 568630447 568195305 568093414 567668610 566560326 564866371
2797.7E64866371j323547k75498r03129n03998r49173j908455p11441K68478j251258
$$ 564866371 563542824 563267326 562364197 561860199 560911026 559002571 558291130 558559608 557308350
2806.3E57308350j924477K18010R94072n93872k931595j263313J080475m59824j492996
$$ 557308350 555383873 555601883 556595955 556002083 553070488 551807175 552887650 552427826 550934830
2815E50934830k031746k087326j191750o44073j114464j49002N5466k082139j677017
$$ 550934830 548903084 546815758 545624008 544979935 543865471 543716469 543771935 541689796 540012779
2823.7E40012779n02014p16629k366333j814003m84238j286735q18329k71721N95245
$$ 540012779 539510765 538794136 536427803 534613800 534129562 532842827 532024498 531752777 532348022
2832.4E32348022o91642k309723k033348j770668r41162k077065k304649k421456k778396
$$ 532348022 531656380 529346657 527313309 525542641 524601479 522524414 520219765 517798309 515019913
2841.1E15019913k351074l085747l066407k989349k729149l451614l679123l456955
$$ 515019913 512668839 509583092 506516685 503527336 500798187 497346573 493667450 490210495
2848.8D90210495l488464j964074j113510o10161j852760j521911J83029r20296J15280
$$ 490210495 486722031 484757957 483644447 483034286 481181526 479659615 479842644 478922348 479037628
2857.4D79037628J522484q76274j570206R46884l19824j732178n64460n79834r85680
$$ 479037628 480560112 479683838 478113632 479060516 478740692 477008514 476444054 475864220 474878540
2866.1D74878540j940536j993561k559624k054443n89600r61800r59281p32537j575393
$$ 474878540 472938004 470944443 468384819 466330376 465740776 464778976 463819695 463087158 461511765
2874.8D61511765l289681k7733J478272j758805o04553M06456K20299k097664l190422
$$ 461511765 458222084 458194351 459672623 457913818 457309265 457715721 457936020 455838356 452647934
2883.5D52647934k45400k81715j197166j546250j264381j337586j108703m42887k410850
$$ 452647934 452402534 452120819 450923653 449377403 448113022 446775436 445666733 445223846 442812996
2892.2D42812996k369232p00188n15442j170235j709556j575737j650086j053352J10855
$$ 442812996 440443764 439743576 439228134 438057899 436348343 434772606 433122520 432069168 432180023
2900.8D32180023J5564k177009k186203N02471m8713j410256p0839N88608n98945k238007
$$ 432180023 432195587 430018578 427832375 428334846 428286133 426875877 426805038 427393646 426794701 424556694
2910.5D24556694l131523k117043K14386M08669k683334l244782j591530j421547j396637
$$ 424556694 421425171 419308128 419522514 419931183 417247849 414003067 412411537 410989990 409593353
2919.2D09593353j779327j149750o10885q75397q86154j040345p1334J126861J236458
$$ 409593353 407814026 406664276 406053391 405177994 404291840 403251495 403180161 404307022 405543480
2927.8D05543480L19977O30836j005516j255302K853470J709442m10843Q9912R60961
$$ 405543480 405863457 406494293 405488777 404233475 407086945 408796387 408385544 408475456 409436417
2936.5D09436417J061325m8790L97300N62020J602287Q41026P89414J503258j983262
$$ 409436417 410497742 410448952 410846252 411408272 413010559 413851585 414640999 416144257 414160995
2945.2D14160995j586608O80046Q30154L72772K85149Q67042N5619n81208j284446
$$ 414160995 412574387 413254433 414084587 414457359 414742508 415609550 415665169 415083961 413799515
2953.9D13799515j530648j250686M38118M90074j485367m62036L45802R36509M85191
$$ 413799515 412268867 411018181 411456299 411946373 410461006 409998970 410344772 411281281 411766472
2962.6D11766472N98144J788102Q04977R27086J838608K317199J71585m15992K900963
$$ 411766472 412364616 414152718 414957695 415884781 417723389 420040588 420212173 419796181 422697144
2971.2D22697144L128509N63698p58057O25534J456185K639427L584556J653443J042366
$$ 422697144 425825653 426389351 425631294 426256828 427713013 430352440 433936996 435590439 436632805
2979.9D36632805R89380Q66279Q99048M59900R55124J604309R48525M54521M87900
$$ 436632805 437622185 438488464 439387512 439847412 440802536 442406845 443355370 443809891 444297791
2988.6D44297791J70211J836968K233696R66491J444169J763305J397515N7907l10440
$$ 444297791 444468002 446304970 448538666 449505157 450949326 452712631 454110146 454168053 453857613
2997.3D53857613L22113J315002J576309p70225p39937N06973o70547j176186l7651
$$ 453857613 454179726 455494728 457071037 456300812 455560875 456067848 455397301 454221115 454183464
3006D54183464O49643J03073l80096q70667o02417K4948q82301r5558J413574o2103
$$ 454183464 454833107 454936180 454556084 453685417 453083000 453107948 452225647 452130089 453543663 453481560
3015.6D53481560j147347j040191o30227J17608o59523l21160J152916O21071q49342
$$ 453481560 452334213 451294022 450663795 450781403 450121880 449800720 450953636 451574707 450725365
3024.3D50725365j459809j607284j977425k97394J474419K62032j076966j303215p18918
$$ 450725365 449265556 447658272 445680847 445383453 446857872 447119904 446042938 444739723 444020805
3033D44020805L71552q40111l643379k595139M31214N75218o31027j029740k17704
$$ 444020805 444392357 443552246 439908867 437313728 437744942 438320160 437689133 436659393 436441689
3041.6D36441689j12916q96148r70116j316261o51207o12183j684456j35688l91426
$$ 436441689 436328773 435432625 434462509 433146248 432495041 431882858 430198402 430062714 429671288
3050.3D29671288j588898R2697j51787j584472k184182j945648o66237l91884p39898
$$ 429671288 428082390 428175087 428023300 426438828 424254646 422308998 421642761 421250877 420510979
3059D20510979k32315j29395j456222k28806P78008j188965j414414j077652j045952
$$ 420510979 420278664 420149269 418693047 418464241 419242249 418053284 416638870 415561218 414515266
3067.7D14515266r99527m19998q30307j515274n22690q82186N48858N61791j659241
$$ 414515266 413515739 413095741 412265434 410750160 410227470 409345284 409894142 410455933 408796692
3076.4D08796692o87447k67753j833344k804489n81436L62549K91443Q90350j369286
$$ 408796692 408109245 407841492 406008148 403203659 402622223 402984772 403276215 404166565 402797279
3085D02797279j078834J50108q56666j798668k212067j236458J27297j2093j077652
$$ 402797279 401718445 401868553 401011887 399213219 397001152 395764694 395891991 395879898 394802246
3093.7C94802246l37295j063652j634865l31726j90316l42025j785126K4986R22051
$$ 394802246 394464951 393401299 391766434 391434708 391244392 390902367 389117241 389142227 390064278
3102.4C90064278j788750j301689j360779j349907p39212r44710n86929p67479n62325
$$ 390064278 388275528 386973839 385613060 384263153 383523941 382579231 381992302 381224823 380662498
3111.1C80662498j071777k386742j441802O2980j194992j655159o96945o92444p01713
$$ 380662498 379590721 377203979 375762177 375825157 374630165 372975006 372278061 371585617 370883904
3119.8C70883904j413842o47354p0457j324463q68225j05706k40860j403427k061081
$$ 370883904 369470062 368822708 368752251 367427788 366559563 366453857 366212997 364809570 362748489
3128.4C62748489j097145k15301k67678j805877j867371j038589j507378j42097l94020
$$ 362748489 361651344 361436043 361168365 359362488 357495117 356456528 354949150 354807053 354413033
3137.1C54413033j638146m68750j094627j210785l85094n43899q60138j228028r48868
$$ 354413033 352774887 352306137 351211510 350000725 349615631 349071732 348211594 346983566 346034698
3145.8C46034698k228813j705093R6703n30015j172409k089119j930923r60045J48850
$$ 346034698 343805885 342100792 342197495 341667480 340495071 338405952 336475029 335514984 335663834
3154.5C35663834k7581j182937o17523j517296k381287k166939j349487K16408k94914
$$ 335663834 335636253 334453316 333835793 332318497 329937210 327770271 326420784 326637192 326342278
3163.1C26342278j315461j372032r91669p17620j165543j696281j002465r05895l41225
$$ 326342278 325026817 323654785 322663116 321945496 320779953 319083672 318081207 317175312 316834087
3171.8C16834087Q79841j877002k448521p73373j479530j025753m40331l80287j180897
$$ 316834087 317713928 315836926 313388405 312615032 311135502 310109749 309669418 309289131 308108234
3180.5C08108234j262397j856881l021144R4776J389904r63955k550640j845646J14364
$$ 308108234 306845837 304988956 301967812 302062588 303452492 302488537 299937897 298092251 298206615
3189.2B98206615q15181j059590n52120j394367k61135p2155j239491m96654N38807
$$ 298206615 297391434 296331844 295779724 294385357 294124222 294052067 292812576 292315922 292854729
3197.9B92854729j138249l125877j303501o7768m07734p97406k355861j386452P5703
$$ 292854729 291716480 288590603 287287102 287219334 286811600 286014194 283658333 282271881 282347584
3206.5B82347584l38936j475334j918240k26230K44522j8311r15584j806145j291847
$$ 282347584 282008648 280533314 278615074 278388844 278633366 278615055 277699471 275893326 274601479
3215.2B74601479j794606j400757O0635J25656k24838j58615j081829j023445r26533
$$ 274601479 272806873 271406116 271466751 271592407 271367569 271208954 270127125 269103680 268177147
3223.9B68177147q73089R57832j177406j699047M28524n98888j357880j956348K91881
$$ 268177147 267304058 268261890 267084484 265385437 265813961 265215073 263857193 261900845 262192726
3232.6B62192726Q45451k651786k651482K66247J196022j319866j115475l8300j272258
$$ 262192726 263038177 260386391 257734909 258001156 259197178 257877312 256761837 256723537 255451279
3241.3B55451279j179886O9561M82197j150990k363930j925659N23472J331081m46453
$$ 255451279 254271393 254340954 254823151 253672161 251308231 249382572 249906044 251237125 250790672
3249.9B50790672j701011k364579L55721M69932j886539n69286j10531j163178j238556
$$ 250790672 249089661 246725082 247080803 247550735 245664196 245094910 244984379 243821201 242582645
3258.6B42582645k54688n82714p26681q16841j339168K42786K43664l41931o3839q98036
$$ 242582645 242327957 241745243 241018562 240201721 238862553 239105339 239349003 239007072 238943233 238045197
3268.3B38045197p15962O92844j72367j964836o17904O72264K46315o74572j700592
$$ 238045197 237329235 238022079 237849712 235884876 235266972 235939236 236185551 235510979 233810387
3276.9B33810387j185170r33265j084748P88193J365605o80695j204567j295357j615791
$$ 233810387 232625217 231691952 230607204 231395397 232761002 232080307 230875740 229580383 227964592
3285.6B27964592r44023J260376K176170q86593j921806q56113n3883n82504p41215
$$ 227964592 227020569 228280945 230457115 229570522 227648716 226792603 226738720 226156216 225415001
3294.3B25415001J72119j538563R4891J064720m86908L35007j583271j806259o28205
$$ 225415001 225587120 224048557 224143448 225208168 224721260 225056267 223472996 221666737 221038532
3303B21038532r13238j0987L32489p629k17533P55577m94289k067604m59633q57506
$$ 221038532 220125294 220114307 220446796 220439167 220221634 220977211 220482922 218415318 217955685 217098179
3312.6B17098179n50518Q96549j223392j878128j193276m08649J400146q8310r97353
$$ 217098179 216547661 217444210 216220818 214342690 213149414 212740765 214140911 214052601 213055248
3321.3B13055248o10676m88929N44223o19087j389465j307545r88369o26812L8510
$$ 213055248 212444572 211955643 212499866 211880779 210491314 209183769 208195400 207568588 207607098
3330B07607098M94117r19799m3107j84059p73716K07825r8247l18280j575107j081753
$$ 207607098 208101215 207181416 207138309 206954250 206180534 206388359 206290112 205971832 204396725 203314972
3339.6B03314972n05829j025600P858N28469O237j045589n75028m15230m78515n3063
$$ 203314972 202809143 201783543 201791401 202319870 202326107 201280518 200705490 200290260 199811745 199758682
3349.3A99758682q6670m44297j929741r77440M77218J70250j172332k236004j429425
$$ 199758682 199672012 199227715 197297974 196320534 196797752 196968002 195795670 193559666 192130241
3357.9A92130241j001110L00236P68795l75118o30760j72291J74942J07899N2967n81017
$$ 192130241 191129131 191429367 192198162 191823044 191192284 191019993 191194935 191302834 191355801 190774784
3367.6A90774784j97697r2182r20429j269569q22392o91471j706314k97318M61026
$$ 190774784 190577087 190484905 189564476 188294907 187472515 186781044 185074730 184777412 185238438
3376.3A85238438m5929J56612q7433q55846j791096l0861m15306q1959K266026k99568
$$ 185238438 185192509 185349121 185261688 184405842 182614746 182583885 182168579 182086620 184352646 184053078
3385.9A84053078j715813j179447o22826r33056q56189P75547p66735n01366J591358
$$ 184053078 182337265 181157818 180534992 179601936 178745747 179521294 178754559 178253193 179844551
3394.6A79844551k0046j565113l17440J340961J170941j409016k868118p42493M44641
$$ 179844551 179824505 178259392 177941952 179282913 180453854 179044838 176176720 175434227 175878868
3403.3A75878868O70605j83544r76124L64666M38938L45802o24027p85141J016293
$$ 175878868 176549473 176365929 175389805 175754471 176193409 176539211 175915184 175130043 176146336
3412A76146336j20163j210614J94359J083374O17314p13234j309643k23312L45153
$$ 176146336 176026173 174815559 175009918 176093292 176710606 175997372 174687729 174464417 174809570
3420.6A74809570O38199N24941J11370M11968q27656m80594M50077l23677k03686l5916
$$ 174809570 175447769 175972710 176084080 176496048 175668392 175187798 175637875 175314198 175110512 175074596
3430.3A75074596K64473Q47702K193737r7217k281361P95021J085186M96865j1712
$$ 175074596 175339069 176186771 178380508 178283291 176001930 176796951 177882137 178379002 178367290
3439A78367290j260814k84195K70004N83973J343918J249123j8864J09062l42750o37703
$$ 178367290 177106476 176822281 177092285 177676258 179020176 180269299 180250435 180359497 180016747 179379044
3448.6A79379044O98471L6602J098213J036510m31804R18674Q47283n51262n24216
$$ 179379044 180077515 180114117 181212330 182248840 181817036 182735710 183582993 183031731 182507515
3457.3A82507515J255588L22133j321793K57721J101799J155624L01724K24666J310349
$$ 182507515 183763103 184085236 182763443 183021164 184122963 185278587 185580311 185804977 187115326
3466A87115326P97920O31523J660538N48058j138993J298981J097927j710491K77061
$$ 187115326 187913246 188544769 190205307 190753365 189614372 190913353 192011280 190300789 190577850
3474.6A90577850J462117N80234R46427J220493O29330n03006O32438K246266J241970
$$ 190577850 192039967 192620201 193566628 194787121 195416451 194913445 195545883 197792149 199034119
3483.3A99034119P93152O35452o09989j104279r91783J010895L559913K032376m19236
$$ 199034119 199827271 200462723 199852734 198748455 197756672 198767567 202327480 204359856 203940620
3492B03940620o01005n75485J205787J972275k51102p30629J84669J849308K110043
$$ 203940620 203339615 202764130 203969917 205942192 205691090 204960461 205145130 206994438 209104481
3500.7B09104481J355648J461563j083832l43304K189217J167450N38101L0079R1190
$$ 209104481 210460129 211921692 210837860 210494556 212683773 213851223 214389324 214419403 214510593
3509.4B14510593R33476K146988J753197r35574o54469K87991N62401J229820P50103
$$ 214510593 215444069 217591057 219344254 218408680 217754211 218042202 218604603 219834423 220584526
3518B20584526J313973J678829J211776K015114J222477r57489K6856K160644K374344
$$ 220584526 221898499 223577328 224789104 226804218 228026695 227069206 227096062 229256706 231631050
3526.7B31631050Q11615k65770m43878J314526K259159L82232P60556N44071Q21037
$$ 231631050 232442665 232176895 231733017 233047543 235306702 235688934 236449490 236993561 237814598
3535.4B37814598K282562j82914M1236P90177J222992K085590J78509J334686L026982
$$ 237814598 240097160 239914246 239955482 240745659 241968651 244054241 244232750 245567436 248594418
3544.1B48594418J099548n14450L31402J248073J567307K267933R02748K0504J451778
$$ 248594418 249693966 249179516 249510918 250758991 252326298 254594231 255496979 255517483 256969261
3552.7B56969261K341137J390267Q34102J509686Q52470J325569J583805Q77457J242619
$$ 256969261 259310398 260700665 261534767 263044453 263896923 265222492 266806297 267683754 268926373
3561.4B68926373J189613J478786J153851R07917J943378M018650R07116k435112K330113
$$ 268926373 270115986 271594772 272748623 273656540 275599918 279618568 280525684 278090572 280420685
3570.1B80420685L774605R17472j79042L09505J862221L557072K361450P37591K286777
$$ 280420685 284195290 285112762 284933720 285243225 287105446 290662518 293023968 293761559 296048336
3578.8B96048336K085476P84874K011166L172359J799412K11143L068581L402481J132088
$$ 296048336 298133812 298918686 300929852 304102211 305901623 306112766 309181347 312583828 313715916
3587.5C13715916K640686o24523P45525L599834L342400K610283J234512J708641J652947
$$ 313715916 316356602 315732079 316477604 320077438 323419838 326030121 327264633 328973274 330626221
3596.1C30626221K016144K773056J068038K771950L852806N21660K029495K869683
$$ 330626221 332642365 335415421 336483459 339255409 343108215 343629875 345659370 348529053
3603.9C48529053J165619K722053K686348K636147N545196K533341P40852L387375
$$ 348529053 349694672 352416725 355103073 357739220 363284416 365817757 366558609 369945984
3611.6C69945984P79915M98848M667320L362961M544983N030822m21104K056313K263603
$$ 369945984 370725899 371224747 375892067 379255028 383800011 388830833 388409729 390466042 392729645
3620.3C92729645N98144M770050L189927K570495L766937K879563L152466K147064
$$ 392729645 393327789 398097839 401287766 403858261 407625198 410504761 413657227 415804291
3628D15804291M60701K043762N425758O580048N927200L942566J292877L038330L584481
$$ 415804291 416264992 418308754 423734512 430314560 436241760 440184326 441477203 444515533 448100014
3636.6D48100014J596870J499634L813896M430924K914009K270775N164184N282784
$$ 448100014 449696884 451196518 455010414 459441338 462355347 464626122 469790306 475073090
3644.4D75073090L029937M710121J746979J464997N677108K195778K344017J256333
$$ 475073090 478103027 482813148 484560127 486025124 491702232 493898010 496242027 497498360
3652.1D97498360O313781M241372K697258N512275l319664K974663M209175K170448
$$ 497498360 503812141 508053513 510750771 516263046 512943382 515918045 520127220 522297668
3659.8E22297668M033890K563935L627052K010002L811569M076805K089844L675842
$$ 522297668 526331558 528895493 532522545 534532547 538344116 542420921 544510765 548186607
3667.5E48186607O71044J278572O91795o63719M577484N886917P806320M331170j0657425
$$ 548186607 548857651 550136223 550828018 550164299 554741783 560628700 568435020 572766190 562108765
3676.2E62108765j658783Q858947P054253k866859K57949L146363K675400L060798
$$ 562108765 560449982 569308929 576363182 573496323 573754272 576900635 579576035 582636833
3683.9E82636833J768761O29806J996346L603516p118111n1689J1267738j363830j972924
$$ 582636833 584405594 585035400 587031746 590635262 583517151 583465462 594733200 593369370 591396446
3692.6E91396446L703652k12822J496048Q3618q77991K156410P1946J604080L539886
$$ 591396446 595100098 594887276 596383324 596466942 595588951 597745361 597817307 599421387 602961273
3701.3F02961273m441910j204261O103859L185310K328186J036911R84459L306923
$$ 602961273 598519363 597315102 603418961 606604271 608932457 609969368 610953827 614260750
3709F14260750o129227L683853O072197r193992M750824M132194p46345P05833K560234
$$ 614260750 608131523 611815376 617887573 608693581 613444405 617576599 616830254 617536087 620096321
3717.7F20096321J199951k241363Q08792N460129K144203m205208N46417J273842J469116
$$ 620096321 621296272 619054909 619863701 625323830 627468033 623262825 623809242 625083084 626552200
3726.3F26552200k951049j893082J742439J067391Q576355p05567r857483Q110504
$$ 626552200 623601151 621708069 623450508 624517899 633094254 632388687 622531204 630641708
3734F30641708M242630o193847j231728K790718j168976M75121K247162l387184N712471
$$ 630641708 634884338 628690491 627458763 630249481 629080505 629555626 631802788 628415604 634128075
3742.7F34128075J3849830j0882415j9734650R687004N622024N395661m689636j0475350
$$ 634128075 647977905 637095490 617360840 627047844 632669868 638065529 633375893 622900543
3750.4F22900543J3205796k783738p504081M593811L556060L450966n447502L378067
$$ 622900543 636106339 633322601 625818520 630412331 633968391 637419357 631971855 635349922
3758.2F35349922O149559o320152j944199J559182J645622K211189M168854l399430
$$ 635349922 641499481 635179329 633235130 634794312 636439934 638651123 642819977 639420547
3765.9F39420547m406089N335045N029068j190339r671974J533585M119301J588897
$$ 639420547 635014458 640349503 645378571 644188232 634516258 636049843 640169144 641758041
3773.6F41758041J095963j014633N8899j530152J741638J584626m750405K156716J005325
$$ 641758041 642854004 641839371 641898270 640368118 642109756 643694382 638943977 641100693 642106018
3782.3F42106018N46570R18274l091889o4849J826858J172943o68182l46298J439132
$$ 642106018 642652588 643570862 640478973 640414124 642240982 643413925 642745743 642399445 643838577
3790.9F43838577j48773N38559m61426R47113L952484m462966l538285L801956N532685
$$ 643838577 643689804 644228363 643766937 644714050 648666534 644203568 640665283 644467239 649999924
3799.6F49999924P050705n644760j1643067Q71506K690735M415664L637238q487015
$$ 649999924 657050629 651405869 639762802 640634308 643325043 647740707 651377945 642890930
3807.3F42890930n142402M558372L652115J412353P05796K69165j38932K815094j424636
$$ 642890930 637748528 642306900 645959015 647371368 648077164 648346329 648207397 651022491 649597855
3816F49597855j3139954N223923O939926N328903N107498j9729004k440757O107444
$$ 649597855 636457901 641681824 648621750 653950653 659058151 639329147 636888390 642995834
3823.7F42995834K472000K578812J054077l448715j810150J207046M910508L050155
$$ 642995834 645467834 648046646 649100723 645652008 643841858 645048904 649959412 653009567
3831.4F53009567q896484K790451Q055572o362609k781754M972916p672806k658005
$$ 653009567 644113083 646903534 654959106 648596497 645814743 650787659 643114853 640456848
3839.2F40456848Q082199n337066j560212P700348k627487k964935L810196J114959
$$ 640456848 648539047 643201981 641641769 649342117 646714630 643749695 647559891 648674850
3846.9F48674850j703262n36117n97077K639542O564560l689041m67530j1175651M77104
$$ 648674850 646971588 646435471 645838394 648477936 655042496 651353455 650885925 639710274 640187378
3855.6F40187378Q736038l495483k945175K097930J781693K030258m760132L00827
$$ 640187378 648923416 645427933 642482758 644580688 646362381 648392639 643632507 643933334
3863.3F43933334M997864o780090l192482O154289M753037M346008o428375p742691
$$ 643933334 648931198 642151108 638958626 645112915 649865952 654211960 647783585 640040894
3871F40040894L438110N534973N201721r385071j672287M272690q35418R68093L988648
$$ 640040894 643479004 649013977 654215698 644830627 643158340 647431030 646595612 647563705 651552353
3879.7F51552353k805252q105164M665451M358216J851501L326798j2289353j072464
$$ 651552353 648747101 640641937 645307388 649665604 651517105 654843903 642554550 641482086
3887.4F41482086L717804K025910K691574j884995m008026p7057K722397K65732j32141
$$ 641482086 645199890 647225800 649917374 648032379 644024353 643947296 646669693 646935425 646803284
3896.1F46803284k053452M15573L458405o905899N534286M905777n584564K792282
$$ 646803284 644749832 645165405 648623810 641717911 647252197 652157974 646573410 649365692
3903.8F49365692k222137k925797q09402O73752K207641q96683k201461l07389K287979
$$ 649365692 647143555 644217758 643408356 644082108 646289749 645393066 643191605 642884216 645172195
3912.5F45172195k6321j056747J936645J993332m131317l161850M478760O04400l155670
$$ 645172195 645145874 644089127 646025772 648019104 643887787 640725937 645204697 645809097 642653427
3921.1F42653427K987671M027100Q80050l812866m207840J299973J348266l75747p73087
$$ 642653427 645641098 649668198 650548248 646735382 642527542 643827515 645175781 644800034 644026947
3929.8F44026947q73871K315674R46274j403275j33133j043090n72358r1552j11771
$$ 644026947 643153076 645468750 646415024 645011749 644878616 643835526 643263168 643171616 643059845
3938.5F43059845j238480p46612J569443m39606j799927J662445J839218p4691n22004
$$ 643059845 641821365 641074753 642644196 642204590 640404663 642067108 643906326 643831635 643309631
3947.2F43309631j330032N63507j96075k131424K599334K025223q81042m44870J70135
$$ 643309631 641979599 642543106 642347031 640215607 642814941 644840164 643959122 643514252 643684387
3955.8F43684387O80237j067200j597366j710281J82876K223053L16010l96118k16294
$$ 643684387 644364624 643297424 641700058 639989777 640172653 642395706 642711716 642315598 642099304
3964.5F42099304l85818q0033Q6747J048355J904678j026993k330398p50199L68576
$$ 642099304 641713486 641633453 641720200 642768555 644673233 643646240 641315842 640565643 640934219
3973.2F40934219K443085O98319j226349n6610K41775j307144k184525N94941L15857
$$ 640934219 643377304 644075623 642849274 642792664 643034439 641727295 639542770 640137711 640453568
3981.9F40453568J55181K141877K80532j213531o10352J007462J655579n44129k346039
$$ 640453568 640608749 642750626 643031158 641817627 641207275 642214737 643870316 643326187 640980148
3990.6F40980148L49732J670913r98840j038971k37198J45264L128j032219J79024
$$ 640980148 641329880 643000793 642001953 640962982 640725784 640871048 640874176 639841957 640020981
3999.2F40020981J772079
$$ 640020981 641793060
4000.2F41793060
$$ 641793060
##END=$$ End of the data block
