##TITLE=$$ Begin of the data block
##JCAMP-DX=5.00 $$ ACD/SpecManager v 10.08
##SPECTROMETER/DATA SYSTEM=Varian
##DATE=07 Jan 2013 10:17:40
##DATA TYPE=INFRARED SPECTRUM
##DATA CLASS=XYDATA
##ORIGIN=
##OWNER=
##NPOINTS=3735
##FIRSTX=399.26403809
##LASTX=4000.35498047
##MAXX=4000.35498047
##MINX=399.26403809
##MAXY=120.81624603
##MINY=2.55061889
##XFACTOR=1.0000000000
##YFACTOR=0.000001000000000
##FIRSTY=74.43158722
##DELTAX=0.96440572
##XUNITS=1/CM
##YUNITS=TRANSMITTANCE
##XYDATA=(X++(Y..Y))
399.3G4431587M6384659p5124165k9882297j1334876J8118714P083008l386085p256308
407A9034237j423506Q923491o450720m526637R788001J3786848J129051m623588M09912
415.7C6047089Q468670M785984k946301K195999P098660N384842j1988320k0217735
423.4B8828888P818249M580448j502697o571308l958067P187769J942886p132250j324066
432.1B9869852P532667Q110783K491321q620971r143763k422594K69888N578653l65078
440.7C3300758L823353P963642o855285p377451q297648m812860R265352Q182156K794681
449.4C7986698R85993K099907R213405j609886j2986767k850544J041821M562957R191346
458.1D7634930m435479m757461p347550j657663N965094K138008L618061n203610r017408
$$ y = [74431587, 120816246, 45692081, 15809784, 4474908, 22593622, 29676630, 26290545, 19034237, 17610731, 26534222, 20083502, 15556865, 25344866, 39131714, 40260765, 35637177, 36047089, 44515759, 49301743, 46355442, 48551441, 55650101, 61034943, 49046623, 28828888, 36647137, 41227585, 39724888, 33153580, 29195513, 36383282, 38326168, 31193918, 29869852, 37402519, 45513302, 48004623, 39383652, 30239889, 27817295, 28087183, 33665836, 33300758, 37124111, 45087753, 38232468, 30855017, 22557369, 17744509, 27009861, 35192017, 37986698, 38972691, 41072598, 50286003, 48676117, 35689350, 32838806, 33880627, 38443584, 47634930, 43199451, 38441990, 31094440, 29436777, 35401871, 37539879, 41157940, 35954330, 26936922]
466.8B6936922J761780K471050L288988J573509o182878r526348K411335L275377n178757
475.5B0830978N516064N032518j708097L573299j406969k879387j530313J413284P238907
484.1C6080284L557350n02956j780468J667644l640300o225846j818266k003534K708063
492.8B8041971O366499K48356O38039N394638j673649l635182l51425o683557j366043
501.5B6979647K963611J202065N553541l05077n986906m482441K70270M604820K038963
510.2C2838493K709813j314793m717583L871182L539390k144668L075382L254726n469215
518.9C5642727q182325j545329L618176R19144N56741J647040j856129J81551J042547
527.5C2024143j854030k32077j30814k054737N14229L806677J825504k241241p95880
$$ y = [26936922, 28698702, 31169752, 34458740, 36032249, 29849371, 20323023, 22734358, 26009735, 20830978, 26347042, 31379560, 29671463, 33244762, 31837793, 28958406, 27428093, 28841377, 36080284, 39637634, 39134678, 37354210, 39021854, 35381554, 29155708, 27337442, 25333908, 28041971, 34408470, 34656826, 35294865, 40689503, 39015854, 35380672, 35029247, 28345690, 26979647, 29943258, 31145323, 36698864, 36393787, 30406881, 25924440, 26194710, 30799530, 32838493, 35548306, 34233513, 29515930, 33387112, 36926502, 34781834, 37857216, 41111942, 35642727, 27460402, 25915073, 29533249, 30452393, 31009134, 32656174, 30800045, 30981596, 32024143, 30170113, 29938036, 29807222, 27752485, 28266714, 32073391, 33898895, 31657654, 30861774]
536.2C0861774P40077r19720k030548n03842L305371J886221j463942k620666j571179
544.9B7683546K204214K428215P06761n00290j368262L43714K274189J792999p37255
553.6C4827831q92563j309707k386053K14540K879158Q85582k689169K73220K639464
562.3C4442303o07880k16946M2298j607693j016758Q9623r26415o20436O21872j012035
571.9B9187933n60740J260592J038534J733765M36340k405783j674596P4197J331871
580.6C0422113J044785q92263k89065L16775K50070K82593j428814j7731J017328j05939
590.2C0599852L07739o09524k51381O83142J231153J144709q82744j071136p75029
598.9C0376781Q24099J503965m12460l78567j387636q25334l99851k068817q07598
$$ y = [30861774, 31601851, 30682131, 28651583, 28147741, 31453112, 33339333, 31875391, 29254725, 27683546, 29887760, 32315975, 33022736, 32522446, 31154184, 31497898, 33772087, 35565086, 34827831, 33935268, 32625561, 30239508, 30454048, 33333206, 34218788, 31529619, 31802839, 34442303, 33834423, 33617477, 33659775, 32052082, 31035324, 31124947, 30198532, 29578096, 30199968, 29187933, 28627193, 29887785, 30926319, 32660084, 33096424, 30690641, 29016045, 29090242, 30422113, 31466898, 30574635, 30285570, 30602345, 30852415, 31135008, 29706194, 29688463, 30705791, 30599852, 30907591, 30298067, 30046686, 30729828, 31960981, 33105690, 32222946, 31151810, 30376781, 31200880, 32704845, 32292385, 31913818, 30526182, 29700848, 29300997, 27232180, 26424582]
607.6B6424582l14826N76617M60277k007812k033938j491058O4056R71480P26360j686783
617.2B1688955k927131K20127J08192L5540J04164k037600j764995Q6632J791238R47026
626.9A8252148K10895J177674K535015J668537L00880N48031j863115r32726J810526
635.5B3707865O26777r64529j112630r08597r22849J343202J951899J819710K979702
644.2B8520550K309749J585675J75502K65168J458866J531261K76024j361729O6140
652.9C4827206o82568n67547R88663J36459k58224j171303J47720M69490J249939K093396
662.5C7233231l89294K67219k14077m69577J767921l6392k584835j68957J764401J093097
672.2C8262737l44707o79638k91081O11458K44381l1483k43663M8622m68655m99203
$$ y = [26424582, 26109756, 26686373, 27146650, 25138838, 23104900, 21613842, 21677898, 22649378, 23375738, 21688955, 18761824, 18981951, 19090143, 19125683, 19229847, 17192247, 15427252, 15513884, 17305122, 18252148, 18463043, 19640717, 22175732, 23844269, 24145149, 24693180, 22830065, 21897339, 23707865, 24334642, 23370113, 22257483, 21348886, 20426037, 21769239, 23721138, 25540848, 28520550, 30830299, 32415974, 32591476, 32856644, 34315510, 35846771, 36122795, 34761066, 34827206, 34144638, 33577091, 34565754, 34702213, 34443989, 33272686, 33420406, 33889896, 35139835, 37233231, 36843937, 37111156, 36897079, 36427502, 38195423, 38159031, 35574196, 35405239, 37169640, 38262737, 37918030, 37238392, 36947311, 37558769, 37803150, 37771667, 37528004, 37576626, 37107971, 36608768]
681.8C6608768L62793J376576R90051k365024j136975N74795J65951P52468o17672
690.5C6711731r72778m92737R34967P28561j268554r09039j162914m94492R48799P65683
700.2C4789227M33670j46775n41225j34937J38443O9469O59790K59724m78821p44373
709.8C4304192P4424J859578O11751j51974O89591M6810l73425o00639N39883J973053
719.5C8973244O22196j148468o80264N3025m67591k85099Q53573O28376J56086J64009
729.1C8869087j109100J71703J285145p24369k65678j45073N2429L05408j431694p7156
738.7C6930702J118401R13994R15996n60516j281101j25386R82029k61127j76460J502433
748.4C9958965Q98075R0866L04280Q57544j34407r22520M87347O37603N60299J340344
$$ y = [36608768, 36971561, 38348137, 39338188, 36973164, 35836189, 36410984, 36576935, 37329403, 36711731, 35738953, 35246216, 36181183, 36909744, 35641190, 34732151, 33569237, 33074745, 34023544, 34789227, 35222897, 35076122, 34534897, 34399960, 34538403, 34607872, 35267662, 35527386, 35048565, 34304192, 34378616, 36238194, 36849945, 36697971, 37387562, 37434372, 37060947, 36460308, 37000191, 38973244, 39595440, 38446972, 37766708, 37819733, 37352142, 37067043, 37920616, 38548992, 38705078, 38869087, 37759987, 37931690, 39216835, 38492466, 38226788, 38081715, 38134144, 38439552, 37007858, 36930702, 38049103, 38963097, 39879093, 39318577, 38037476, 37912090, 38894119, 38632992, 38456532, 39958965, 40857040, 40947906, 41252186, 42109730, 41975323, 41052803, 41540150, 42177753, 42738052, 44078396]
758D4078396Q95386m67465m95712N07805j62613n93979J19381L94951k33784n48962
767.7D3493404M86416r1690l5541J583473k56722j813648J22715Q28716j15398L08804
777.3D4510529L18939l25814l1417N94970J303448J092648Q08555N3566q08143l5347
787D7481934l30479n2769J300995J149979N38151l74684j419498j280499j40266M04331
796.6D7277195K62722J55354J066471J145591l85307L88477L61725j191833m12522
805.3D8667873n93647j215183j51382J147365J834107J19045n90744N18166l03978
814D9431622j68080n6511n25818N74131J88385k12436k45529m61480J58657L13229
823.6D8996170j86481p69246P2857N14653P7365k69184n34301p21791j187500J31832
$$ y = [44078396, 44973782, 44506317, 44010605, 44518410, 44355797, 43761818, 43881199, 44276150, 44042366, 43493404, 43979820, 43888130, 43852589, 45436062, 45179340, 43365692, 43488407, 44317123, 44201725, 44510529, 44829468, 44503654, 44472237, 45067207, 46370655, 47463303, 48271858, 48325424, 47517281, 47481934, 47151455, 47098686, 48399681, 49549660, 50087811, 49713127, 48293629, 47013130, 46872864, 47277195, 47539917, 47695271, 48761742, 49907333, 49522026, 49910503, 50272228, 49080395, 48667873, 48074226, 46859043, 46707661, 47855026, 49689133, 49808178, 49217434, 49735600, 49431622, 49263542, 49207031, 48681213, 49255344, 49443729, 49231293, 48985764, 48524284, 48682941, 48996170, 48809689, 48040443, 48113300, 48627953, 48705318, 48436134, 47901833, 47180042, 45992542, 46124374]
833.3D6124374q7631j428657j038807q74436m77173j20666o2798j318126j236725j71490
842.9C9307865o96873j36039L33965O14582L20664j72913k23629q09300L06664N23228
852.5C9368214L35426J128517O10451N31204L65727p62387M3724J819161O23073J17375
862.2D4180485P47261K57717N57842k80201o40754n62397J14440J012368m85413J37482
871.8D5038830J023529L0250q8928l5972J89655Q08357N24433p92427n03898Q96l23090
882.4D5871635m64073q05565q4598P4703p48867n14164L85597K85881m46670k3319
892.1D3530560J70482q5728J58654L83102K14958l5659K32498J87809k92301l36552
901.7D4127823j32645j94896r1618K92759L6144p17041n15068K65202n47406j483959
$$ y = [46124374, 46036743, 44608086, 43569279, 42694843, 42217670, 42097004, 42034206, 40716080, 39479355, 39307865, 38610992, 38474953, 38808918, 39423500, 39744164, 39571251, 39347622, 38538322, 38844986, 39368214, 39703640, 40832157, 41442608, 41973812, 42339539, 41577152, 41620876, 43440037, 44063110, 44180485, 44927746, 45185463, 45743305, 45463104, 44822350, 44259953, 44374393, 45386761, 44901348, 45038830, 46062359, 46092609, 46003681, 45967709, 46157364, 46965721, 47490154, 46697727, 46193829, 46194725, 45871635, 45407562, 44601997, 44517399, 44592102, 43843235, 43329071, 43714668, 44000549, 43553879, 43530560, 43701042, 43615314, 43773968, 44157070, 44372028, 44336369, 44568867, 44756676, 44464375, 44127823, 43995178, 43800282, 43708664, 44001423, 44037567, 43320526, 42805458, 43070660, 42523254, 41039295]
911.4D1039295m45820N87284m98165j368766k06105j82262m60808q6872p86686q58322
921C6732773m65656k961k39631j253842n63057M81556L63198l38360l45898J83315
930.7C4551437j71131l85299K37915O09806L24932K88719L36674L36605P08305R23637
940.3C7761600K17598n35392L14403R47148N10326P34444J168701R36008O48957L97068
949.9D3100861j40324k16614r7729j88045j6949J6060r121L7876M8725k03090q09994
960.6D1521656p70908m01841k52204k60960m91928m21951m42204k99698R3475j73233
970.2C8100204l26927l55983m76407j03462J81778R1530l11523l80711n3253Q0631
979.8C6445877K5719k85095j36094k08320k80434p3273q76094p67323l01460o16871
$$ y = [41039295, 40593475, 41180759, 40682594, 39313828, 39107723, 38925461, 38464653, 38377781, 37591095, 36732773, 36267117, 36264156, 36024525, 34770683, 34207626, 34689182, 35052380, 34714020, 34368122, 34551437, 34380306, 33995007, 34232922, 34842728, 35167660, 35456379, 35793053, 36129658, 36837963, 37761600, 37979198, 37443806, 37758209, 38705357, 39215683, 39950127, 41118828, 42054836, 42703793, 43100861, 42960537, 42743923, 42646194, 42458149, 42441200, 42457260, 42448139, 42486015, 42534740, 42331650, 41521656, 40750748, 40348907, 40096703, 39835743, 39343815, 38921864, 38479660, 38179962, 38273437, 38100204, 37773277, 37417294, 36940887, 36837425, 37019203, 37110733, 36799210, 36418499, 36365246, 36445877, 36471596, 36186501, 36050407, 35842087, 35561653, 35488380, 34612286, 33844963, 33543503, 32926632]
989.5C2926632m91547l22006J2219p13545k038195k067266j574883k56071J727427
998.2B7202765J840404M59322M96315N54365l64706m94743j84332j68490m2911J03554
1007.8B9401543k35192m82420m05641l8393j37737m88873j6098k52617p3269M17563
1017.5B7688866m34319p13877l57107m27601q27541j96333M88173k30273k83676O8026
1027.1B4774338m75720m19910K84729r350k13772n50762o36810J76622m49056n76790
1036.7B1903519M7897J05934P1385j30976Q5451l25253m58416R4111K81727J8202l66728
1047.4B1326853n8073K1349j17459K14148K15197n71099j41762N63378L0548M24753
1057B1907833K09650q1713J60286p17046p7267J041235k07270j245113j1095M36514
$$ y = [32926632, 32435085, 32113079, 32125298, 31411753, 29373558, 27306292, 25731409, 25475338, 27202765, 29043169, 29502491, 29998806, 30553171, 30188465, 29693722, 29509390, 29340900, 29297989, 29401543, 29166351, 28683931, 28278290, 28239897, 28102160, 27613287, 27597189, 27344572, 27271303, 27688866, 27254547, 26540670, 26183563, 25755962, 24928421, 24732088, 25220261, 24989988, 24706312, 24774338, 24298618, 23878708, 24163437, 24154087, 23940315, 23389553, 22752743, 22929365, 22480309, 21903519, 21951416, 22057350, 22128735, 21997759, 22083210, 21757957, 21299541, 21393652, 21675379, 21693581, 21326853, 21268780, 21290129, 21172670, 21386818, 21602015, 21030916, 20889154, 21452532, 21483080, 21907833, 22117483, 22035770, 22196056, 21479010, 21401743, 22442978, 22235708, 20990595, 20979500, 21416014]
1066.6B1416014n61007k01736M6926j65546J86903j73830j36021M27300n1403l95140
1076.3B0392460q92965m96296J080253N39482m74615R2041M96195j88877m19172m9378
1085.9B0079128M2301l70948n65918J46824j62833K46256l50426k139822l98880o2635
1095.6A6463047j222935q71398j43673k48198j221512o02890p91009p06316l13187
1104.2A0341929j073173o18961j10176O4219n63545q54320r82146q08386K03660O5117
1113.9E664218j53660l32546P991l1358m16441j38635J62661M91798J3648L12157J96811
1124.5E776644j93475L67357K0344j12151O3877L23143J59680m20611k04469n0581
1134.1E729758m35063l51225J89512J04954q2739o60483n31666J18062k30006J82433
$$ y = [21416014, 20855007, 20653271, 20700197, 20534651, 20721554, 20547724, 20411703, 20839003, 20787600, 20392460, 19499495, 19003199, 20083452, 20622934, 20148319, 20240360, 20736555, 20547678, 20128506, 20079128, 20121429, 19750481, 19184563, 19331387, 19168554, 19414810, 19064384, 16924562, 16525682, 16463047, 15240112, 14368714, 14225041, 13976843, 12755331, 12152441, 11361432, 10655116, 10341929, 9268756, 8649795, 8539619, 8603838, 8040293, 7185973, 6203827, 5395441, 5599101, 5664218, 5510558, 5178012, 5186003, 5154645, 4738204, 4599569, 4762230, 5254028, 5267676, 5579833, 5776644, 5583169, 5950526, 5970870, 5858719, 5922596, 6245739, 6405419, 5984808, 5780339, 5729758, 5294695, 4943470, 5132982, 5237936, 5155197, 4494714, 3963048, 4081110, 3851104, 4033537]
1143.8D033537M3561m50170r5455k48463j38496L8408l07935k50885p3483J41264L25092
1154.4C016975J20375J06516k67143o6858K59195J59741M05689k54983J82953M26031
1164D088491j31415L12517p4805r5576L18300O50994O92246N98232L44733k55878M10720
1174.6F858559N85181M53902N37773M14164O10483N98579Q44634O67001M95217P28613
1184.3A2794106Q47596O16353J64422M41794N81661K80171K47485N58375O29986L78233
1193.9A7540182K77792L65677N41866M77030L65463L14715M76234N76599P26197P19299
1203.6B2381054J47804K08101L96206K45682J42031K78391M71811L05416L00470O7255
1213.2B4944221l8236Q5152K18998L60885n430N2318N1783l40448j85793J88429J53534
$$ y = [4033537, 4077098, 3626928, 3531473, 3283010, 3144514, 3182922, 2874987, 2624102, 2550619, 2691883, 3016975, 3137350, 3243866, 2976723, 2909865, 3169060, 3328801, 3734490, 3479507, 3662460, 4088491, 3957076, 4269593, 4194788, 4099212, 4417512, 5068506, 5760752, 6358984, 6703717, 6447839, 6858559, 7443740, 7897642, 8435415, 8849579, 9460062, 10058641, 10903275, 11570276, 12065493, 12794106, 13641702, 14258055, 14422477, 14864271, 15445932, 15726103, 15973588, 16531963, 17161949, 17540182, 17817974, 18183651, 18725517, 19202547, 19568010, 19882725, 20358959, 20935558, 21661755, 22381054, 22528858, 22736959, 23133165, 23378847, 23520878, 23799269, 24271080, 24576496, 24876966, 24944221, 24905985, 24991137, 25210135, 25571020, 25565590, 25617908, 25669691, 25329243, 25143450, 25331879, 25485413]
1223.8B5485413L4538L42708L85071J82444k45516m61418j27466K3363J58405N6696
1233.5B5834238J23701K25264n2330J4425Q3881O922J13047K97724J86721k552O0166
1244.1B6891207o2283k39733O1667L84443J55861j02659J7200L24746K8427m59502
1253.7B6999374j51422J88471J59515r3857j00067J78379K22695r5009k65881K87579
1263.4B7329777L76886J19789Q2896j30463J23875K98334K14964K70397O0890M1012
1273B8788357L09685K70029K06873K80195J49929j0546J33469K82480J02827N4504
1282.7C0567802J46388L74317M81022L82057N06922L72909L10738J32538Q0513J32030
1292.3C3487236j04801M41776O06758K89509K46662J14338K08336L91483N16930Q0635
$$ y = [25485413, 25519951, 25862659, 26247730, 26430174, 26184658, 25723240, 25595774, 25619137, 25777542, 25834238, 25957939, 26183203, 26130873, 26145298, 26229179, 26236101, 26349148, 26646872, 26833593, 26831041, 26891207, 26828924, 26589191, 26650858, 27035301, 27191162, 27088503, 27105703, 27430449, 27458876, 26999374, 26847952, 27036423, 27195938, 27102081, 27002014, 27180393, 27403088, 27308079, 27042198, 27329777, 27706663, 27826452, 27909348, 27778885, 27902760, 28201094, 28416058, 28686455, 28747345, 28788357, 29098042, 29368071, 29574944, 29855139, 30005068, 29994522, 30127991, 30410471, 30513298, 30567802, 30714190, 31088507, 31569529, 31951586, 32458508, 32831417, 33142155, 33274693, 33355206, 33487236, 33382435, 33824211, 34430969, 34720478, 34967140, 35081478, 35289814, 35681297, 36198227, 36278862]
1301.9C6278862j43173J72264K21821L14224L55343J93905l4424k3113L0902r2243
1311.6C7274368O0414M27265L10821k1625K6558j0777J24798L54973J26190j67499
1321.2C8505486o5320M40632K93579k21786j22513J96175N5835o6223K82299J8143
1330.9C9316307j27506J45641N9967Q9359J141J07239l3505m20021K2713J01688K2026
1341.5C9285049L7022n337L75588J18240k57286n2799o1287j26747j71589q8940R6581
1352.1C9148495Q5514J21734J19759k03594k88727j68644j72832k4392k20310j77719
1361.7C8219284M44599J80363j53126j42208k07371J1963q972j56578k75425k58152
1371.4C7654377n19J8746j45935k79896j01967P7125j97586l77960j03K48688Q4713
$$ y = [36278862, 36135689, 36307953, 36529774, 36843998, 37199341, 37393246, 37358822, 37335709, 37366611, 37274368, 37334782, 37762047, 38072868, 38051243, 38077801, 38067024, 38191822, 38546795, 38672985, 38505486, 38440166, 38880798, 39174377, 38952591, 38830078, 39026253, 39082088, 39015865, 39298164, 39316307, 39188801, 39334442, 39394409, 39483768, 39484909, 39592148, 39558643, 39138622, 39161335, 39263023, 39285049, 39322071, 39316734, 39692322, 39810562, 39553276, 39500477, 39439190, 39312443, 39140854, 39051914, 39148495, 39234009, 39355743, 39475502, 39271908, 38983181, 38814537, 38641705, 38617313, 38397003, 38219284, 38663883, 38844246, 38691120, 38548912, 38341541, 38353504, 38344532, 38187954, 37912529, 37654377, 37653858, 37672604, 37526669, 37246773, 37144806, 37221931, 37024345, 36646385, 36646282, 36894970, 36979683]
1382C6979683k5387j05804L9364K69680Q5613M8340l7529j69667K2488N3368M8179
1392.6C7208328J67351p1423l71929p5622J35181l5446m38793k18735J12949K29424
1402.2C6641285o5823k61192j74110j72638Q9496o7043k07115K4563j28189l8960Q820
1412.8C5649094k2709j5980k46239j43432r1412r1957J65039J86390J27571j6106M4915
1423.4C5545174J38607k3163N0388J86745J21689o4495j04264K31366K32456q7727
1433.1C6226776Q8577L24097J86115l49018J24832M82308J88042Q4842O7597K27291
1442.7C7651459J15818k26685K84500K92218p2022L1010Q2653k9118J07495K57480
1452.4C8494808j12549J22933M40510M76085j35090m54284L41816J71840L40840L42037
$$ y = [36979683, 36954296, 36848492, 36887856, 37157536, 37243149, 37291489, 37253960, 37084293, 37106781, 37160149, 37208328, 37375679, 37304256, 36932327, 36856705, 36991886, 36956440, 36517647, 36298912, 36411861, 36641285, 36575462, 36314270, 36140160, 35967522, 36057018, 35989975, 35782860, 35807423, 35679234, 35640274, 35649094, 35626385, 35610405, 35364166, 35220734, 35129322, 35037365, 35202404, 35388794, 35516365, 35500259, 35545174, 35683781, 35660618, 35711006, 35897751, 36019440, 35954945, 35850681, 36082047, 36314503, 36226776, 36315353, 36639450, 36825565, 36476547, 36601379, 37083687, 37271729, 37356571, 37424168, 37651459, 37767277, 37540592, 37825092, 38117310, 38045288, 38076298, 38158951, 38129833, 38237328, 38494808, 38382259, 38505192, 38945702, 39421787, 39286697, 38832413, 39174229, 39346069, 39686909, 40028946]
1462D0028946K46578J52424J36936K24529j62433J50051K14466K16179L87443J37070
1471.7D1732189K21485J44871M21879M53140L15052L56804L66600K39861K62066M61917
1481.3D4975864J93287J25618Q7902K54765M05365l18150l21628L59371J70422j64750
1491D5768066R9087J18622j84925k6928K42039o28479k22458k4361k17331J26549j42933
1501.6D4906948l83919j41182O0704L66069K36748j588772k03174O9626l28541k13734
1511.2D2780773k46002k86133k62192l76827l52661l71162R4535O0296p4566k21375
1520.8D0744686P4185q1315r7900Q4564p2250l6915J4519N0365l07625m51080k97871
1531.5C9623363j87061r0523j5132J43909j00201m1927L58047L02979n43293n17338
$$ y = [40028946, 40275524, 40427948, 40564884, 40789413, 40626980, 40777031, 40991497, 41207676, 41595119, 41732189, 41953674, 42098545, 42520424, 42973564, 43288616, 43645420, 44012020, 44251881, 44513947, 44975864, 45169151, 45294769, 45382671, 45637436, 46042801, 45724651, 45403023, 45762394, 45932816, 45768066, 45867153, 45985775, 45800850, 45773922, 46015961, 45387482, 45165024, 45140663, 44923332, 45049881, 44906948, 44523029, 44381847, 44442551, 44808620, 45045368, 43456596, 43253422, 43323048, 42994507, 42780773, 42534771, 42248638, 41986446, 41609619, 41256958, 40885796, 40980331, 41040627, 40966061, 40744686, 40818871, 40737556, 40639656, 40724220, 40651970, 40615055, 40629574, 40679939, 40372314, 39921234, 39623363, 39436302, 39345779, 39330647, 39474556, 39374355, 39332428, 39690475, 39993454, 39450161, 38932823]
1541.1C8932823l81923j64021M39068L74538l54854Q0333P7122j34621J33389L70293
1550.7C9372147J8825L1086K25578P1278K68581L56556q9931j399494r8465J053653
1560.4C9809814O04393M93065L70121K30080j18908j76937K01519L69534J06838k56478
1570D1633041K94827J1452k62898p5271P9578j15086l14235L66211j06957k11544j97750
1580.6D1101368l70041j46278k79187m3266O3339r7107k21622l38917k72034m29580
1590.3C8966675k36717l36247k68158k78229l96263l40458n76599r1575q3264l82839
1599.9C5976326n40951l09185j95339m97925k39631k47960j33094m82052l41645k20878
1609.6C2767666n09327P587k10292m78301n03149J75549L75393j002705k37480l02870
$$ y = [38932823, 38550900, 38386879, 38825947, 39200485, 38845631, 38925964, 39003086, 38868465, 39001854, 39372147, 39390972, 39422058, 39647636, 39718914, 39987495, 40344051, 40254120, 38854626, 38756161, 39809814, 40414207, 40907272, 41277393, 41507473, 41388565, 41211628, 41413147, 41782681, 41889519, 41633041, 41927868, 41939320, 41676422, 41601151, 41680729, 41565643, 41251408, 41617619, 41510662, 41299118, 41101368, 40731327, 40585049, 40305862, 40262596, 40325935, 40228828, 40007206, 39668289, 39396255, 38966675, 38729958, 38393711, 38125553, 37847324, 37451061, 37110603, 36534004, 36442429, 36359165, 35976326, 35435375, 35126190, 34930851, 34432926, 34193295, 33945335, 33812241, 33330189, 32988544, 32767666, 32258339, 32265926, 32055634, 31577333, 31074184, 31249733, 31625126, 30622421, 30384941, 30082071]
1619.2C0082071k64030l68666P3130M0983o78854j51222j31216q3952m56173P3454
1628.9B8135525j58270k62533j8626k16079K9953m79439l25819Q2395j37971O3222
1638.5B6712358r3254Q7660j8013L8138k58250K5473L19426K77702Q0110n51218R203
1649.1B6629335J9371L69313L69577N44373j066120n83088P01622L16730M02773K99114
1658.8B8003000J64778J02079L1866K60758L3665L73888J29596J47080L94012N18345
1668.4C0159067L48702R8589P35372N6845J25717R8248k68824M32188M41601O58581
1678C2886086M19368L95111L83801M74502P55650K63370n57537O13450P18830K69271
1687.7C6621902M79577O17374K69405M57398M86080O69220O58913L79646l5503J090004
$$ y = [30082071, 29818041, 29449375, 29522505, 29563488, 28884634, 28733412, 28602196, 28518244, 28062071, 28135525, 27977255, 27714722, 27696096, 27480017, 27509970, 27030531, 26704712, 26787107, 26649136, 26712358, 26619104, 26706764, 26688751, 26726889, 26468639, 26494112, 26813538, 27091240, 27171350, 26620132, 26629335, 26648706, 27018019, 27387596, 27931969, 26865849, 26282761, 26984383, 27301113, 27703886, 28003000, 28167778, 28269857, 28301723, 28562481, 28596146, 28970034, 29099630, 29246710, 29640722, 30159067, 30507769, 30606358, 31341730, 31398575, 31524292, 31622540, 31353716, 31785904, 32227505, 32886086, 33305454, 33700565, 34084366, 34558868, 35314518, 35577888, 35020351, 35633801, 36352631, 36621902, 37101479, 37718853, 37988258, 38445656, 38931736, 39600956, 40259869, 40639515, 40604012, 41694016]
1697.3D1694016R94163M85325P061L53012J047962P25262O15745N76508N63702O23924
1707D7686680M64443M79607L11248M46705O32935N46856L34873L5820L88195O17287
1716.6E1944649N60650m42028J78398N41069J71463O5651J37748K93087L16433J17215
1726.3E3884335J92016J63204N1308J0880R0297L76438N16961M4124n44556K93587
1735.9E5078594K10259K58568O14074J87363j91383L27587L09471L02303K45518K54330
1745.5E7596684L22105O00925M64451q4057L59070K22450L46932O55865L76449L65414
1755.2F1226288L81626J72581J66431K16816J71967L07445J92745J26740L57532J16898
1764.8F3437069O6978J62167Q3588j06682L43181O98636L50318m40452m24050M27323
$$ y = [41694016, 42688179, 43173504, 43180565, 43533577, 44581539, 45306801, 45922546, 46499054, 47062756, 47686680, 48151123, 48630730, 48941978, 49388683, 50021618, 50568474, 50903347, 50939167, 51327362, 51944649, 52505299, 52063271, 52241669, 52782738, 52954201, 53019852, 53157600, 53450687, 53767120, 53884335, 54076351, 54239555, 54290863, 54301743, 54392040, 54768478, 55285439, 55329563, 54785007, 55078594, 55288853, 55547421, 56161495, 56348858, 56157475, 56485062, 56794533, 57096836, 57342354, 57596684, 57918789, 58519714, 58984165, 58900108, 59259178, 59481628, 59828560, 60484425, 60860874, 61226288, 61607914, 61780495, 61946926, 62163742, 62335709, 62643154, 62835899, 62962639, 63320171, 63437069, 63504047, 63666214, 63749802, 63643120, 63986301, 64684937, 65035255, 64594803, 64170753, 64598076]
1774.5F4598076K05955k41218J74537K80930L60168P401j41190K13349J29921J33682
1784.1F5721611J5144k3574P9292M8218k22K59041L68118j11969n50323J78902O53251
1794.7F6637489J0041k70234J24955J40525M3412k29706J09550K21802J77017m4555
1804.4F6920296j46805L85498J42403q9081K08519k472k16362K13318L03947k9358
1814F7689903k2789J9982j9722n3871J64215K58598j25099k22901q1413L84659M28085
1824.6F8419647l98224L6873L89549n9120k09892J266J93017K53379Q7708J6357R156
1835.2F8739716K2300O0234q9409k4162J14914N6511K4094K55996K48566k63115o0272
1845.8F9085373K3323l9452m3220P3570J55464J43303K7207j01487J22506J12495j21025
$$ y = [64598076, 64804031, 64562813, 64737350, 65018280, 65378448, 65385849, 65244659, 65458008, 65587929, 65721611, 65736755, 65713181, 65792473, 65840691, 65840469, 66099510, 66467628, 66355659, 65805336, 65984238, 66637489, 66647530, 66377296, 66502251, 66642776, 66686188, 66456482, 66566032, 66787834, 66964851, 66920296, 66773491, 67158989, 67301392, 67212311, 67420830, 67418358, 67201996, 67415314, 67719261, 67689903, 67667114, 67687096, 67667374, 67613503, 67777718, 68036316, 67911217, 67688316, 67606903, 67991562, 68419647, 68021423, 68058296, 68447845, 68388725, 68178833, 68180099, 68373116, 68626495, 68714203, 68730560, 68739716, 68762016, 68822250, 68732841, 68708679, 68823593, 68880104, 68904198, 69160194, 69408760, 69145645, 69085373, 69108696, 69069244, 69026024, 69099594, 69255058, 69398361, 69425568, 69324081, 69446587, 69559082, 69438057]
1856.4F9438057j62514j12076L0251J62842J66404O1661P6927k2049P4479J06056p8972
1867.1F9741066J04286j42357j03233K51007J20003Q4k7680p2670j21605P7065J32774
1877.7F9958740J08261n2963k99339o0822J69457J20399j1535J21154R4429q6349R1301
1888.3G0152733K3186k67708k7184J76232m8806j32064L2463J76231K02629K2820j3939
1898.9G0296593k4674L8491k9000j16256R0721O6276j19537j68526J22009K7886j69396
1909.5G0014587J03531M036p7423m6249Q9004J40999J11931J06514l02673k14447J09329
1920.1G0039139J33079J06049L197j07239J5632O5270l6827j8211q7639Q8043P3074
1930.7G0273567j33049m2526l3539Q2832O1158M0107r4375j43639J10825P7148N9433
$$ y = [69438057, 69275543, 69163467, 69193718, 69356560, 69522964, 69584625, 69661552, 69639503, 69713982, 69820038, 69741066, 69845352, 69702995, 69599762, 69850769, 69970772, 69970856, 69943176, 69870506, 69748901, 69825966, 69958740, 70067001, 70014038, 69714699, 69653877, 69823334, 69943733, 69932198, 70053352, 70147781, 70061432, 70152733, 70175919, 69908211, 69881027, 70057259, 70008453, 69876389, 69908852, 70085083, 70287712, 70310532, 70296593, 70271919, 70310410, 70281410, 70165154, 70255875, 70322151, 70202614, 70034088, 70156097, 70183983, 70014587, 70118118, 70122154, 70044731, 69998482, 70087486, 70228485, 70340416, 70446930, 70144257, 69929810, 70039139, 70172218, 70278267, 70281464, 70174225, 70189857, 70255127, 70218300, 70200089, 70112450, 70200493, 70273567, 70140518, 70097992, 70064453, 70147285, 70208443, 70248550, 70154175, 70010536, 70121361, 70198509, 70257942]
1941.3G0257942j00410j26908M4327J45729P7042k18125k2781K7435N4291Q6472j49353
1951.9G0075661j28159M4998R0813j05980l609Q2634O7116J04714j35651M27K17125
1962.5G0310089l1212k68676M27J96319j11648r4773J09353R6382q1551j08131Q3419
1973.1G0099998K4216m3922N7838m7890j64894j03202J5678J14357j01959n0438K01530
1983.7G0001312m8820j82518l4378J40777K5597k35092m3900J66771k4223j42258K3827
1994.3F9647095L2844O1569l7933k07291j15669j6891N6999L7399J30913Q4213j28982
2005F9544266j21178K9053Q3168o4018J09153r5771l07343Q8837K8732q6891q3618
2015.6F9124390J19712K49321j30188p7514q934j69213n5236L3897O0532J80641N173
$$ y = [70257942, 70157532, 70030624, 70074951, 70220680, 70297722, 70079597, 70056816, 70084251, 70138542, 70225014, 70075661, 69947502, 69992500, 70083313, 69977333, 69973724, 70056358, 70123474, 70228188, 70092537, 70092964, 70310089, 70278877, 70010201, 70010628, 70206947, 70095299, 70000526, 70109879, 70206261, 70124710, 70016579, 70099998, 70124214, 70080292, 70138130, 70090240, 69925346, 69822144, 69837822, 69952179, 69850220, 69799782, 70001312, 69952492, 69769974, 69735596, 69876373, 69901970, 69666878, 69622978, 69789749, 69765526, 69623268, 69647095, 69679939, 69741508, 69703575, 69496284, 69380615, 69363724, 69420723, 69458122, 69589035, 69673248, 69544266, 69423088, 69452141, 69535309, 69471291, 69580444, 69484673, 69177330, 69266167, 69294899, 69208008, 69124390, 69244102, 69493423, 69363235, 69285721, 69276787, 69107574, 69052338, 69086235, 69146767, 69327408, 69332581]
2026.2F9332581j59905j08795j96251j31920J3718M2488r6321m5006J83754L5637j07170
2036.8F8762810n1720q568j08352j72470m5128K22137K68036o9305j55243j27076o4743
2047.4F8450378l8864j08635L5942J8967l7102o6841n440J16028j6227k6505K2423
2058F8344124j27876j49987k525O9572J05660j28212k22641L853Q034P0625l8841j16837
2069.6F7814949n9196j41694q1825j16653j16280K533Q6098K9053l0663j2871j0689
2080.2F7362762K0249j56998o9900P4714m1908o4812r3406j297K9220K3751O5536Q3771
2091.7F7231682L1593o5811o920m6547p8171l6277L7429M9447l6789J9043N0827J22261
2103.3F7271767J41678p9438j10954Q9630O1516N8937R3681j9607k190r9823j465K41806
$$ y = [69332581, 69172676, 69063881, 68867630, 68735710, 68749428, 68791916, 68695595, 68650589, 68834343, 68869980, 68762810, 68711090, 68702522, 68594170, 68421700, 68376572, 68598709, 68866745, 68797440, 68642197, 68515121, 68450378, 68411514, 68302879, 68338821, 68357788, 68320686, 68253845, 68248405, 68364433, 68348206, 68321701, 68344124, 68216248, 68066261, 68063736, 68133308, 68238968, 68110756, 67888115, 67891968, 67900002, 67970627, 67931786, 67814949, 67755753, 67614059, 67532234, 67415581, 67299301, 67301834, 67387932, 67416985, 67386322, 67373451, 67362762, 67383011, 67226013, 67156113, 67230827, 67188919, 67124107, 67030701, 67029404, 67058624, 67082375, 67147911, 67231682, 67263275, 67197464, 67190544, 67143997, 67065826, 67029549, 67066978, 67116425, 67079636, 67098679, 67149506, 67271767, 67413445, 67334007, 67223053, 67312683, 67374199, 67433136, 67526817, 67507210, 67505020, 67405197, 67403732, 67645538]
2114.9F7645538J14678p9918m8691K5658m8294k625j07513o0166J68640p515j48956
2125.5F7450836q8142o645p2396k205M1108N3962j4686k00447J20712J06056J5221
2136.1F7403374r842j51062O1737N7175M0557q659P3044m8226r2056K41112J2649l5270
2147.7F7544533q6457k8808O7985o6543K37564K13837q0254r0118J05346o7116j09237
2158.3F7640732J23596R5818J04972j19812L3883L5888l8917N7045j96770N8861J15555
2168.9F7910851K5810j5976l8788m1336j01853J60653k37l8391p4387l5919K4010j63490
2180.5F7610947Q9592j06148J0734K24945P195k2781J8860L29719P8934j01204n3574
2191.1F8087219j15059J6487o0760P8857J42708J15807J72714J32164K0401k1149O2569
$$ y = [67645538, 67760216, 67680298, 67631607, 67657265, 67608971, 67606346, 67498833, 67438667, 67607307, 67599792, 67450836, 67362694, 67356049, 67283653, 67281448, 67322556, 67376518, 67361832, 67161385, 67282097, 67388153, 67403374, 67393532, 67242470, 67304207, 67361382, 67401939, 67393280, 67466324, 67418098, 67326042, 67567154, 67579803, 67544533, 67458076, 67429268, 67497253, 67430710, 67668274, 67882111, 67801857, 67711739, 67817085, 67749969, 67640732, 67764328, 67860146, 67965118, 67845306, 67879189, 67915077, 67876160, 67933205, 67736435, 67795296, 67910851, 67936661, 67920685, 67881897, 67840561, 67738708, 67899361, 67899124, 67860733, 67786346, 67750427, 67774437, 67610947, 67700539, 67594391, 67605125, 67830070, 67837265, 67814484, 67833344, 68163063, 68241997, 68140793, 68087219, 67972160, 67988647, 67927887, 68006744, 68149452, 68265259, 68437973, 68570137, 68590538, 68569389, 68631958]
2201.7F8631958k2400Q4267N0842q7128K9778k0447j73042l8849K40730R6993m4159
2212.3F8748543J34216J73241j55358j95709J4023q9767J68701L21167P896j95175
2221.9F8931778n8357Q0764j18148p1007M0565J75255J05149k58698p5012K69882J5854
2232.5F9038025l47046O805L00324R3307j34155j04713M6440p9956k75L8193m0131
2243.2F8816818r575K945k182j09054O2492J4458n3711J62918J84822J76086j14509
2253.8F9131508k90505k5085P7148j21902p4349Q9875L1486J20995J11626n8106j26099
2264.4F8866592m2427N4108R2590Q9043m9400r8015r3590R6947K01835L0892q7593
2275F9060982k03362m7516J74271J06255k5414J8959J3802p3433j42151j51802J20590
$$ y = [68631958, 68609558, 68693825, 68744667, 68657539, 68687317, 68666870, 68493828, 68454979, 68695709, 68792702, 68748543, 68882759, 69056000, 68900642, 68704933, 68718956, 68629189, 68797890, 69119057, 69126953, 68931778, 68873421, 68954185, 68836037, 68765030, 68805595, 68980850, 69085999, 68827301, 68752289, 69022171, 69038025, 68690979, 68697784, 68998108, 69091415, 68957260, 68852547, 68898987, 68819031, 68818756, 68856949, 68816818, 68807243, 68810188, 68808006, 68698952, 68761444, 68775902, 68722191, 68885109, 69069931, 69246017, 69131508, 68841003, 68815918, 68893066, 68771164, 68696815, 68786690, 68818176, 68939171, 69050797, 68992691, 68866592, 68824165, 68878273, 68970863, 69059906, 69010506, 68912491, 68818901, 68915848, 69117683, 69148575, 69060982, 68857620, 68810104, 68984375, 69090630, 69065216, 69084175, 69097977, 69024544, 68882393, 68730591, 68851181]
2285.6F8851181J51421P5790J617j48994p240J43112J38512o7910j36787j01830J17653
2296.2F9016525K33116l4675N0659j20132j39496J58050K5925q1635n9814J35841J05217
2306.8F9289581r2399k98981j56647K42180j3161j21734J21353K76703O4476n5283
2316.4F9256088J28495j01738l22419o3194L45253j56372k56355K46528j00639p1129
2326.1F8904518r5390p9743K7558O4010M59565J53846k89978n76393l05298L41881
2335.7F8604576M14757L07564j11641l72391j08521N8541L73184L20984j49765M1641
2345.4F9378929J32561Q575P1381O0013j06056k41692Q3351M6143n9578J49063J98997
2356F9721687P2785o43830j07681L63594k05597K21810M03595l00301l45253L87604
$$ y = [68851181, 69002602, 69078392, 69080009, 68931015, 68923775, 69066887, 69205399, 69137489, 69000702, 68898872, 69016525, 69249641, 69214966, 69265625, 69145493, 69005997, 69164047, 69189972, 69108337, 69048523, 69184364, 69289581, 69197182, 68898201, 68741554, 68983734, 68970573, 68848839, 68970192, 69246895, 69311371, 69256088, 69384583, 69282845, 68960426, 68897232, 69242485, 69086113, 68829758, 69076286, 68975647, 68904518, 68809128, 68729385, 68756943, 68820953, 69280518, 69434364, 69144386, 68567993, 68262695, 68604576, 69019333, 69326897, 69215256, 68842865, 68734344, 68792885, 69166069, 69487053, 69337288, 69378929, 69511490, 69520065, 69591446, 69651459, 69545403, 69303711, 69387062, 69433205, 69373627, 69522690, 69721687, 69794472, 69150642, 69042961, 69406555, 69200958, 69422768, 69826363, 69526062, 69180809, 69568413]
2365.6F9568413R4200j31767K72575K32864J198k99469j98784J31554J55319j11358
2375.3F9714745M5005J18615j49239J36780J62239j41068q9531N5092J01021Q1024
2384.9G0034683q278r9685n8861N8510J97113m814j06003R8816J5510o3781j96869
2395.5F9866341j49697J06163J80542Q3023j35322n6000J5793N2673K6436j10824P0724
2406.1F9949852N7716p3875j2878j5175p7370j72188j46522J02028K40188J03851k6313
2416.7F9929314o4270p8064j20072j53290j39030O3332J05041m4525J17592P5653P957
2427.3F9699638j5678p7126P4318q7715j52336p7476k0897J47842J43951o3995l06801
2438F9263725j70578N5397J75553R5993J1978P6897j34003j02211K144j52611j77734
$$ y = [69568413, 69662613, 69530846, 69803421, 70036285, 70037483, 69738014, 69539230, 69670784, 69826103, 69714745, 69759750, 69878365, 69729126, 69865906, 70028145, 69887077, 69797546, 69852638, 69953659, 70034683, 70026405, 69926720, 69867859, 69926369, 70123482, 70118668, 70012665, 70111481, 70126991, 70063210, 69866341, 69716644, 69822807, 70003349, 70086372, 69951050, 69895050, 69910843, 69963516, 69989952, 69879128, 69949852, 70007568, 69933693, 69920815, 69905640, 69828270, 69656082, 69509560, 69611588, 69851776, 69955627, 69929314, 69865044, 69786980, 69666908, 69513618, 69374588, 69437920, 69542961, 69498436, 69616028, 69691681, 69699638, 69683960, 69606834, 69681152, 69593437, 69441101, 69363625, 69342728, 69490570, 69634521, 69570526, 69263725, 69093147, 69148544, 69324097, 69420090, 69432068, 69508965, 69374962, 69272751, 69274895, 69122284, 68944550]
2448.6F8944550m349J04965M6989k4337q5266L952K4788Q3297p7080k46757j221j7166
2460.1F8752365N2895k0966p2578J28753k3971j50994j28318J45492L9910j86768l4737
2470.7F8501083l9703k7405j12564N1705J03630j46134r5817k7413P4799J27052R1477
2481.3F8500710q7533j82662r0256j8601J58249J30905r4856k45026j48216m7691m5921
2492F7829102N1506J06735L3935k39898j96251P3723k7649k13784n142K72049P8171
2502.6F7762497j23428j00861Q2947R2338m6173L8033j45043j66305J19949J11115
2512.2F7625069l9742j36093j50017r5062J0086L769k3438L6103L0784p6156j21949
2522.8F7063354k5413M0382m9926j66535j4908J04927J07994k9373k04956L6072Q7036
$$ y = [68944550, 68940201, 69045166, 69092155, 69067818, 68982552, 68986504, 69011292, 69094589, 69017509, 68770752, 68769531, 68752365, 68805260, 68784294, 68711716, 68840469, 68816498, 68665504, 68537186, 68682678, 68722588, 68535820, 68501083, 68461380, 68433975, 68321411, 68373116, 68476746, 68330612, 68234795, 68207382, 68282181, 68409233, 68500710, 68413177, 68230515, 68140259, 68121658, 68279907, 68410812, 68315956, 68070930, 67922714, 67875023, 67829102, 67880608, 67987343, 68021278, 67781380, 67585129, 67658852, 67631203, 67417419, 67412277, 67684326, 67762497, 67639069, 67538208, 67621155, 67713493, 67667320, 67705353, 67560310, 67394005, 67513954, 67625069, 67585327, 67449234, 67299217, 67204155, 67214241, 67218010, 67194572, 67230675, 67261459, 67185303, 67063354, 67037941, 67078323, 67028397, 66861862, 66846954, 66951881, 67059875, 67030502, 66825546, 66861618, 66948654]
2533.4F6948654M9805P7080p6165k3590J4992p1854j35063k2659k6634j19355L0968
2544F6646179O2615K7069k4132K4986K2347o3179O1927j731o1303j4167l6446o6948
2555.6F6577217j41403m4434P1968O5117L9994l0877p1083m4563q2001j01852Q3870
2566.2F6321953J62338Q4679J03103j50032k67036J84448J72142k22328k35382j09970
2575.9F6043915k1713K9602M9263j4382J2200K0355j20911r7946m4853l7682m0214
2586.5F5777634O8473R9083j18362p3441M0543m745o081n4779k9587Q1009o5163j90643
2598F5523941q4907o7574p561N7152N1186n9731j20659J03836M990k57874n1986J72722
2609.6F5263535n5970k96974j35391J54823J5564k89047K006J24962k2705p385q2680
$$ y = [66948654, 66998459, 67075539, 66999374, 66975784, 66990776, 66918922, 66783859, 66761200, 66734566, 66615211, 66646179, 66708794, 66735863, 66711731, 66736717, 66759064, 66695885, 66757812, 66756081, 66694778, 66680611, 66644165, 66577217, 66435814, 66391380, 66463348, 66528465, 66568459, 66537582, 66466499, 66421936, 66339935, 66238083, 66321953, 66484291, 66568970, 66672073, 66522041, 66255005, 66439453, 66611595, 66389267, 66153885, 66043915, 66022202, 66051804, 66101067, 66086685, 66098885, 66119240, 65998329, 65900383, 65855530, 65817848, 65777634, 65846107, 65945190, 65826828, 65753387, 65793930, 65789185, 65783104, 65728325, 65698738, 65779747, 65714584, 65523941, 65439034, 65371460, 65363899, 65421051, 65472237, 65412506, 65291847, 65395683, 65400673, 65142799, 65090813, 65263535, 65207565, 64910591, 64775200, 64930023, 64945587, 64656540, 64658546, 64783508, 64760803, 64753418, 64670738]
2620.2F4670738R5917J1215j08253m58j89697m6898R0408p5867k8564j595r2231m9698
2631.8F4275017j1566p5577j08833j51131P034J69686K3124m3007l3767j22937n7487
2642.4F3870556m1149j19538L0564l7819j21952r773j00571n4375P7004M390j47281
2653F3350056J8818J67736q1566k00989j65764O8184J03127p6661p1910k30145j06113
2663.6F2774773O4228k8302N3109l4005j08150k3609k9354O9210j7121k19451q5198
2674.2F2416130l1250l6644P0141l227m1119m2999q6544j2123m4541p5523K5802o1107
2685.8F2076996j15265l9909J7044P263j0742J38412J9810k8069m1897k31708l2349
2696.4F1759586m0321m3564n627j08337o596k0088L5546p275R621m6742k01076L5988
$$ y = [64670738, 64766655, 64777870, 64669617, 64669159, 64479462, 64432564, 64522972, 64447105, 64418541, 64416946, 64324715, 64275017, 64263451, 64187874, 64079041, 63927910, 63934944, 64104630, 64127754, 64084747, 64050980, 63928043, 63870556, 63829407, 63709869, 63740433, 63702614, 63580662, 63570889, 63470318, 63415943, 63492947, 63497337, 63350056, 63368874, 63536610, 63455044, 63254055, 63088291, 63156475, 63259602, 63182941, 63111031, 62880886, 62774773, 62839001, 62810699, 62863808, 62829803, 62721653, 62698044, 62668690, 62737900, 62720779, 62501328, 62416130, 62384880, 62348236, 62418377, 62415150, 62374031, 62331032, 62244488, 62232365, 62187824, 62112301, 62138103, 62076996, 61961731, 61921822, 61938866, 61946129, 61935387, 62073799, 62093609, 62065540, 62023643, 61791935, 61759586, 61719265, 61675701, 61670074, 61561737, 61555141, 61535053, 61570599, 61563324, 61572945, 61526203, 61325127, 61361115]
2708F1361115J22875j36051m33831q6323K01520K2914K5128o7154j00144j33316N0538
2718.6F0827271K6447j45905K2446q2775k4464o1378r6070N452k4903R3628j9413p1590
2730.2F0448746j11965r4895l8994j10336j46046k01965J42326J94165k0481J2317
2739.8F0072872j28685j69445q9962l502J13556L1849j91624n1651N8869m0486K6368
2750.4E9628159n2987p1617r5756m2149n627k15053j55880r941J35113J13155q1623
2761E9145794j72855j52867K4735J00265L0083j8875o0795k29656j66653n4626j28834
2771.6E8315716L7716O6585n5805j30642l9913Q7101o9702j71017j97342k05292j40220
2782.2E7497185J6689K0138o5853j54457j70666K32807J14079k53251j9081K2118j06663
$$ y = [61361115, 61483990, 61347939, 60914108, 60827785, 61029305, 61052219, 61077347, 61010193, 60910049, 60776733, 60827271, 60853718, 60707813, 60730259, 60647484, 60623020, 60561642, 60465572, 60471024, 60446121, 60539749, 60520336, 60448746, 60336781, 60241886, 60202892, 60092556, 59946510, 59744545, 59886871, 60081036, 60060555, 60072872, 59944187, 59774742, 59684780, 59681278, 59794834, 59826683, 59635059, 59583408, 59642277, 59601791, 59628159, 59575172, 59503555, 59407799, 59365650, 59360023, 59144970, 58989090, 58979149, 59114262, 59227417, 59145794, 58972939, 58820072, 58844807, 58945072, 58975155, 58956280, 58895485, 58665829, 58499176, 58444550, 58315716, 58353432, 58420017, 58364212, 58233570, 58193657, 58280758, 58211056, 58040039, 57842697, 57637405, 57497185, 57513874, 57534012, 57468159, 57313702, 57143036, 57375843, 57489922, 57236671, 57217590, 57239708, 57133045]
2792.8E7133045N268M0455j16558j26099j20113j50478p7046q3515j57089k25880j22307
2803.4E5999683R1744J33262m4902j35857j89545k15961j25965j66157J4999K7329
2813.1E5388630j34735L2863K7405j03443k21973j59932k6599n7614j43379k22755
2822.7E4378468o8310M749j87324k94674j62609r4624p5001r9441k01504n9059m6032
2833.3E3094639j01689j64550j71799j04897k21912o8310o3122k84442m59019m56734
2843E0998165k27512k54933k58400l24470l81458l74863l25543j35993j81687m4502
2852.6D8488804n9334j78196L8155L406k5230k0592j71692l0601J95549J0135k32647
2863.2D8017757k59533j87252r7461l5313q1909l27717k54299n3871m8073j4317n2208
$$ y = [57133045, 57138313, 57178768, 57062210, 56936111, 56815998, 56665520, 56588474, 56504959, 56347870, 56121990, 55999683, 56091427, 56224689, 56179787, 56043930, 55854385, 55638424, 55512459, 55346302, 55361301, 55388630, 55253895, 55286758, 55314163, 55210720, 54988747, 54828815, 54802216, 54744602, 54601223, 54378468, 54310158, 54314907, 54127583, 53832909, 53670300, 53575676, 53500675, 53401234, 53199730, 53140671, 53094639, 52992950, 52828400, 52656601, 52551704, 52329792, 52261482, 52198360, 51913918, 51454899, 50998165, 50770653, 50515720, 50257320, 49932850, 49551392, 49176529, 48850986, 48714993, 48533306, 48488804, 48429470, 48251274, 48289429, 48292835, 48267605, 48247013, 48075321, 48044720, 48240269, 48250404, 48017757, 47758224, 47570972, 47473511, 47438198, 47356289, 47028572, 46774273, 46720402, 46672329, 46658012, 46605804]
2873.8D6605804j53999l36342j27037Q7979j04348o5975r0721j34155m2145k7016j7311
2884.4D5594734j88644k54856j02452j16092j26812j53130k73453j62906k5502O0948
2894.1D4251835J4995k16758j47614L1738r7789l08472j53500L5447m6132j95255k38731
2904.7D2929764m7810q1238r2567l990r6516j00223k18384j82183o7283j29223j36444
2915.3D1773903p0179l0102j78131k12139j79966j92055k21836k09339l9314N9078
2925D0499920J63029J00753l9028m310k9663m6448J94713L09479p4020k10121N6614
2935.6D0920918J98688R3937n7293o1340M7229J89404O2187J1349J13724O6917K9240
2946.2D1614960M2740J40136j7917r2884M3365o5952q8116l5828r1022j28311N1094
$$ y = [46605804, 46451805, 46115463, 45988426, 46076405, 45972057, 45906082, 45815361, 45681206, 45639061, 45612045, 45594734, 45406090, 45151234, 45048782, 44932690, 44805878, 44652748, 44379295, 44216389, 44190887, 44251835, 44266830, 44050072, 43902458, 43934196, 43836407, 43527935, 43374435, 43409882, 43363750, 43168495, 42929764, 42881954, 42800716, 42708149, 42704159, 42607643, 42507420, 42289036, 42106853, 42039570, 41910347, 41773903, 41703724, 41673622, 41495491, 41283352, 41103386, 40911331, 40689495, 40480156, 40440842, 40499920, 40662949, 40763702, 40724674, 40720364, 40690701, 40644253, 40838966, 41148445, 41074425, 40864304, 40920918, 41119606, 41213543, 41156250, 41094910, 41142139, 41331543, 41393730, 41405079, 41518803, 41585720, 41614960, 41657700, 41797836, 41779919, 41687035, 41730400, 41664448, 41576332, 41540504, 41449482, 41321171, 41372265]
2956.8D1372265J18030p1876l8601O9763J7754n7583M7855J56082P0996N5191K04464
2967.4D1944340J84967Q0253J42937J6998r2037J24771M05464L15075O3618J54968
2977D3341354J42773J74915K54700M4624r067J16302J28281N2101J81194K39544J74023
2987.6D4840744J71135M9652J7201L4923R0881R7256K5730P3406R6047R5669J18927
2998.2D5711571J06006J564R346M4110l1067m1405p4127r251Q2886o9431j91155j9436
3009.8D5519611J06217J16436J23371N5069O306j66165k25025j19251l2383M2518M2118
3020.4D5468822O7593m8904j23406j29387j00742o7410j79161p3883q709p3425j22402
3031D4608986r6428k7164k4563o2664k31251n4848n2997k64306N311J23092j5243j73737
$$ y = [41372265, 41490295, 41418419, 41379818, 41449581, 41467335, 41409752, 41457607, 41613689, 41684685, 41739876, 41944340, 42129307, 42209560, 42352497, 42369495, 42277458, 42402229, 42807693, 43122768, 43186386, 43341354, 43484127, 43659042, 43913742, 43958366, 43949299, 44065601, 44193882, 44245983, 44427177, 44666721, 44840744, 45011879, 45061531, 45078732, 45113655, 45204536, 45301792, 45327522, 45400928, 45496975, 45592644, 45711571, 45817577, 45819141, 45828487, 45872597, 45841530, 45800125, 45725998, 45716747, 45799633, 45730202, 45539047, 45519611, 45625828, 45742264, 45865635, 45920704, 45927010, 45760845, 45535820, 45416569, 45384186, 45426704, 45468822, 45536415, 45487511, 45364105, 45234718, 45133976, 45066566, 44887405, 44813522, 44804813, 44731388, 44608986, 44512558, 44485394, 44460831, 44398167, 44166916, 44112068, 44059071, 43794765, 43800076, 43923168, 43907925, 43734188]
3042.6D3734188q0967Q9436l2971k07767k35913l6533o008q1589j02367r6646n3958
3053.2D2888905o9394Q076j47041k13036J03195N7579j78104j34689p7023o9004p9159
3063.8D2090305j48433o9535p2467r2076l3729r9965k2998n9834j82224k3251Q4805
3074.4D1370598J2466j56498k11197O4278K5189l50911k21141j790R251L7457P21j41339
3086D0437084k56378p8606k86m0134r2938j57219j05659p9563J68629R6523k56870
3096.6C9634583k12578k9103L800j18382N8098o6715l87547m5471K05860j8547j87137
3107.2C8836861j03649k71737l30555L266k9465j87519j6541M7009j14609l3386j02287
3117.8C7697388j98292J1436o7527j41243j15967j11489j08554j16742p4337j33644
$$ y = [43734188, 43653221, 43742657, 43709686, 43501919, 43266006, 43229473, 43223465, 43141876, 43039509, 42942863, 42888905, 42819511, 42827587, 42680546, 42467510, 42570705, 42628284, 42450180, 42315491, 42238468, 42169464, 42090305, 41941872, 41872337, 41799870, 41707794, 41674065, 41574100, 41551102, 41491268, 41309044, 41285793, 41370598, 41383064, 41226566, 41015369, 41079647, 41104836, 40753925, 40532784, 40530994, 40540245, 40577702, 40578423, 40437084, 40180706, 40102100, 40101814, 40061680, 39968742, 39811523, 39705864, 39626301, 39794930, 39891453, 39634583, 39422005, 39392902, 39396702, 39278320, 39336418, 39269703, 38882156, 38836685, 39042545, 39023998, 38836861, 38733212, 38461475, 38130920, 38134186, 38104721, 37917202, 37900661, 37947670, 37833061, 37799675, 37697388, 37499096, 37510532, 37443005, 37301762, 37185795, 37074306, 36965752, 36849010, 36774673, 36641029]
3127.5C6641029p4676n9059p1221k1976j04378j35403j14387j66531j84147j6189n7320
3138.1C5635742j97902q2894j03832j92597o9316K2888p2514j24946k62360k62001
3147.7C4290268o947J3592J5671k4723k18292k77146n4828N1490q1478o7688j93012
3158.3C3446907k28737j40724j00170o7093j92928p6439l9952q2683j8112j03466n0137
3168.9C2346466o3389k24960k42945r4353q6113j61640o7644k8902m5374j06102j16222
3179.5C1108822j06222o2426k7300j45748n3818k7488j35659j71192k86627j59713
3189.2B9932629M2865j4997j26768j35218j42378j07532L2665l9032j59159n7407p9546
3199.8B9146122j95314j57967j02150o6746K7863K1654j47820j08356k8536j99819
$$ y = [36641029, 36566353, 36507294, 36436073, 36414097, 36309719, 36174316, 36059929, 35893398, 35709251, 35693062, 35635742, 35437840, 35354946, 35251114, 35058517, 34989201, 35012089, 34939575, 34814629, 34552269, 34290268, 34283321, 34296913, 34312584, 34287861, 34069569, 33792423, 33737595, 33789085, 33707607, 33639919, 33446907, 33218170, 33077446, 32977276, 32910183, 32717255, 32640816, 32600864, 32518181, 32500069, 32396603, 32346466, 32283077, 32058117, 31815172, 31720819, 31634706, 31473066, 31405422, 31376520, 31331146, 31225044, 31108822, 31002600, 30940174, 30912874, 30767126, 30713308, 30685820, 30550161, 30378969, 30092342, 29932629, 29975494, 29960497, 29833729, 29698511, 29556133, 29448601, 29481266, 29442234, 29283075, 29225668, 29146122, 28950808, 28792841, 28690691, 28623945, 28651808, 28673462, 28525642, 28417286, 28388750, 28188931]
3209.4B8188931j23707K6525P1n7453j98256j11858n8125j63231j27144p2248J4511
3220B7318016N5483J4007k02157l03366l3951j3435j06699m2042j1501k5115j69578
3230.7B6479662p1112J03659j04014k88892j56107J07305M1222j79598j65441n4011
3240.3B5712673N7413m9240j21067m0804j20058k32876j82378Q5226J75527j5564j30270
3250.9B5138582j10550j6718n1294j30426j30167j40360j04946O862M2868j6031n5909
3261.5B4431911j56362j60347p7597N356J20491K1273q6146k1968M3901n0982k53334
3272.1B3816196j34729J42996J4801j66000j12452j80202k06770j08143R1892J67395
3281.8B3324984o4183o914n1523k02051L5253L2814r3822q1638o5306K9217L2909p3868
$$ y = [28188931, 28065224, 28091749, 28091820, 28034367, 27836111, 27724253, 27666128, 27502897, 27375753, 27303505, 27318016, 27373499, 27387506, 27185349, 26881983, 26848032, 26834597, 26727898, 26685856, 26674355, 26649240, 26479662, 26408550, 26512209, 26408195, 26119303, 25963196, 26070501, 26111723, 25932125, 25766684, 25712673, 25770086, 25720846, 25599779, 25558975, 25438917, 25206041, 25023663, 25108889, 25284416, 25268852, 25138582, 25028032, 25011314, 24960020, 24829594, 24699427, 24559067, 24454121, 24460983, 24503851, 24487820, 24431911, 24275549, 24115202, 24037605, 24042961, 24163452, 24184725, 24098579, 24076611, 24120512, 24069530, 23816196, 23681467, 23824463, 23839264, 23673264, 23560812, 23380610, 23173840, 23065697, 23157589, 23324984, 23260801, 23253887, 23202364, 23000313, 23035566, 23068380, 22974558, 22892920, 22827614, 22856831, 22889740, 22815872]
3293.3B2815872l5236J1843k8309n0721j50562j1827m5651l22689k5131J79754l799
3303.9B2333544p2859l124Q053j20861r7701r3048p9305M705p2390k1154M4746q2399
3315.5B1748207o7993K7887L517Q19j1000j0387n2567j75796r3434N4096J2299j26564
3327.1B1309084p9842J1904q3776j34341j91053j25567M8344j5705j20539l5551J932
3337.7B0584890j78777j16478P8872N5796N0146j0309o6576j21296j36139q839o1986
3348.3B0069304j26929q1201n0414n4492p4845J04044Q4908j85322j24666l3358n6894
3358.9A9470135J5224q8695j73344K9350P2439m4670m4456p9023p6468m4949j56024
3369.5A8879519j48661O7425J2399j77711l5359n7062j27020R9524J01211p2895j99663
$$ y = [22815872, 22780636, 22792479, 22764170, 22713449, 22562887, 22551060, 22505409, 22182720, 22157589, 22337343, 22333544, 22260685, 22257561, 22265614, 22144753, 22047052, 21954004, 21874699, 21879404, 21807014, 21785860, 21830606, 21748207, 21680214, 21708101, 21711618, 21712437, 21701437, 21691050, 21638483, 21462687, 21369253, 21423349, 21435648, 21309084, 21229242, 21241146, 21157370, 21023029, 20831976, 20706409, 20754753, 20739048, 20618509, 20582958, 20584890, 20406113, 20289635, 20368507, 20424303, 20474449, 20464140, 20397564, 20276268, 20140129, 20131290, 20069304, 19942375, 19861174, 19810760, 19756268, 19681423, 19785467, 19870375, 19685053, 19560387, 19527029, 19470135, 19485359, 19396664, 19223320, 19252670, 19325109, 19280439, 19235983, 19156960, 19080492, 19035543, 18879519, 18730858, 18798283, 18810682, 18632971, 18597612, 18540550, 18413530, 18513054, 18614265, 18541370, 18341707]
3380.1A8341707j46026J3107L7096O2363R8131P6216j36614k30486j12738q3654P4043
3390.7A7993145J03199n2982k0600N4783m2196k06888P473J88469j12147j33308J07752
3401.3A7886700j7233j85055q0084N3627J04603N6690o5613j04618k5152J5104K9488
3412A7668457K8896m9648J5192M8349j29974j35685N9069J18572l6863q3287K0869
3422.6A7523947M4227N1466k472q0539P719N5605O263J28436J61886K0290k2117j05069
3434.1A7789642r8220L3910Q8951Q6365n51m5788r4927r1972Q0164L6102l145J10018
3445.7A7890549M1305J16230K30334P5861p2314l9995J42292J03907n5559j6806K2840
3456.3A8438644L2864k460J6531J49274J00125K3014N8553j5596m7762K6825o231L2591
$$ y = [18341707, 18195681, 18208788, 18245884, 18308247, 18406378, 18482594, 18345980, 18115494, 18002756, 17919102, 17993145, 18096344, 18043362, 18022762, 18077545, 18035349, 17828461, 17835934, 18024403, 17912256, 17778948, 17886700, 17869467, 17684412, 17604328, 17657955, 17762558, 17819248, 17753635, 17649017, 17623865, 17638969, 17668457, 17697353, 17647705, 17662897, 17711246, 17581272, 17445587, 17504656, 17623228, 17586365, 17503078, 17523947, 17568174, 17619640, 17617168, 17536629, 17544348, 17599953, 17606216, 17734652, 17896538, 17916828, 17894711, 17789642, 17691422, 17725332, 17814283, 17900648, 17900097, 17854309, 17759382, 17667410, 17747574, 17783676, 17780531, 17890549, 17931854, 18048084, 18278418, 18354279, 18281965, 18241970, 18384262, 18488169, 18432610, 18415804, 18438644, 18471508, 18469048, 18485579, 18634853, 18734978, 18757992, 18816545, 18800949, 18753187, 18780012, 18773781, 18806372]
3467.9A8806372K06459J30186p1202N3246J71618p941l3254L0885O7232K18405J71585
3478.5A9743591k6369j39774p5939N5166N4739J50232J88250Q7858J32526R9549K6855
3489.1B0296684J66916R3184j49384j23665j5367J92976K42908j39692m8023L44949
3498.7B0861486K21768L3104Q4682R3468K2768k567m8882q6326Q6113K28227K01763
3509.4B1695604J83590N802j31887q509J26311K14153J20624O6824J53929P2102R0482
3520B2589025L6229q7836M0467J45109K56491J79121j03291K6043K78309K11563J23228
3530.6B3694458M160p3132P6208J77914J99951M1754j10409K25415L16768M1830l05
3541.2B4594612K3924Q0448K31381J76227P1764O2414Q080N0072J10422J84494J93063
$$ y = [18806372, 19012831, 19143017, 19071815, 19125061, 19296679, 19288738, 19255484, 19286369, 19353601, 19572006, 19743591, 19717222, 19577448, 19501509, 19556675, 19611414, 19761646, 19949896, 20037754, 20170280, 20269829, 20296684, 20463600, 20556784, 20407400, 20283735, 20268368, 20461344, 20704252, 20564560, 20516537, 20861486, 21083254, 21116358, 21201040, 21294508, 21317276, 21314709, 21265827, 21179501, 21265614, 21493841, 21695604, 21879194, 21884996, 21753109, 21744600, 21870911, 22085064, 22205688, 22272512, 22426441, 22498543, 22589025, 22625254, 22537418, 22577885, 22722994, 22979485, 23158606, 23055315, 23081358, 23359667, 23571230, 23694458, 23698618, 23625486, 23701694, 23879608, 24079559, 24121313, 24010904, 24236319, 24553087, 24594917, 24594612, 24618536, 24698984, 24930365, 25106592, 25178356, 25240770, 25248850, 25298922, 25409344, 25593838, 25786901]
3551.8B5786901J86404J55699P1331J70080M7029M0949L03217J92251R5639P4981R0466
3562.4B7214947L2749J57778L80796m0670K6499L84117J68932J86224J34658Q6495
3572B8732525J12104J67054R3732R2194K51625K24665J05320L5951K20858L54097L55526
3582.6C0745651J82974P876K25959J19490R9182M06826J31218J16430K24064K96910
3592.3C2556580L36269K75021K01763q4233J37337M04289K47120L06549K69875J49086
3601.9C4799656K81593J63956P0312K67407M07902K24811L87558K65103l8678M36798
3611.6C7266418O3332j5526P59487L52738L23311M67365K26650K74548J24599J66577
3621.2D0009499K24311K35569L93353M31721L73871L77727L79307k9431k18017M82548
$$ y = [25786901, 25973305, 26129004, 26200335, 26370415, 26417444, 26458393, 26761610, 26953861, 27049500, 27124481, 27214947, 27247696, 27405474, 27786270, 27745600, 27772099, 28156216, 28325148, 28511372, 28646030, 28732525, 28844629, 29011683, 29105415, 29197609, 29449234, 29673899, 29779219, 29815170, 30036028, 30390125, 30745651, 30928625, 30936501, 31162460, 31281950, 31381132, 31787958, 31919176, 32035606, 32259670, 32556580, 32892849, 33167870, 33369633, 33285400, 33422737, 33827026, 34074146, 34380695, 34650570, 34799656, 35081249, 35245205, 35315517, 35582924, 35990826, 36215637, 36603195, 36868298, 36829620, 37266418, 37329750, 37314224, 38073711, 38426449, 38749760, 39217125, 39443775, 39718323, 39842922, 40009499, 40233810, 40469379, 40862732, 41294453, 41668324, 42046051, 42425358, 42395927, 42177910, 42660458]
3630.9D2660458O36116M84436K72339L15250M16420M82277M40117K26509K49718L45455
3640.5D6529095K10132J79447N03899M66038L20659N99740L76152R6809L21396P2601
3650.1D9675968N7373k0138P26056Q03459N58151O44920k60936J88057L96133O7932
3659.8E2836975K97894L38981L76370J83933L51917M56162J44550L31780L23837K48165
3669.4E5890564j39320m06617M87828P71682R63494M37027j310555l85517O23249P95815
3679.1E7727650R0542J92447K30381Q1581K97390K15607M6921K86514O47846n99899
3688.7E9216980l91563Q88179k20897j69972L09712J06266L91842J57337j32977J2581
3698.4F0167488k872L59104N09403m76414j23466N98221J56314J18176J51970N3596
$$ y = [42660458, 43296574, 43781010, 44053349, 44368599, 44785019, 45267296, 45707413, 45933922, 46183640, 46529095, 46739227, 46918674, 47422573, 47888611, 48209270, 48809010, 49185162, 49281971, 49603367, 49675968, 49733341, 49713203, 50439259, 51242718, 51800869, 52445789, 52184853, 52372910, 52769043, 52836975, 53134869, 53473850, 53850220, 54034153, 54386070, 54842232, 54986782, 55318562, 55642399, 55890564, 55751244, 55344627, 55832455, 56604137, 57567631, 58004658, 56694103, 56308586, 56931835, 57727650, 57818192, 58010639, 58241020, 58322601, 58619991, 58835598, 58882519, 59169033, 59816879, 59216980, 58825417, 59713596, 59492699, 59322727, 59632439, 59738705, 60130547, 60287884, 60154907, 60167488, 60164616, 60523720, 61033123, 60556709, 60433243, 61031464, 61187778, 61305954, 61457924, 61511520]
3708F1511520J48121k29240P46025M21459j517921L58360O51451J77464J88823K13181
3717.7F2669243j5339m41032L3119Q75400J53561p60346J89240K93629J766m73488
3727.3F2525753J00231M64810O5139M82598k73297n09662R71512L09734o44577l0235
3736.9F3462006N4683k58465L4928L12019j83880K81842J141403j043781j686738J336106
3746.6F3450123Q03623O39313o61888j321392J568584j23779j248467M50684N17334
3755.3F4074135L00682p02015L03455Q17498o84189k86877K60731P3326K37038M90028
3764.9F4883812j46576m26262K57408M83200k5093j051933l2002L68786K94518J73492
3774.5F4779350j66046L9307J14868K18025q4686p35436J87806K50587J83655K30339
$$ y = [61511520, 61659641, 61430401, 62176426, 62597885, 61079964, 61438324, 62089775, 62267239, 62456062, 62669243, 62653904, 62212872, 62245991, 63121391, 63274952, 62514606, 62703846, 62997475, 62999241, 62525753, 62625984, 63090794, 63155933, 63638531, 63365234, 62855572, 63827084, 64136818, 63492241, 63462006, 63516689, 63258224, 63293152, 63605171, 63421291, 63703133, 64844536, 63800755, 62114017, 63450123, 64253746, 64893059, 64231171, 62909779, 64478363, 64354584, 63106117, 63556801, 64074135, 64374817, 63672802, 63976257, 64793755, 64109566, 63822689, 64083420, 64156746, 64393784, 64883812, 64737236, 64310974, 64568382, 65051582, 65026489, 63974556, 63942554, 64311340, 64605858, 64779350, 64613304, 64652611, 64767479, 64985504, 64900818, 64165382, 64353188, 64603775, 64787430, 65017769]
3784.2F5017769m13109k67326J18606L54538K98363k4635J6441r2506o3424j72332
3793.8F4772385j9295M58374l2204k12814P5043L32679M48128p63107n69054J95275
3803.5F4685410L1013K91985N96099n57586o50162M15993K65945J18538R316p1076
3813.1F5135475J23017K77160j29211r59305L27667M85291N81283O68869j936935l40370
3822.8F4232941N76439K55996K68723K6207l89565j9928K34864M72908L00872r61067
3832.4F4998390J24466Q25386o04194l36022O83510o17447l34343P27127m97795j16684
3842.1F4852394N11833k56218j90941K31263J52267K2553J3549k09381L23143Q27881
3851.7F6278343n83488r9610j432754K2079J084320k17086k31614K30225R3605K84485
$$ y = [65017769, 64604660, 64337334, 64455940, 64810478, 65108841, 65084206, 65100647, 65008141, 64944717, 64772385, 64753090, 65211464, 65179260, 64966446, 65041489, 65374168, 65822296, 65059189, 64490135, 64685410, 64716423, 65008408, 65604507, 65046921, 64396759, 64812752, 65078697, 65197235, 65206551, 65135475, 65258492, 65535652, 65406441, 64447136, 64774803, 65260094, 65841377, 66510246, 64573311, 64232941, 64809380, 65065376, 65334099, 65360306, 64970741, 64950813, 65185677, 65658585, 65959457, 64998390, 65122856, 65948242, 65344048, 65008026, 65691536, 65074089, 64739746, 65466873, 64969078, 64852394, 65364227, 65108009, 64917068, 65148331, 65300598, 65323151, 65336700, 65127319, 65450462, 66278343, 65694855, 65595245, 64162491, 64184570, 65268890, 65051804, 64820190, 65050415, 65144020, 65428505]
3861.3F5428505k86369k3285N07271q98537o20590O13830N60501N68375n31815p67074
3871F4550812K50709N53574O36192q90587k20367K34718j00830K60513L15850l77640
3880.6F5212944p06985M66468L90610J51398L62037j164825O3042M76227J16493K89238
3890.3F5656647k19620o57379p7179K22122J6945J56265Q6594J05560K22008q14087
3899.9F4697876L13606K76566m31092M08577j59675m7913q5426p8941K45071j34163
3909.6F5004486o0326K9343p5546M9263R4734O4186L906k11341k41265J61522P8529
3920.2F4897491k31994J373K74346K55195l11691j69678L84125J80885j00975l77235
3929.8F4801842j53816M04800M9629j61888J24748k3369j39274o7009k7764r7450r7061
$$ y = [65428505, 65142136, 65118851, 65626122, 64727585, 64106995, 64720825, 65281326, 65849701, 65317886, 64550812, 64801521, 65355095, 65991287, 65100700, 64880333, 65115051, 65014221, 65274734, 65590584, 65212944, 64505959, 64972427, 65363037, 65514435, 65876472, 64711647, 64774689, 65250916, 65367409, 65656647, 65437027, 64779648, 64702469, 64924591, 64941536, 65097801, 65184395, 65289955, 65511963, 64697876, 65011482, 65288048, 64856956, 65265533, 65105858, 65057945, 64972519, 64893578, 65138649, 65004486, 64944160, 64973503, 64897957, 64947220, 65041954, 65106140, 65110046, 64898705, 64657440, 64818962, 64897491, 64665497, 64666870, 64941216, 65196411, 64884720, 64715042, 65099167, 65280052, 65179077, 64801842, 64648026, 65052826, 65102455, 64940567, 65065315, 65041946, 64902672, 64835663, 64807899, 64710449, 64613388]
3940.4F4613388J40900J52130j80718l5789J08055Q5533M4205j16318J94199O0905
3950.1F5066490l14560Q370K0393n3596K4787Q6792k3590j05980j4747j50871J9874
3960.7F4563362J00426q5015L6545N6923Q766n6663r5421J46751K02630j59371j38252
3971.3F4580681Q3839O0074J06575R6581j06987k08077l7056r6504o3881J79428P897
3981.9F4602570N2810J72158o5957k12623P3784K54074o6818n9006J4168j6282k365
3992.5F4746513j01547k258o1386n8029R6435l3066q4663L1174
4000.2F4533173
$$ y = [64613388, 64754288, 64906418, 64725700, 64689911, 64797966, 64883499, 64927704, 64811386, 65005585, 65066490, 64751930, 64760300, 64780693, 64727097, 64751884, 64838676, 64815086, 64709106, 64694359, 64543488, 64563362, 64663788, 64578773, 64615318, 64672241, 64681007, 64624344, 64528923, 64675674, 64878304, 64718933, 64580681, 64664520, 64724594, 64831169, 64927750, 64820763, 64612686, 64575630, 64479126, 64415245, 64594673, 64602570, 64655380, 64827538, 64761581, 64548958, 64622742, 64876816, 64809998, 64750992, 64765160, 64748878, 64746513, 64644966, 64642708, 64581322, 64523293, 64619728, 64586662, 64501999, 64533173]
##END=$$ End of the data block
