##TITLE=$$ Begin of the data block
##JCAMP-DX=5.00 $$ ACD/SpecManager v 10.08
##SPECTROMETER/DATA SYSTEM=Varian
##DATE=07 Jan 2013 10:17:32
##DATA TYPE=INFRARED SPECTRUM
##DATA CLASS=XYDATA
##ORIGIN=
##OWNER=
##NPOINTS=3735
##FIRSTX=399.26403809
##LASTX=4000.35498047
##MAXX=4000.35498047
##MINX=399.26403809
##MAXY=79.49856567
##MINY=2.30026221
##XFACTOR=1.0000000000
##YFACTOR=0.000000100000000
##FIRSTY=70.97457123
##DELTAX=0.96440572
##XUNITS=1/CM
##YUNITS=TRANSMITTANCE
##XYDATA=(X++(Y..Y))
399.3G09745712Q5239945l22947731q4312744j22339249q6749668N1750774N4631729
406B85018768P2400589O2003823q1123009j20023022j3208980J07770004J76822357
412.8D89660530P758560j6757698k4823379q1823693j7686119N2886467J365853m5582886
420.5C64997635J6292572J09509773R6855202l7352104p7310143j79995689k4754334
427.2B68242912J19395714k6206818o202964J15368461L5832329j10652313j09270592
434B86506729M167366N869179m0389614J2741165J02882557L3138618l8289413Q843346
441.7C75469933J3029708k6651992n7216854M6117610N5881348m3678589l8941002
448.4C24010162j1865139K2354298K5685654Q4296302q754463m4561081Q0560112K9030037
$$ y = [709745712, 794985657, 472037926, 387725182, 265385933, 178636265, 230387039, 285018768, 357419357, 419423180, 338300171, 218277149, 205068169, 312838173, 489660530, 497419090, 480661392, 455838013, 374014320, 356328201, 409214668, 410580521, 364997635, 381290207, 490799980, 587655182, 550303078, 472992935, 292997246, 268242912, 387638626, 361431808, 355228844, 470597305, 506429634, 395777321, 286506729, 290674095, 296543274, 256153660, 268894825, 371777382, 404916000, 366626587, 375469933, 388499641, 361847649, 304630795, 350748405, 406629753, 362951164, 324010162, 312145023, 334499321, 360184975, 444481277, 435726814, 391165733, 471725845, 500755882]
456.2E00755882j01382332j27943496K3473491M2344647n1630669n4443550Q0873947
462.9C12047920N8923683j1485099J5722961k3016739N824852k7009544n7742310N857659
470.6B79123383m5105343r463826Q3892861M0744057k210236N5946465J03745422m4443741
478.3D62229042j03226509p6019783k2475967L9073333L1116524m8204899P750225
485.1B90241966N9784470j5033264N3942566j0561600p3289738J6152821j4658966
491.8C06578255J4520492P0073204J9909210k9282341n5063285k9634724K3402157
498.6C20502968L1203308k8643417L480110M297142o0972481J5675735O7556801J193276
506.3C54293442m8023396m0892906J9566689M5151310R75723p773857P228660j748848
$$ y = [500755882, 399373550, 271430054, 294903545, 337248192, 285617523, 231173973, 312047920, 370971603, 359486504, 375209465, 352192726, 358017578, 331008034, 273265724, 279123383, 234018040, 224554214, 308447075, 349191132, 346980896, 402927361, 506672783, 462229042, 359002533, 282982750, 260506783, 299580116, 330696640, 282491741, 290241966, 350026436, 334993172, 388935738, 378374138, 305084400, 321237221, 306578255, 321098747, 391171951, 411081161, 381798820, 326735535, 297100811, 320502968, 351706276, 323062859, 326542969, 330840111, 269867630, 285543365, 353100166, 354293442, 306270046, 265377140, 284943829, 330095139, 331070862, 323297005, 330525665, 328776817]
514C28776817q834171N845394J7647400j4055633m9862042K805538N5656090M258804
521.7C42238197r343948K0041695L6300010K2986260k8350029k6273422k9233971j3025150
529.5C15339642N872325l1537399j3218670K3467732K3571434L822860J1602250M62227
537.2C39382401k8387471p704448k84977J3721542l113098j7827130J9825974j951466
544.9C13661327j3807335J4476967J4183789m685669r772663k831154K8309192K8905335
552.6C68439789l4479256r494972J4018021j0737381j766510o752358j4945660j2385616
560.3B91896057O945171L116017R914379J9007053k8536186j7911968J5065327Q912582
568C08408432N488567o471004j7530518m163017K2656174L271084j8788834j2959900
$$ y = [328776817, 319942646, 325788040, 343435440, 329379807, 279517765, 282323303, 337979393, 342238197, 332894249, 352935944, 389235954, 412222214, 383872185, 357598763, 328364792, 315339642, 321211967, 289674568, 276455898, 299923630, 323495064, 327317924, 338920174, 339382401, 310994930, 303290482, 303005505, 316727047, 313613949, 295786819, 315612793, 313661327, 299853992, 314330959, 328514748, 323829079, 314056416, 311225262, 339534454, 368439789, 333960533, 324465561, 338483582, 327746201, 325979691, 319227333, 304281673, 291896057, 298841228, 301957245, 311871624, 330878677, 302342491, 284430523, 299495850, 308408432, 313896999, 307425995, 289895477, 285732460, 308388634, 311659718, 292870884, 279910984]
575.8B79910984k043724K7355690K0194035j1429825L045330N295658j4178085R840030
583.5C17990093O677189j7626572m971141J167755L855991M681053L144265M093456
591.2C19012089j0521965j9019890k266769K0322837J6703549j721001L54996l732052
598.9C19131794j9369488j0323963J0201588K4643821K346650k4252720j3181572j2962132
606.6B76233978r72862o210728k6180210r159546j616649p046433j5135269j2700996
614.3A97211285j1868496p477570K961865P435321K5991955J885948k1915512o318741
622A87906055m176921r636155o358547J4487667J1695214O530876K1020717K6826077
629.8B48294983J1453686m465504j732922j6602954j5663434m662475l923226M852734
$$ y = [279910984, 277867260, 305222950, 325416985, 313987160, 317032490, 322328148, 308150063, 317990093, 324667282, 307040710, 302069569, 303237324, 307093315, 311774368, 314918633, 319012089, 308490124, 289470234, 287203465, 307526302, 324229851, 322508850, 322863846, 319131794, 299762306, 289438343, 299639931, 324283752, 326630402, 302377682, 289196110, 276233978, 275261116, 269050388, 242870178, 233710632, 232093983, 225047550, 209912281, 197211285, 185342789, 177865219, 180827084, 188262405, 214254360, 216140308, 194224796, 187906055, 183729134, 174092979, 167734432, 182222099, 193917313, 200448189, 221468906, 248294983, 259748669, 255283165, 253550243, 236947289, 221283855, 216621380, 212698154, 217550888]
637.5B17550888k993183o433621l200855N558548J9776802J4118157J7524986L8988800
645.2C00890522L0235386L561821q043022m259682J5805817J2463951k410355R610863
652.9C57855301P071190l485337m266662L151359N853997j4618569J122856K9426499
660.6C82110634R658508j6506767j5030365L600883J1355133J5514031K5726814l1217232
668.3C85211639k8257141p7400M983711J4941635J159974r897805O267357R835510
676.1C84167480m209365q310395j519546O074943M27628p071381l886299J833992M481087
684.7C71988144J63078L912735K125550m725304J491394K304382J309433q659324q487778
693.4C61422310M49943p53707K552337r112091K198944P674141j3267593L628120O730995
$$ y = [217550888, 214557705, 208124084, 204923229, 210481777, 230258579, 244376736, 261901722, 300890522, 331125908, 334687729, 326644707, 322385025, 338190842, 350654793, 348244438, 357855301, 364926491, 361441154, 357174492, 360325851, 366179848, 351561279, 352684135, 382110634, 391769142, 375262375, 360232010, 363832893, 375188026, 390702057, 416428871, 385211639, 356954498, 356877098, 361860809, 376802444, 377962418, 368064613, 374331970, 384167480, 379958115, 371647720, 370128174, 376203117, 376630745, 369559364, 365673065, 367507057, 371988144, 372151222, 376063957, 378189507, 373464203, 374955597, 377259979, 378569412, 369910088, 361422310, 361872253, 361118546, 363670883, 354558792, 356757736, 364431877, 351164284, 354792404, 361523399]
702.1C61523399o284217q772927k0027R936790o06536P8277o485748J891098J5557136
710.8C66817245o524887n759735K787247k721825O092072J2090225L614884l547822
718.5C72847404o642761Q330574J5553551N82657R400711L871460q706474N64956J806336
727.2C97608414K63862j5593948o738892J8640557K879638j4425926n466080Q198014
734.9C85365639O636734m932518j1677323n306701P469368J5444069P111625p330780
742.6C92780113n314178o113739j117096L338280L084754J0043450L280372k55622
750.3C99726334O029319J3765107N599327Q8119N272331q056945P244339K0562210
758D50230141K749862l667640o462593J442298P721711K150116l942223l321266J286545
$$ y = [361523399, 355239182, 346466255, 346446228, 356383018, 355776482, 355854759, 349369011, 351260109, 366817245, 360292358, 354532623, 357319870, 354598045, 360690117, 372780342, 376395226, 372847404, 366204643, 374535217, 390088768, 390671425, 400072136, 403943596, 395237122, 395802078, 397608414, 397872276, 382278328, 375539436, 394179993, 397059631, 382633705, 377167625, 385365639, 392002373, 387069855, 375392532, 370085831, 377555199, 392999268, 400110893, 392780113, 387465935, 381352196, 380235100, 383573380, 386658134, 396701584, 399981956, 399726334, 405755653, 419520760, 425120087, 425208206, 430480537, 422423592, 429667931, 450230141, 452980003, 449312363, 442849770, 444292068, 452013779, 454163895, 450221672, 446900406, 448186951]
766.7D48186951n865250n012054R68361L165054O131325J100425n654297n183982L975677
775.4D41812210O440353m972229m196090P657318J1017532J1876488Q801384K536545
783.1D80973511M033012O177635L80631k856293j727791o746521k943268N853692N724868
791.8D88869476K018509p563057m241829k799949n463753Q460960O759110l041115
799.5D82998352K248344P222481K794342K750550J139869r819793l016091j390037
807.2D84928017k84577J4627342J820984j1601944k823295j845474N92155L968697
814.9D89381905n596047j454048J0853996J478157n133514m457779n353394k194328
822.6D77524948j661644l980141k065963R364967Q594704n640335o262207j831780
$$ y = [448186951, 442321701, 437309647, 438278008, 441443062, 447574387, 448674812, 443020515, 437836533, 441812210, 448252563, 443280334, 439084244, 446741562, 457759094, 469635582, 478436966, 480973511, 485006523, 491184158, 491564789, 488708496, 486980705, 480234184, 477290916, 483144608, 488869476, 490887985, 483324928, 479083099, 476283150, 470819397, 479280357, 486039467, 482998352, 485246696, 492469177, 495263519, 498014069, 499153938, 489334145, 486318054, 484928017, 484643440, 499270782, 501091766, 489489822, 486666527, 484821053, 485413208, 489381905, 483785858, 482331810, 493185806, 494663963, 489530449, 485072670, 479719276, 477524948, 475863304, 471883163, 469817200, 479182167, 487776871, 482136536, 475874329, 474042549]
830.4D74042549m331817o192017K68783k308387j2221489r363709r282303j3571777
838.1D17039833q509102J524010l54920j2092857p910995K767028N306664j834106
845.8C95935555r459878K32316O74133J398773Q783646k165490K080536J5639763O115036
854.5D19234390l484230M071503O508293l096199k757492O122704L864059l331680
862.2D27131348M105987J2887688J2596321M788666r512139p875862O924629N348664
869.9D56395302o837959P1640O370239q62007K539405L090401J744919M298973J113968
878.6D67924881M538345J260948j0971908r936791o526641n634003J367989L077659
886.3D45100479P88612o49681o356392k834472L115234N15824l282776m12255R889183
$$ y = [474042549, 469710732, 463518715, 463787498, 461479111, 449257622, 439893913, 430611610, 417039833, 408530731, 410054741, 409699821, 397606964, 389695969, 392462997, 397769661, 395935555, 386475677, 386707993, 387382126, 388780899, 397564545, 395399055, 397479591, 413119354, 419234390, 415750160, 419821663, 426329956, 423233757, 420476265, 426598969, 430463028, 427131348, 431237335, 444125023, 456721344, 461510010, 451997871, 444122009, 451046638, 456395302, 449557343, 449628983, 455999222, 455137215, 457676620, 460767021, 462511940, 466810913, 467924881, 472463226, 473724174, 462752266, 452815475, 446288834, 440654831, 442022820, 445100479, 445889091, 445239410, 438883018, 436048546, 439163780, 439679604, 436396828, 435984573, 445873756]
895D45873756M166680l462677K609710l791427p912789J813508P900199O271058j418839
903.7D52049179m766540o165162n560302l313790p690124l757286L896446J561546
911.4D26253967m175224q582153r281845p825013j532631L5973n774422q781128p378578
920C72958946o8283o87370o369209j1251831j0228043N33447n81436m030342L532066
928.7C43807945Q955040j756859r151077P61337L206063J423759j10168j937714O98853
937.4C45897179M316978Q531036J2646981J0429916j972198r15032J0267830R513092
945.1C98715782L032227N258827J1643181P131691K102966J757813N23147j866455
952.8D28299179J65787O43425m522171J415291k332230q304405k284584j768379L525657
$$ y = [445873756, 450040436, 446577759, 449187469, 445396042, 437483253, 439296761, 447196960, 453468018, 452049179, 447282639, 441117477, 435557175, 432243385, 424553261, 420795975, 424692421, 426253967, 422078743, 413496590, 404214745, 396389732, 394857101, 394893074, 389118652, 380337524, 372958946, 372890663, 372203293, 365834084, 354582253, 344354210, 344887657, 344306221, 340275879, 343807945, 352762985, 351006126, 341855049, 342616386, 345822449, 347246208, 347136040, 345198326, 345897179, 350214157, 358745193, 371392174, 381822090, 379849892, 378934860, 389202690, 398715782, 401748009, 407006836, 418650017, 425781708, 427884674, 429642487, 430165634, 428299179, 428464966, 429108391, 424586220, 426001511, 423669281, 415364876, 413080292, 411311913, 414837570]
961.5D14837570l187332j0073280o400910j0022697l400917M925575K553902q478623
969.2C80753288q188133M412308L486938j964912q883400l634186N646820m342995
976.9C67285728j902389L403397k854844K093316L433189l051758o000748n770187
984.7C56635704l646355j295738k254104q491097o198997m887505r347839n333615
992.4C15180454o420135j1253205j7378521k0235862n679360J2017937J7325401J3003235
1000.1B96559944O960468J302720L105640j945763q619232o13899K278728j53598n402413
1008.8B93472595o025677q81786n70526l401146n525627K29206j012707k196083K35596
1017.5B74323845k175064k786598l752423k466545q808479l223419Q841076k657414
$$ y = [414837570, 411650238, 401576958, 395176048, 385153351, 381752434, 386678009, 389231911, 380753288, 372565155, 376977463, 380464401, 378499489, 369616089, 365981903, 371628723, 367285728, 365383339, 368786736, 365931892, 368025208, 371458397, 368406639, 362405891, 356635704, 352989349, 351693611, 349439507, 340948410, 334749413, 329861908, 320514069, 315180454, 308760319, 297507114, 280128593, 259892731, 254213371, 266231308, 283556709, 296559944, 303520412, 304823132, 307928772, 305983009, 297363777, 296749878, 299028606, 298875008, 293472595, 287446918, 286565132, 285994606, 282593460, 277067833, 277297039, 276284332, 274088249, 274323845, 272148781, 269362183, 265609760, 263143215, 254334736, 251111317, 259952393, 257294979]
1025.2B57294979j1898765q420105j016713K946206K549896l764134q669700m758797
1032.9B24262867j679573l03021j082439R9926j746998j745510j333027m179134j597614
1041.6B10695477N6858L129463k039795n077286L832455O209392K214394J132183J012116
1050.2B21165257o60763L659954j522999n831661j490460m32491L603649P42836Q43525
1058.9B20076847L413200R50699o567840o404839K458668p43580L012104J760159j635514
1067.6B16319904N22137l850899j833362K002372K264672r253788m547005M973202
1075.3B06597233l083801j377907j500969K78301L595047K688675k716084m315013
1083B00165482J314411k182160J730843L278255j765594j821327k637406m414425o319809
$$ y = [257294979, 245396214, 236976109, 235959396, 238905602, 241455498, 237691364, 229021664, 224262867, 222583294, 222280273, 221197834, 221297760, 219550762, 217805252, 216472225, 212293091, 210695477, 210752335, 213881798, 211842003, 206764717, 210597172, 216806564, 219020958, 220153141, 221165257, 220504494, 224164448, 222641449, 216809788, 215319328, 214886837, 218490486, 219233322, 220076847, 223490047, 224440746, 217872906, 211468067, 213926735, 213183155, 216195259, 217955418, 216319904, 216842041, 212991142, 211157780, 213160152, 215424824, 206171036, 201624031, 206597233, 203513432, 202135525, 200634556, 200912857, 204507904, 207196579, 204480495, 200165482, 201479893, 199297733, 201028576, 204306831, 202541237, 200719910, 198082504, 193668079, 187348270]
1091.7A87348270m103183p151928r896031o005382k666798k869024k210159p483445
1099.4A44962320j5003938p524023p879019q897028n090218n910539l897906o278696
1107.1H4480953q999543p602339L40047k957883o037750j548982l773398j628647l143234
1115.8D9129224L94392J39575l274856K698059K230888k246142k852745L002668N417523
1124.5E4638586L970642j828999J304936N940976q92272m03981m513750k537456K444010
1133.2E8122692j344972k751736k884431n1122m327569m084067k63882J652870J757279
1141.9D5825062m010220m785526l901431j330466P21342M507647j9975p730682m761078
1150.5B4514673j512051L783739J719310j21577J414178K899956K754887k091735o05957
$$ y = [187348270, 183245087, 176093159, 166197128, 160191746, 157524948, 154655924, 152445765, 144962320, 129958382, 122434359, 114555340, 105658312, 100568094, 94657555, 90759649, 84480953, 75481410, 67879071, 68219118, 65261235, 59223485, 57674503, 53901105, 52272458, 49129224, 49523616, 49663191, 46388335, 49086394, 51317282, 49071140, 46218395, 49221063, 54638586, 58609228, 56780229, 58085165, 64026141, 63133869, 62729888, 58216138, 55678682, 58122692, 56777720, 54025984, 51141553, 51090431, 46762862, 42678795, 42414913, 44067783, 45825062, 41814842, 37029316, 33127885, 31797419, 32518761, 37026408, 37006433, 29275751, 24514673, 23002622, 26786361, 28505671, 28384094, 29798272, 32698228, 35453115, 33361380, 32755423]
1159.2C2755423j128116J192636K314012R91579L590560K511770M76914j066008J928482
1167.9D3567252M397221N649924L847222L238564M734659J593833K084251O229796
1175.6G5342722J1491251Q377399K712183L91388M904585R783974M212980N773764
1183.3A22990246N381107N538321O897392M196215O215524M680481L451777K956390
1191A62307453P564640P523022K325477K219735k93579K896080O376171O496277M633312
1199.7B02048588N187492N920506L433208L225308o11344L738175P656479L137588
1207.4B33736000J244927J359443K557221K646331N044175L701782J277389j630211
1215.1B49937057r74597M314346P21340j156902j296692J177559L899135K877732J614532
$$ y = [32755423, 31627307, 32819943, 35133955, 36125534, 39716094, 42227864, 42704778, 41638770, 43567252, 47964473, 53614397, 57461619, 60700183, 65434842, 67028675, 69112926, 75342722, 86833973, 95211372, 97923555, 98314943, 103219528, 113003502, 117216482, 122990246, 128371353, 133909674, 140807066, 145003281, 151218805, 155899286, 159351063, 162307453, 169872093, 177395115, 179720592, 181940327, 181646748, 184542828, 190918999, 197415276, 202048588, 207236080, 213156586, 216589794, 219815102, 219203758, 222941933, 230598412, 233736000, 234980927, 236340370, 238897591, 241543922, 246588097, 250289879, 251567268, 249937057, 248962460, 253276806, 253998146, 252841244, 251544552, 252722111, 256621246, 259498978, 261113510]
1223.8B61113510j234131J687985j363774k495880K467537k49519k996960j588802
1231.5B55339966L428917K664814M91714M16069L3074O38656n99918P44247L14885
1240.2B63472424J135215K578183o58474j157723J933270J143741j951961j26973J446190
1248.9B67813892J891117M63181m94347m99515p7343K396545j576919j22567L515435
1257.6B73309479J54667q41542M18091J394139m62323J341934J834584l7689K74372
1266.3B77385712J806373M429093j38378k66934L898392L478718K732410p06100j698018
1274.9B90921268K122994L275566P81784P53536J883908L379116M170932L126564J799927
1283.6C12215595L46661K562389M918385N575294K386132J254043L689156J571655
$$ y = [261113510, 259879379, 261567364, 260203590, 257707710, 260175247, 259925728, 256928768, 255339966, 258768883, 261433697, 261925411, 262341480, 262374554, 263013210, 262413292, 263157539, 263472424, 264607639, 267185822, 266527348, 265369625, 267302895, 268446636, 266494675, 266367702, 267813892, 269705009, 270168190, 269673843, 269174328, 269096985, 271493530, 269916611, 269794044, 273309479, 273464146, 272622604, 273040695, 274434834, 273972511, 275314445, 277149029, 277111340, 277385712, 279192085, 283621178, 283482800, 283215866, 287114258, 290592976, 293325386, 292619286, 290921268, 293044262, 296319828, 297101612, 297855148, 299739056, 303118172, 307289104, 310415668, 312215595, 312562256, 315124645, 320043030, 325618324, 328004456, 329258499, 332947655, 334519310]
1291.3C34519310Q97293J096001M377708O118202J843453Q20808J204758J801681K466279
1300C55145493L238449L152046J806297P85980J078110K027741K551612L448983M48494
1308.7C73683205K32277J085853j481972N87998L475342L458709L66822j001358j31531
1317.4C80275345J74064J658021J205520J340256J223602J314697R62105j74179J472969
1326C89452400K062760J667137N87539L23639O54374P36427J361465J40076j94511
1334.7C96791306n40925j303482m04815R06715J008644j447181j133309J038513K229843
1343.4C97145309J302910p29789k241898j842232l06091j016579p50770j6404J143227
1352.1C92687683J312180j028405J20850J294670K44332k528306m792709j002617J105004
$$ y = [334519310, 335416603, 336512604, 340890312, 347008514, 348851967, 349672775, 350877533, 352679214, 355145493, 358383942, 361535988, 363342285, 364128265, 365206375, 367234116, 369785728, 373234711, 373683205, 373915482, 375001335, 373519363, 374107361, 377582703, 381041412, 381408234, 380406876, 380275345, 380449409, 382107430, 383312950, 384653206, 385876808, 387191505, 388153610, 387979431, 389452400, 391515160, 393182297, 393769836, 394093475, 394747849, 395484276, 396845741, 396985817, 396791306, 396250381, 394946899, 394542084, 395448799, 396457443, 395010262, 393876953, 394915466, 397145309, 398448219, 397718430, 395476532, 393634300, 393328209, 392311630, 391560860, 391544456, 392687683, 393999863, 392971458, 393092308, 394386978, 394631310, 392103004, 387310295, 386307678, 387412682]
1360.8C87412682j686554m58489J438179k629433r99412J080475p01714j531601k964172
1369.4C78959961j550751j39656K29073m21639j930046M20990j160545j169243R8190
1378.1C73336334k355613j977883K39525P41768J11236p03811n66673O91795P39746
1386.8C70256424J829834K306557q91075k088128j143493l96118K202529K662011k16027
1395.5C74522514K04811j802978k014198k88468k182808k300415o57539n84831k319680
1404.2C62576408j190185J36146l01895n23224j132774P0496q46024j408920j526489
1412.8C55853539p90177J864166l25317k555237k788772p21741M236488J701241M57611
1421.5C56931801R0141Q4534k937584J53389L689880M76761J342354L613548J797333
$$ y = [387412682, 385726128, 385267639, 386705818, 384076385, 383076973, 384157448, 383455734, 381924133, 378959961, 377409210, 377269554, 377498627, 377076988, 375146942, 375567932, 374407387, 373238144, 373336334, 370980721, 369002838, 369242363, 369984131, 370095367, 369391556, 368824883, 369516678, 370256424, 372086258, 374392815, 373501740, 371413612, 370270119, 369874001, 372076530, 374738541, 374522514, 374727325, 372924347, 370910149, 370621681, 368438873, 366138458, 365480919, 364896088, 362576408, 361386223, 361522369, 361220474, 360697250, 359564476, 359634972, 358788948, 357380028, 355853539, 355063362, 356927528, 356602211, 354046974, 351258202, 350536461, 354772949, 356474190, 356931801, 357021942, 357106476, 354168892, 354322281, 358012161, 358488922, 359831276, 363444824, 365242157]
1430.2C65242157o17638j417656l48472N88951K05917L012657L884201k461547Q22982
1438.9C68911552O52428K244263L149681J305961K154618K78473p79610j71928K087097
1447.6C79832535L547439K3575r00307K62719K313957J592369K704353J333390m21906
1456.2C90288124R63173P61147M502563O53839J563110P44401J405715M981080J493759
1464.9D07356911m7455p2022l67126O04172M102554O332741L917541K879601m8218
1473.6D24658699L110085M030494Q21686J962357M280014M636230M788170L459930
1481.3D51747665r35020J519318L491554J441688J85776k669029m79164M308777L084221
1490D61695786l141861j298562J544877o11344k642555r94072l176422k508850j388893
$$ y = [365242157, 364624519, 363206863, 362858391, 363447342, 363653259, 366665916, 370550117, 368088570, 368911552, 369563980, 371808243, 374957924, 376263885, 378418503, 378696976, 377917366, 377745438, 379832535, 383379974, 383403549, 382503242, 382765961, 385079918, 386672287, 389376640, 390710030, 390288124, 391251297, 392012444, 396515007, 397168846, 398731956, 399476357, 400882072, 405863152, 407356911, 407309456, 407237434, 406870308, 407474480, 411577034, 417909775, 421827316, 424706917, 424658699, 427768784, 431799278, 432620964, 434583321, 438863335, 443499565, 448287735, 451747665, 450812645, 452331963, 455823517, 457265205, 457450981, 454781952, 454302788, 458611565, 461695786, 458553925, 457255363, 458800240, 458188896, 455546341, 454552269, 451375847, 448866997, 447478104]
1498.7D47478104J213569K715531Q30002l109551m656410k071953J148262n564384
1506.4D37983170j1926766K506027M26903k919426o64902q5601k795945k164230r0675
1515.1D20268555j830101m325600n234032j527595K746010K203140m971886k514038
1522.8D04814453M80423j017647m964599J722603K874259q01200r55010J376839p28493
1531.5D02801628m655037m376373m07562L905410N20707j004639J567955K054710m830589
1540.1C95576210p795296m258384K493476N136757K421837o46896J399841q65211q24089
1548.8C92638245K695846K093773J96991R82399M34761k472687Q94509M072570R968377
1557.5D11504784J2248802j6028748p330436N655021M319267L296700L348160j872406
$$ y = [447478104, 448691673, 451407204, 452237206, 449127655, 444471245, 442399292, 443547554, 437983170, 426056404, 428562431, 428989334, 426069908, 425405006, 425319405, 422523460, 420359230, 420268555, 418438454, 414112854, 408878822, 407351227, 410097237, 412300377, 407328491, 404814453, 405294876, 404277229, 399312630, 401035233, 403909492, 403108292, 402153282, 403530121, 402801628, 398146591, 393770218, 393362656, 397268066, 397788773, 396784134, 398352089, 400406799, 395576210, 387780914, 383522530, 386016006, 391152763, 393574600, 392927704, 394327545, 393462334, 392638245, 395334091, 397427864, 397624855, 398607254, 399042015, 396569328, 397463837, 401536407, 411504784, 423753586, 407724838, 400394402, 406049423, 410368690, 413665390, 417013550, 415141144]
1565.2D15141144j098252M040871M327088L651771m617310l682594J03340P35627o1570
1573.9D18540115m37965Q59451n518226p58362K117233J960754k938461m702186r47724
1582.6D08174629k864914k603988k780686j087723O98739k346650m543152m213600
1590.3C88432655J78833k100677l890038m093399l709068k853699m495201j795654
1598C65673752k638550k621384n413932m327851j545448l731690j548156k487793r42459
1606.7C40416489m402809m217492l425064n357818o46592k922515k310963k950955
1614.4C14182281o25305j345253j1806812J380901L81890m85554k620220p45545j976242
1623.1B96340141l339348l423500o192627j099071k845955j96419l19824q95386q46023
$$ y = [415141144, 414042892, 418083763, 422410851, 426062622, 421445312, 417762718, 417866058, 418601685, 418540115, 418102150, 418961601, 413443375, 412685013, 414802246, 416763000, 413824539, 409122353, 408174629, 405309715, 402705727, 399925041, 398837318, 399536057, 397189407, 392646255, 388432655, 388611488, 386510811, 382620773, 378527374, 374818306, 371964607, 367469406, 365673752, 363035202, 360413818, 354999886, 350672035, 349126587, 345394897, 343846741, 341358948, 340416489, 336013680, 331796188, 328371124, 323013306, 322366714, 319444199, 317133236, 314182281, 313556976, 312211723, 300404911, 301785812, 302167702, 301682148, 299061928, 298316383, 296340141, 293000793, 289577293, 283384666, 282285595, 279439640, 279243221, 278923397, 278028011, 277181988]
1631.7B77181988j668244J352597l791333o35662o10523k901974j353225J123218J882076
1640.4B70578918m429073p46899j223545J72482m349k184486N886040k582608K098694
1649.1B67565174L65009K367497N615902k553139r197330N787677N627842n14869K481422
1657.8B77545185K743874Q87413K026081J631965N95875j36356O341495L375702K482033
1666.5B97493267L301525J651859M23871K117214O337185K242603L032494K491169
1674.2C19091187L806724L721161j083107K119827L448792O591720L605805M506645
1681.9C45808754P595062L794251M261284j606713K656937L325195O643105P066955
1689.6C79544830M054451M090729L349915M796104M005165M081803L988456P954407
$$ y = [277181988, 275513744, 276866341, 273075008, 272439346, 271828823, 268926849, 267573624, 268696842, 270578918, 266149845, 265402946, 264179401, 264351883, 264347534, 262163048, 268049088, 265466480, 267565174, 267930183, 270297680, 275913582, 273360443, 264163113, 269950790, 275578632, 275063763, 277545185, 280289059, 281176472, 283202553, 284834518, 285430393, 285294037, 291635532, 295011234, 297493267, 300794792, 302446651, 302870522, 304987736, 311324921, 313567524, 316600018, 319091187, 322897911, 326619072, 325535965, 327655792, 331104584, 337696304, 341302109, 345808754, 353403816, 357198067, 361459351, 359852638, 362509575, 365834770, 372477875, 379544830, 383599281, 387690010, 391039925, 395836029, 399841194, 403922997, 407911453, 415865860]
1697.3D15865860Q970261P615699J5784150l872414L146858Q097038P384530M519195
1705D67511177O071358P084694M456176N092278K582741L032760N480385L802529M316787
1713.7E09430885N945511K696724o94885P84721N053711L664093L136521J109733M46205
1722.4E31573219J122666K136192L420258K469291J838875J928902J957626l75404
1730.1E46071625j880265L374672P006989j37024r028549O273041M706153J187096
1737.8E57573738L552170J967354P40776N180626L881797J616364K438164L212967
1745.5E80163956N36079K389603M299392K683335P049103L487281K096749N321655
1753.3F08027153K997551L242302L211250K135010K337456K185211K349625J980781
$$ y = [415865860, 424836121, 432451820, 448235970, 444363556, 447510414, 455607452, 462991982, 467511177, 473582535, 480667229, 485123405, 490215683, 492798424, 495831184, 501311569, 505114098, 509430885, 515376396, 518073120, 517378235, 518162956, 523216667, 526880760, 530017281, 531127014, 531573219, 532695885, 534832077, 538252335, 540721626, 542560501, 544489403, 546447029, 546071625, 544191360, 547566032, 554573021, 554435997, 545407448, 551680489, 556386642, 557573738, 561125908, 563093262, 563834038, 569014664, 572896461, 574512825, 576950989, 580163956, 580700035, 583089638, 587389030, 590072365, 597121468, 600608749, 602705498, 608027153, 611024704, 614267006, 617478256, 619613266, 621950722, 624135933, 626485558, 628466339]
1761F28466339m01039L320580L990592Q77533J75209J007538K773819j347198K774887
1769.7F41638260P638702J783295n499420l330689M830551K084275j476517J804123
1777.4F49472580P90253K826843J377106N10940J774826L69187P92999n77316O86J388016
1787F58726120K498398K155990K017899J274490o15616k121276j84174L276138L13797
1795.7F67341766j28021l55072n62286O02951r52072L572006Q61282K77252K782212
1804.4F73440018M47693J190261j284484j006852K075653N13077j550216K444229L889312
1813F80158691j95083J20239q78372j655426N94940K080536J666565j147766l66822
1821.7F80377502N4322J728058L777084j964874r46427K079010O96030J100845k192459
$$ y = [628466339, 628065300, 631385880, 635376472, 636254005, 636429214, 637436752, 640210571, 638863373, 641638260, 649276962, 651060257, 645560837, 642230148, 647060699, 649144974, 647668457, 649472580, 650262833, 653089676, 654466782, 654977722, 656752548, 657121735, 657914734, 657337418, 657338104, 658726120, 661224518, 663380508, 665398407, 666672897, 666057281, 663936005, 663751831, 667027969, 667341766, 667213745, 666858673, 666296387, 666899338, 665947266, 669519272, 670380554, 670657806, 673440018, 673887711, 675077972, 673793488, 672786636, 674862289, 675375366, 673825150, 676269379, 680158691, 679963608, 680083847, 679205475, 677550049, 678144989, 680225525, 681892090, 680744324, 680377502, 680431824, 682159882, 685936966, 683972092, 683025665, 685104675, 685800705, 686901550, 684709091]
1830.4F84709091L3264K822800R7046N40008Q68683M40750P43103l05099n36346O7443
1840.1F89480743K201386l21121J35574K06757m499512L597107K557754M34571n64728
1848.7F93228531j171036N10254N09796J496353P43485O76498M54407m73633q92792
1857.4F95081863o17675K833023J996307k25906O5841R50318M85611p66068J55487
1866.1F99958801J740647J704177j936950k706528O8970K048340L58963j545410J73492
1874.8F99864502j140976M35181J548538P16171J016998j623382j921692N56183K699051
1883.4G02150574J434784N31768O2409p62100N50766j290055j215515J060562M32587
1892.1G02955780O16608P61337r20715j266938J61438M26484J192169O88400P04880
$$ y = [684709091, 684742355, 687565155, 687662201, 688202209, 689070892, 689511642, 690254745, 689949646, 689413300, 689480743, 691682129, 691361008, 691496582, 691703339, 687203827, 690800934, 693358688, 693793259, 693228531, 692057495, 692567749, 693077545, 694573898, 695317383, 695993881, 696448288, 695974655, 695081863, 694464188, 697297211, 699293518, 699067612, 699133453, 700083771, 700569382, 699803314, 699958801, 701699448, 703403625, 701466675, 698760147, 698829117, 700877457, 701236420, 699691010, 699864502, 698723526, 699158707, 700707245, 701423416, 702440414, 700817032, 698895340, 699451523, 702150574, 703585358, 704117126, 704179535, 703417435, 703968201, 702678146, 701462631, 702523193, 702955780, 703572388, 704333725, 703413010, 702146072, 702307510, 702733994, 703926163, 704614563, 705319443]
1900.8G05319443j045761j121827J974869J075592J75171k633209k035904J518250
1908.5G03226624J294403J008911q45566p02515l80172Q70056J083221R44901J991958
1917.2G08491821l448028l720169K62146K145691L615646M95529k895203j890335N02701
1925.9G03559799J737061n33829k424927Q4992P49740Q21915J88675j060486J041870
1934.6G04164810m10919L42407O13861o97021P14569l46680R98459O96716n90286r8495
1944.2G05387421l46833o41479j175919M38690r52301K09885K401810k64893j388931
1952.9G03667450J34506Q9417j808853J232910J931152J60522k36053j371231M99954
1961.6G04299774M82483l37067j397552j291351Q63342L97491j33667k4795J186752
$$ y = [705319443, 704273682, 703151855, 705126724, 706202316, 706377487, 703744278, 701708374, 703226624, 704521027, 705529938, 704684372, 703981857, 703601685, 704471741, 705554962, 706499863, 708491821, 705043793, 701323624, 701585770, 703731461, 707347107, 707842636, 704947433, 703057098, 703559799, 705296860, 704763031, 702338104, 702423096, 703172836, 703994751, 704183426, 703122940, 704164810, 703753891, 704096298, 704710159, 704013138, 704727707, 704381027, 705379486, 706076202, 705485916, 705387421, 705040588, 704399109, 703223190, 703661880, 702709579, 702919464, 705321274, 705056381, 703667450, 703801956, 703891373, 702082520, 703315430, 705246582, 705407104, 705171051, 703799820, 704299774, 704782257, 704445190, 703047638, 701756287, 702619629, 703017120, 702883453, 702858658, 704045410]
1970.2G04045410N15213m65622r3994o65436M52729M3106j954575q92334J124039P7286
1979.9G02185822j417695p78656J401444J543350j012573j237869q89054K97013J066436
1988.6G01158218n91278m56085J060410M04815k354736j667938Q35724K122497N47867
1997.2G01059494j211243j710128j554642Q30078J110840N33142l99094p26700p59277
2005.9F97172470j211929J239013L12348m20685q87833j812820M50592R15604P98263
2014.6F96555023j067123j60370J749420j083832r02862K57416n36881m72031J003037
2023.3F95341797N76095j230773j567154M1656r48563k648773R41086J694718p12739
2032F91487350k523345n37262K728576P33338q17261k265625j574097J027527J582794
$$ y = [704045410, 704560623, 704095001, 704001007, 703335571, 703788300, 703831406, 701876831, 700984497, 702108536, 702185822, 700768127, 699989471, 701390915, 702934265, 701921692, 700683823, 699794769, 700091782, 701158218, 700566940, 700110855, 701171265, 701576080, 699221344, 697553406, 698389130, 700511627, 701059494, 699848251, 698138123, 696583481, 697413559, 698524399, 699057541, 698658447, 697931747, 697172470, 695960541, 697199554, 697511902, 697091217, 696203384, 694390564, 694841156, 695756760, 696555023, 695487900, 695327530, 697076950, 695993118, 695090256, 695347672, 694810791, 694338760, 695341797, 695917892, 694687119, 693119965, 693161621, 692213058, 689564285, 690505371, 692200089, 691487350, 688964005, 688426743, 691155319, 691888657, 691071396, 688805771, 687231674, 688259201, 689841995]
2040.6F89841995K53372k59628J276474j310806j437302R37577N40542r02328r88236
2049.3F87951660O92063r26514r10721l01743M33960J084443j221695o68869q62961
2058F85269623j469727j436767n15137J806869P82395q50983m66995J056137O11572
2066.7F84786987n61752p37915j085358j446228j909103j675034p68127P05948R32388
2075.4F78241806l34167j206894n84565p71637j58920P82089k122116j081314J32752
2084F72897034j241989P21511K150574R92737j321640l75137L77655M12979R15756
2092.7F75529480l3646K76184q26034j074982j90124J705856J526184j870193j021271
2101.4F74021454O83365K372970J748123p39135L95202J004105q46481j906739j272964
$$ y = [689841995, 690095367, 689835739, 691112213, 689801407, 688364105, 689301682, 689842224, 688939896, 687951660, 688643723, 687717209, 686806488, 686504745, 686938705, 688023148, 686801453, 686132584, 685269623, 683799896, 682363129, 681847992, 683654861, 684437256, 683586273, 683119278, 684175415, 684786987, 684225235, 683487320, 682401962, 680955734, 679046631, 677371597, 676603470, 677309418, 678241806, 677907639, 676700745, 676116180, 675344543, 675185623, 675967712, 673845596, 672764282, 672897034, 671655045, 672376556, 674527130, 675519867, 674198227, 673823090, 674200745, 674613724, 675529480, 675495834, 675772018, 674945984, 673871002, 673680878, 675386734, 676912918, 675042725, 674021454, 674704819, 677077789, 678825912, 678086777, 678481979, 679486084, 678639603, 676732864, 675459900]
2110.1F75459900r11713R67026K531586K141800l83072j686249J350861R96246j31378
2118.7F80335007r5673q49838q94623j141815p1945Q52813j88827j167908m2648q76160
2128.4F75858383j449661j59760p49511m21219J226196L222351J552658m97055j454620
2137.1F77127762k474137K35672J291504P42493N92880J435623J02692r42306R23385
2145.8F79035568k75879m95605m97894K245788K256546k246246l41492J477966J431504
2154.4F82590256J07498m34036p60041j520538m54407R05915K715759k60086j505585
2163.1F81384735j367416o43463J958847K05536J450119R61990k215347j481858J99585
2171.8F80452728o33468p44400J428146l89862m25873M33731M00467n23224j312713
$$ y = [675459900, 674548187, 675515213, 678046799, 680188599, 679805527, 678119278, 679470139, 680466385, 680335007, 680239334, 679389496, 678494873, 677353058, 677281113, 678133926, 677945099, 676777191, 676734543, 675858383, 674408722, 674248962, 673499451, 673078232, 674304428, 677526779, 679079437, 678582382, 677127762, 674653625, 674889297, 676180801, 676923294, 677516174, 678951797, 679054489, 678112183, 679035568, 678759689, 678264084, 677766190, 680011978, 682268524, 680022278, 679680786, 681158752, 682590256, 682697754, 682263718, 681503677, 679983139, 679528732, 680434647, 683150406, 682890320, 681384735, 680017319, 679373856, 681332703, 681538239, 682988358, 683950348, 681735001, 680253143, 680452728, 679819260, 679074860, 680503006, 680113144, 679687271, 680121002, 680521469, 679998245, 678685532]
2180.5F78685532N92270N74417K826690N71595k057419Q02917J333542J366425j103745
2189.1F83592224j191101J015930K222443k30637k830963J487579J610718j09939J949234
2197.8F87515488K152557j125870j419449J972504J576538j39389k115249j252976
2205.5F87164154O09207j16882J57013L77502J136399J569595K27127K30789J959381
2214.2F93314285m2648o81152L46832j854477O2256J456756L00141q94394j207047
2222.9F90800552M75846K1286m12445j73645J986236J933594j793594j838608K31399
2231.6F91230621M06342p67746L62854J822815J316986p87506j331940O81534Q53958
2240.3F93787918o73904j694413m35028Q7433N82276N10177M17938Q30307j533050
$$ y = [678685532, 679277802, 679852219, 682678909, 683250504, 681193085, 681996002, 683329544, 684695969, 683592224, 682401123, 683417053, 685639496, 685408859, 682577896, 684065475, 685676193, 685566254, 687515488, 689668045, 688542175, 687122726, 689095230, 690671768, 690532379, 688417130, 687164154, 687773361, 687656479, 687813492, 688190994, 689327393, 690896988, 691124115, 691354904, 693314285, 693271637, 692590485, 692937317, 691082840, 691145096, 692601852, 692901993, 692007599, 690800552, 691276398, 691297684, 690885239, 690711594, 692697830, 694631424, 692837830, 690999222, 691230621, 691636963, 690869217, 691232071, 693054886, 694371872, 693584366, 692252426, 692933960, 693787918, 693114014, 691419601, 690984573, 691072006, 691654282, 692164459, 692582397, 693412704, 691879654]
2248.9F91879654j11847R85489M68826O24008m05578p08695j279525o32096j341018
2257.6F89479218J139755J454773j554947J104965N11398o17904K68020J639252Q48160
2266.3F94272690j124344K78778p91168l97644J386490J622543J9150o39038m85764
2275F94141693k371750l45764P53326L79181R84955J018143l78647j028900r4833k168885
2284.6F90888519n03006K389756K644958N48401j453018o6757r74045L64074N09339
2293.3F94348221n81436J35650l35159J315079J696396J04522k517242j606674J353073
2302F93912430R27505o69098O02723K535095j623459j895065o94199n71671J585465
2310.7F94109726r10416j682739N53589K645264J05209n82810L29896j907654j031800
$$ y = [691879654, 691767807, 692753296, 693222122, 693846130, 693440552, 692731857, 691452332, 690820236, 689479218, 690618973, 692073746, 690518799, 691623764, 692135162, 691517258, 691785278, 693424530, 694272690, 693148346, 693427124, 692635956, 692238312, 693624802, 695247345, 695266495, 694627457, 694141693, 691769943, 691424179, 692177505, 692556686, 693541641, 694559784, 694181137, 693152237, 693057404, 690888519, 690385513, 692775269, 695420227, 695968628, 694515610, 694448853, 693474808, 693838882, 694348221, 693766785, 693902435, 693567276, 694882355, 696578751, 696683273, 694166031, 692559357, 693912430, 694839935, 694170837, 694773560, 697308655, 695685196, 693790131, 693095932, 692524261, 694109726, 693199310, 691516571, 692070160, 694715424, 694820633, 694237823, 694567719, 692660065, 691628265]
2319.3F91628265k26669L101959K02103k020035p88727l508224J363373L051834n66178
2328F92237701l029098K026977M009934p72400n28488j492691m99420j819611J523132
2336.7F91656036K041397j599502K661819J555863o08978k398301J424256K792511
2344.4F97525101k26136N8823k097702N90286J171112M63944K906494m39606o827774
2353.1F93124542Q50907O196594p85446M13971l281250K019729J547776p218247K631302
2361.8F95499878Q95157j93939J585006L264542L967132k164077j527329p49740j40610
2370.4G00436020J50604K999191K907258k280121j878662O07452r3994j146393K199020
2379.1G03900375J533509j738510n0583N0811n20935M97513P5073j38397l00903q52509
$$ y = [691628265, 691401596, 694503555, 694705658, 692685623, 691896896, 688388672, 689752045, 692803879, 692237701, 689208603, 691235580, 695245514, 694473114, 693944626, 692451935, 691952515, 690132904, 691656036, 693697433, 692097931, 694759750, 696315613, 695706635, 693308334, 694732590, 697525101, 697298965, 697357788, 695260086, 695850372, 697021484, 697485428, 700391922, 699952316, 693124542, 693975449, 700172043, 699386597, 699800568, 696519318, 698539047, 700086823, 692868576, 695499878, 696395035, 696201096, 697786102, 701050644, 705017776, 702853699, 701326370, 700576630, 700436020, 700586624, 703585815, 706493073, 704212952, 702334290, 702941742, 702847748, 701701355, 703900375, 705433884, 703695374, 703644791, 703695602, 703174667, 703672180, 703747253, 703608856, 703307953, 702455444]
2388.8G02455444P10144N40543K7695J059036n04913j588669j192017Q23517M62647
2397.4G02793427j090851J88751o48575N40848K091598O21338o98242p33261j2665
2406.1G03052368j338272j043777l5324M3869P89260K1515o81762M57458J037598J38397
2415.8G02441330m23813j803741j406708J049499J82572j002655J206131J165466j548996
2424.5F99859085k53525J046601N24673p08694j992264l67737N55649Q97980k13471
2433.1F99348297j028824L71933O9962n92728j195602j883927j410827J460724K017288
2441.8F97156296L6087P0267O027j42746j268463j957779k085343q62579J796341J575012
2451.5F94323120O72836l75137j526108n51147J585464l52020j485672J274948k41241
$$ y = [702455444, 703165588, 703706131, 703733826, 704792862, 704287949, 702699280, 701507263, 702330780, 702793427, 701702576, 701891327, 701242752, 701783600, 703875198, 704496536, 703798294, 703065033, 703052368, 701714096, 700670319, 700634995, 700678864, 701468124, 701489639, 700807877, 701265335, 702302933, 702441330, 702017517, 700213776, 698807068, 699856567, 700039139, 699036484, 700242615, 701408081, 699859085, 699605560, 700652161, 701176834, 700468140, 698475876, 698108139, 698663788, 699561768, 699348297, 698319473, 698691406, 698761368, 698168640, 696973038, 695089111, 693678284, 695139008, 697156296, 697192383, 697262650, 697268677, 697125931, 695857468, 693899689, 691814346, 690951767, 692748108, 694323120, 694995956, 694620819, 693094711, 692543564, 694129028, 693777008, 692291336, 693566284, 693325043]
2460.1F93325043j861038j497574K94037J910629L26462j871186j263275J920471j71585
2468.8F91111984j858062m21372n89371q40530m28314J108398l26767o49490l14789
2477.5F86791687P7515Q26645m96903L09448j832885j407319J017838K289M03290q82874
2487.1F84808731j484528r52529m4480P22504J054153j45416j721268J21079p49359
2495.8F81608887j022187J58997q9569l88336j088791l79563K06299R63745l92456
2504.5F79577026l63617K39106k015686m81491O40029j05514k95410M44031R72213
2513.2F78610687j075134j447754L44009L59269o82297Q52737J526413J26419k189560
2521.9F76424789l581619m43954J513519N86777m76303n92041J41143j24740j157379
$$ y = [693325043, 691464005, 689966431, 690260468, 692171097, 692497559, 690626373, 689363098, 691283569, 691111984, 689253922, 688832550, 688243179, 687402649, 686974335, 688082733, 687755966, 687106476, 686791687, 686869202, 687695847, 687198944, 687508392, 685675507, 684268188, 685286026, 685288315, 685691605, 684808731, 683324203, 682371674, 682327194, 683049698, 684103851, 683958435, 682237167, 682358246, 681608887, 680586700, 680745697, 680656128, 680267792, 679179001, 678799438, 679005737, 679969482, 679577026, 679213409, 679452515, 677436829, 676955338, 677595367, 677489853, 677194443, 677638474, 678610687, 677535553, 676087799, 676431808, 676791077, 676108780, 676961517, 678487930, 678614349, 676424789, 672843170, 672399216, 673912735, 674499512, 674023209, 673431168, 673572311, 673447571, 672290192]
2530.5F72290192j116791k6779N49774J362839J8539p71790n14221o88705Q97903O64063
2540.2F72665024P78274q32595k126999M44488Q70056J450q97980J15357J57089j166001
2549.8F70008163j016616l80326J359101R02404M04816n9738j283112m14734r841k96555
2559.5F69213562N11398K41928k055587j352997K67715K10877Q18481P71408n04684
2568.1F68122101j326294n84412N3253J317673J84326j693649j048737j581420k60392
2576.8F63182449J76621n93796N52673O99234m29382m87671L40882r39103k65731R29641
2586.5F63165817O94123k93122j762237J9912N82886J22147o67267j354447p19909
2595.1F59787903o87027L9825k90146o01272j10855M58679j191254j104507J187057
$$ y = [672290192, 671173401, 671146622, 671696396, 673059235, 673077774, 672305984, 671791763, 671103058, 672000961, 672665024, 673443298, 672610703, 670483704, 670928192, 671798248, 671799698, 670901718, 671017075, 671174164, 670008163, 668991547, 668611221, 669970322, 670872726, 671277542, 671217804, 669934692, 669519958, 669510117, 669213562, 669724960, 669966888, 667911301, 666558304, 666826019, 667036896, 667855377, 668626785, 668122101, 666795807, 666211395, 666264648, 667582321, 667766647, 666072998, 665024261, 663442841, 663182449, 663359070, 662765274, 663317947, 664017181, 663587799, 663100128, 663441010, 662501907, 662236176, 663165817, 663859940, 663566818, 661804581, 661824493, 662407379, 662529526, 661862259, 660507812, 659787903, 659100876, 659140701, 658850555, 658249283, 658138428, 658597107, 657405853, 656301346, 657488403]
2603.8F57488403j63574N21393j081925k481994K08969J33514l93600j767197q78830
2612.5F51585159J584320N65339k120820j071319J026077o29349O09513M58908j502762
2621.2F50505066p95593k57645m04053k389679p00607J523819j53503k01645L72162
2629.9F47498322n92576j384964J47858N01251j508865q37021J200333N24215j358795
2638.5F44189758j285858j68762k36435m1580o50101j327362Q94775o12182j561394
2647.2F39200859J401863j37482k029800j906052p87391M73861J282731R71145j028366
2655.9F37441368q40492j105576r18083o12144n08423M81338o26449k18659P9308M01420
2665.5F33573608r956k135048m73251M84772o81534j99166n86547j817055L85360J490937
$$ y = [657488403, 657324829, 657846222, 656764297, 654282303, 654491272, 654624786, 654231186, 652463989, 651585159, 653169479, 653734818, 651613998, 650542679, 651568756, 650939407, 651548920, 652007828, 650505066, 649709473, 649451828, 649047775, 646658096, 645957489, 647481308, 647327805, 647126160, 647498322, 646905746, 645520782, 645668640, 646169891, 644661026, 643824005, 645024338, 645548553, 644189758, 642903900, 642735138, 642498703, 642457123, 641807022, 640479660, 641374435, 640762253, 639200859, 640602722, 640465240, 638435440, 636529388, 635741997, 636215858, 637498589, 638469734, 637441368, 636600876, 635495300, 634577217, 633965073, 633456650, 633937988, 633311539, 633092880, 633172188, 633573608, 633563652, 631428604, 630955353, 631440125, 630758591, 630559425, 629972878, 628155823, 628541183, 630032120]
2675.2F30032120o04210j126290j171875n97267l90701k73857k04010p89490n53551
2683.9F24320869l35388M57268L00446q74520j141166K74238J39885r47571J119385
2692.5F23313446J519699p31163k540855o64902J864700J52130k424926k043228J386833
2701.2F19831734J507339r56344k408371j396294k97203j312637O32286M47578r43222
2709.9F15104866m65164j26496k72407j412544N27343l28865k430496q24470M08821
2718.6F10180588O83136k49367j87531N35393J188126r20792k641907p38677N9776
2727.3F07908745P28531l13378r68818m59404m88472q38738k633247j058464N70030
2735.9F02446785m02298k14081K53601M05617k24190p96509j71241n86510j655159
$$ y = [630032120, 629427910, 628301620, 627129745, 626532478, 626141777, 625867920, 625663910, 624874420, 624320869, 623985481, 624442749, 624743195, 623868675, 622727509, 623001747, 623141632, 622194061, 623313446, 624833145, 624101982, 621561127, 620896225, 622760925, 622913055, 620488129, 618444901, 619831734, 621339073, 620382729, 617974358, 616578064, 616280861, 614968224, 615600510, 616048088, 615104866, 614639702, 614513206, 614240799, 612828255, 613355598, 613026733, 610596237, 609771767, 610180588, 610863724, 610614357, 610426826, 610962219, 612150345, 611229553, 608587646, 607848969, 607908745, 608637276, 608323898, 607355080, 606895676, 606407204, 605568466, 602935219, 601876755, 602446785, 602044487, 601830406, 602084007, 602489624, 602265434, 601468925, 601297684, 600711174, 599056015]
2744.6E99056015o59904l40615M03328J561089L02200p46193j869774j412201M84276
2753.3E96778221N14031q35686j004486j80359m75884l99284o94694q4954R04465r52416
2762.9E93568954k561531n63850J946259K76908j195602j183395j234856n89561o55175
2771.6E87808151M11606L88718j887284j444168k69928j458549o80504q48961j585121
2780.3E80433960M24652j164551j226158N12505K52418k30026k101173q91304K48718
2789E76259041M08134N02549j672211k184448j624642R0256J324196r00040k471504
2797.7E69731331o26793L71857l08762q24661k283364k622871o79817R48524P2518
2806.3E63777962Q48045j44157l500977k046890j459160n55534k16370j072617L10631
$$ y = [599056015, 598396111, 598055496, 598458824, 600019913, 600322113, 599575920, 597706146, 596293945, 596778221, 597292252, 596456566, 595452080, 595271721, 594795837, 594396553, 593701859, 593616905, 594521370, 593568954, 591007423, 590443573, 592389832, 592666740, 591471138, 590287743, 589052887, 588463326, 587808151, 588219757, 588608475, 586721191, 585277023, 585007095, 583548546, 582868042, 582019081, 580433960, 580858612, 579694061, 578467903, 578980408, 579232826, 579002800, 576901627, 576010323, 576259041, 576667175, 577169724, 575497513, 573313065, 571688423, 571778679, 573102875, 572202835, 569731331, 569104538, 569476395, 569167633, 568342972, 566059608, 563436737, 562756920, 563705444, 563777962, 564626007, 564481850, 560980873, 558933983, 557474823, 556919289, 556702919, 555630302, 555940933]
2815E55940933k70500q15773j934509j805496p62444q80661o43616j441841j529503
2823.7E45856590r66224p6752k020874l392182j691017n73158J78795p48253r7046
2832.4E36469879q35571j998902j038589j416397j806831l187294k251435j066627
2840.1E22868233j671486l163757l859330k286644l165016k780990k830430l707428
2847.8D99403152l546028l039055m74815k345467l769226q44574j52816j227036l30543
2856.5D83673592N53665n46646l06092r5100N85403N6420k103119k410889k247391
2865.2D77159843j107521N42565J068115j495438l409690j751595n76820j127854j147384
2873.8D68154221j181755k828751j072579j5335n65528L05328j265450j190185j915398
$$ y = [555940933, 555670433, 554854660, 552920151, 551114655, 550352211, 549471550, 548827934, 547386093, 545856590, 544890366, 544813614, 542792740, 539400558, 537709541, 537136383, 537315178, 536566925, 536469879, 535634308, 533635406, 532596817, 531180420, 529373589, 526186295, 523934860, 522868233, 521196747, 518032990, 514173660, 511887016, 508722000, 505941010, 503110580, 499403152, 495857124, 492818069, 492343254, 489997787, 486228561, 485383987, 485231171, 484004135, 483673592, 484227257, 483680611, 483374519, 483279419, 483864822, 483921242, 481818123, 479407234, 477159843, 476052322, 476594887, 477663002, 476167564, 472757874, 471006279, 470429459, 469301605, 468154221, 466972466, 464143715, 463071136, 463055801, 462490273, 462795601, 461530151, 460339966, 458424568]
2882.5D58424568j813621J436119M67033l330307l073883m80766l081398k471619J120110
2891.2D47196236l70331j458435j157952K2011j665191l055497k53982L36761q13942
2899.9D38779678j298866q43048j140823j684037j507835j221390k69623J25542J78757
2908.6D31118355p38411j989594j943130q63075k77291j707229k912865k385712k048416
2917.2D16252632k003021p02934J38168o86646k360763k241402p37648j1635J469002
2925.9D09115753M88243q12568P6713j29661J70707J074219J506615k73094o85273
2934.6D10531654J899338J379242k99911r8000M8599P36046J709557J49192P11823
2943.3D16767540K872314l50608j474953J720886R21631k012100j243592R03779j75362
$$ y = [458424568, 456610947, 458047066, 458514099, 455183792, 452109909, 451629143, 448547745, 446076126, 447196236, 446825905, 445367470, 444209518, 444231529, 442566338, 439510841, 439256859, 439593620, 438779678, 437480812, 436637764, 435496941, 433812904, 432305069, 431083679, 430814056, 430939598, 431118355, 430379944, 428390350, 426447220, 425584145, 425306854, 423599625, 420686760, 418301048, 416252632, 414249611, 413546677, 413684845, 412998199, 410637436, 408396034, 407658386, 407646751, 409115753, 409603996, 408791428, 408868141, 408738480, 408909187, 409983406, 411490021, 411216927, 410531654, 412430992, 413810234, 413510323, 413412323, 413460922, 414196968, 415906525, 416055717, 416767540, 419639854, 419289246, 417814293, 419535179, 420456810, 418444710, 417201118, 418104897, 417929535]
2952D17929535j439324J39962N56793o17104j52778P2593L18261K60238p77626J124726
2961.6D17415276J746215o76765q0528R95254O68907K280236K202682J68686J262398
2970.3D25982361K416305N16777m47883J295738P48520J085434L827591K770996K475166
2979D40671005J471215p4616J623917M43611L85933K001037J163979J338463J581268
2987.6D50605812M13323J10435J370010J956368J115951P30935J179237J102753Q62693
2996.3D59447517K80762L88832J313286p7896j161194Q3847J262131M3068j149636
3005D60430717R16M42543L00903n37910o18210K07596J77498K899L90129J005783j404533
3015.6D60398331j677285L48435m44222j066055q60214O43272K06604q00667j61628
$$ y = [417929535, 416490211, 416630173, 417186966, 416569862, 416417084, 416489677, 416807938, 417068176, 416290550, 417415276, 419161491, 418484726, 418404198, 419399452, 420068359, 422348595, 424551277, 424719963, 425982361, 428398666, 428915443, 428467560, 429763298, 430511818, 431597252, 435424843, 438195839, 440671005, 442142220, 442067604, 443691521, 444135132, 444521065, 446522102, 447686081, 449024544, 450605812, 451019135, 451129570, 452499580, 454455948, 455571899, 456302834, 457482071, 458584824, 459447517, 459728279, 460117111, 461430397, 461352501, 460191307, 460275154, 461537285, 461580353, 460430717, 460431633, 460874176, 461175079, 460637169, 460018959, 460226555, 460404053, 460406952, 460797081, 461802864, 460398331, 458721046, 459069481, 458625259, 457559204, 456698990, 457342262, 457548866, 456748199, 456586571]
3024.3D56586571p05033j030540k854576k117233J835632R67140j687279j013221K36129
3033D50217590L56636q56323k931480k332878m00429n82733j600838j128387M83779
3041.6D41224937R93805k70538j246185r75228j307792j190300n90401m46548r55964
3050.3D35235786j268043M8866n10864j383667j197968n99403j27182j082840p96966
3059D28317719j253319p03278j084785k399407l4599K022l53470j24321j366997k127266
3068.6D18872299j528702k33841r33151P02400J594925j011581j813774j671791l53356
3077.3D13623428J430283k64320k415429o93206q73680j795807J28746O07376K12021
3086D09959412q81653j780625j935577j497040p31544q40302j697616k012139R12590
$$ y = [456586571, 455881538, 454850998, 451996422, 449879189, 451714821, 452681961, 450994682, 449981461, 450217590, 450574226, 449717903, 446786423, 444453545, 444053116, 443470383, 441869545, 440741158, 441224937, 442218742, 441948204, 440702019, 439726791, 438418999, 437228699, 436638298, 436191750, 435235786, 433967743, 434016609, 433505745, 432122078, 430924110, 430324707, 430197525, 429114685, 428317719, 427064400, 426361122, 425276337, 422876930, 422842331, 422844353, 422490883, 422366562, 420999565, 418872299, 417343597, 417109756, 416176605, 416879005, 418473930, 417462349, 415648575, 413976784, 413623428, 415053711, 414789391, 412373962, 411680756, 410807076, 409011269, 409140015, 409747391, 409959412, 409077759, 407297134, 405361557, 403864517, 403132973, 402292671, 400595055, 398582916, 399495506]
3094.7C99495506K018357L97758j801109l836708j670227M67491N93948n60837k014770
3103.4C93089409o40717N45197l82042p74384j224365k453766j171913j70784k66304
3112C86550331m26559r81598j45760j562652k927857j772041r4795Q18443k80304o42738
3121.7C78534470j646119k717819k192955j524544j44844M13170j197967j323624L70712
3130.4C68570480n03463j958237j960373j81084J71547j700668q20236r43489k549591
3139C58124886k306443m47426k19955k147560j412392m54216K87552J35193j865959
3147.7C49693680k017403o91986k23694j064720j383743k099266j174431o9504j191521
3156.4C39777412q75778j329269j257858j293717k382126j052093p10221j200904l74909
$$ y = [399495506, 401513863, 401911621, 400110512, 396273804, 394603577, 395071068, 395665016, 395104179, 393089409, 392448692, 392993889, 392611847, 391837463, 390613098, 388159332, 386987419, 386816635, 386550331, 386123772, 385142174, 384996414, 383433762, 380505905, 378733864, 378639069, 379457512, 379177208, 378534470, 376888351, 374170532, 371977577, 370453033, 370308189, 370721359, 369523392, 368199768, 368570480, 368067017, 366108780, 364148407, 363967323, 364138870, 362438202, 361617966, 360674477, 358124886, 355818443, 355371017, 355151062, 353003502, 351591110, 351136894, 351424446, 351559639, 349693680, 347676277, 346984291, 346760597, 345695877, 344312134, 342212868, 341038437, 340968933, 339777412, 338901634, 337572365, 336314507, 335020790, 332638664, 331586571, 330876350, 329675446, 329300537]
3165.1C29300537o95724j933594j626511l23372J11542j395607j219292M89884j001167
3173.8C21706696j855126j563015j071472n70297l42217l0155k223263j446018q9016
3182.4C12516117j395054j505222k838497j420651Q56610o51379j384354k78377k93751
3191.1C03605442k881985k860012L62892j36280k248726p95898O30455j37138k86999
3199.8B95251751j214771j793595l37257j739693j915226J148491J98155j013680j346283
3208.5B87237892j821251m91504r73435j012516k32677q80146j410408j391888j211166
3217.2B77812901k14653K39028j950378j965027j82285M77562j58806q46977m92230
3225.8B72719135k506141j902218J25141P3166L28617o28586L58601O47068j564484
$$ y = [329300537, 328604813, 326671219, 325044708, 324721336, 324832878, 323437271, 322217979, 322707863, 321706696, 319851570, 318288555, 317217083, 316646786, 316304569, 316274414, 314051151, 312605133, 312516117, 311121063, 309615841, 306777344, 305356693, 306213303, 305561924, 304177570, 303899193, 303605442, 300723457, 297863445, 298226337, 298090057, 295841331, 295045433, 295675888, 295538750, 295251751, 294036980, 292243385, 291906128, 290166435, 288251209, 289399700, 289597855, 288584175, 287237892, 285416641, 284925137, 283951702, 282939186, 282706509, 281826363, 280415955, 279024067, 277812901, 277598248, 277837276, 275886898, 273921871, 273739586, 274217148, 274058342, 273211365, 272719135, 270212994, 268310776, 268435917, 268509083, 268837700, 268209114, 268567715, 269214783, 267650299]
3234.5B67650299j979408Q8768J82743j703491j395531j240215m2305j066475j892033
3243.2B58602352J63326j032657j445465j191082r44081j235561j035214J268216N09472
3251.9B53659306j028481j056404q6346n83362n76458P0705j053848K36549O5785j601563
3261.5B48045883k107715j573277L16715j70002j425724n10120L64265l79600j17741
3270.2B42442684n43957q04901p0877j497745q29525O98642N1823j396294m88777l94802
3279.8B37166271j921272O10351j52111k756614j234398J123714J136799n60646j81007
3288.5B33231087j200314p41768Q15792J27144o91566k345829p45754N59635q43335
3297.2B28165092o09550R8763R5653M28162O94484j270923j199970J155834K69546
$$ y = [267650299, 265670891, 265759659, 265942402, 264238911, 262843380, 261603165, 261560860, 260494385, 258602352, 258765678, 257733021, 256287556, 255096474, 254152393, 252916832, 251881618, 253149834, 253659306, 252630825, 251574421, 251488075, 250904713, 250328255, 250398960, 249345112, 249581661, 249647446, 248045883, 245938168, 244364891, 244681606, 244511604, 243085880, 242575760, 242940025, 242560425, 242442684, 241898727, 241093826, 241022949, 239525204, 238695679, 239394321, 239446144, 238049850, 237561073, 237166271, 235244999, 235855350, 235703239, 232946625, 231712227, 232835941, 233972740, 233412094, 233231087, 232030773, 231289005, 232104797, 232231941, 231540375, 229194546, 228448792, 229008427, 228165092, 227555542, 227654305, 227749958, 228178120, 228872604, 227601681, 226401711, 227557545, 227827091]
3305.9B27827091j678810j287231j006012j142941L3493p6771j912403k413387K76165
3314.6B18619194Q33092M1847O44379j036988j076393j103267l88356J150341n68561
3323.2B17115288o27537p2670l51505j183377r42783j404648j725864O48956m16908
3331.9B11038952m21467q35400j921920N24845R91268M49238j564350k202435q86211
3340.6B05172520o4183P53308k40746j123829j659870m45824P74251K29434m66556
3349.3B02928505j056080j57967l06224o40946p41253j777305j391888m77829k62318
3357.9A96116695L85743L92627r40990j136475o38885N40485Q5774p06845P23992n68562
3367.6A94253559j243286j041737j315479r67293j029892k80819p82547o71234o87542
$$ y = [227827091, 226148281, 224861050, 223855038, 222712097, 222745590, 222668819, 220756416, 218343029, 218619194, 219452286, 219494133, 220138512, 219101524, 218025131, 216921864, 216533508, 217683849, 217115288, 216487751, 216415081, 216063576, 214880199, 213937416, 212532768, 210806904, 211455860, 211038952, 210617485, 209782085, 207860165, 208385010, 209376278, 209825516, 208261166, 206058731, 205172520, 205108337, 205861645, 205620899, 204497070, 202837200, 202391376, 203165627, 203395061, 202928505, 201872425, 201714458, 201408234, 200767288, 200026035, 198248730, 196856842, 196379013, 196116695, 196502438, 196895065, 195954075, 194817600, 194178715, 194719200, 194804974, 194098129, 194822121, 194253559, 193010273, 191968536, 190653057, 189685764, 188655872, 188375053, 187592506, 186921272, 186233730]
3376.3A86233730O26717K490654m13914j446190j697025j774979J3218q18729r47228
3384.9A82266254N16415M57306m84161j5107M68541L91197Q06865q23822j181945N39226
3394.6A82940769j064148j628628O70376M34838K95887N55496j065293j540660j289254
3403.3A78309383j350727N15385L030472J125984j587372j397190j202068k99645Q34675
3412A77978897J677704N22461n26142q1330j945781j361313J460132J881352o714j835232
3421.6A77764034o24828P41692K77347K27261K73895j412182N8327J311722j423378
3430.3A77193890K54898J975918R5558q02880j53465P16000k46888j65653P77569Q53272
3439.9A80498219O95591n05944r77611O66408J478272Q85925N80349l34110m28658
$$ y = [186233730, 186860447, 189351101, 188937187, 187490997, 185793972, 184018993, 184032211, 183213482, 182266254, 182782669, 183239975, 182755814, 182740707, 183209248, 183600445, 184407310, 183583488, 182401543, 182940769, 181876621, 180247993, 180918369, 181353207, 181649094, 182204590, 181139297, 179598637, 178309383, 176958656, 177474041, 180504513, 181630497, 180043125, 178645935, 177443867, 177144222, 177978897, 179656601, 180179062, 179652920, 179571590, 177625809, 176264496, 177724628, 179605980, 179599266, 177764034, 177139206, 177880898, 178158245, 178385506, 178659401, 177247219, 177305546, 178617268, 177193890, 177448788, 179424706, 179520264, 178717384, 178563919, 179279919, 179033031, 178867378, 179644947, 180498219, 181193810, 180687866, 179710255, 180376663, 181854935, 182740860, 183321209, 182987099, 182558441]
3448.6A82558441J4496J52397Q61626J000042O49586Q525k48870m20208J93309O65245
3458.2A85434589L38421J077214K29625P115J676082J419487L58010M71840l6049m02031
3467.9A90574303K335415K716789L78094r02081m08325Q51402P9861M70505P32879
3476.6A96828842P61528J429177k96231j504764n19715J424141J255799K39429N07984
3485.2B00126190J721077J517353n62839Q11653J196976M40368Q26664L07541J381970
3493.9B07766953J494064Q09269Q46729O57711J92719n10579Q14515K582721O48728
3502.6B15302830j517124L62834L98694P93762J821384P92198J341763Q97942p10469
3511.3B19483814p16991J227875J505813J052571K158336Q39806M27437M26960J075515
$$ y = [182558441, 182572937, 182725334, 183586960, 184587002, 185236588, 185245113, 184996243, 184576035, 184769344, 185434589, 185773010, 186850224, 187079849, 187086964, 188763046, 190182533, 190540543, 191012383, 190976334, 190574303, 192909718, 195626507, 196004601, 195102520, 194694195, 195545597, 195625458, 196095963, 196828842, 197590370, 199019547, 198723316, 197218552, 196698837, 198122978, 199378777, 199618206, 200126190, 201847267, 203364620, 202801781, 203613434, 204810410, 205250778, 206077442, 206384983, 207766953, 209261017, 210070286, 210917015, 211574726, 211767445, 211256866, 212071381, 214654102, 215302830, 213785706, 214148540, 214547234, 215340996, 217162380, 217954578, 219296341, 220194283, 219483814, 218766823, 219994698, 221500511, 222553082, 224711418, 225551224, 225978661, 226405621, 227481136]
3520B27481136J756859o47163k34852K031650J172715j76812R89037K150021K479725
3528.6B37002316J013240p37037P45334O5117J508503L188591J008854k6455l98407
3537.3B43370056J354084J675739J343041J974087J004944L61652J247616Q60634r976
3546B53181877L020668J337242M7951O71082l01285K313328J278076J251125K192440
3554.7B64992504J262436L436260L146458n10349j446457K627907J894931J147309
3562.4B76550999K007770k18773K231770J962833K408657J002713q22487L432083J689033
3571.1B90244598K51065O60076J057072K102203K999573K385158J922474L186245J627541
3579.7C06436005J365547j43490o9141K263240J156807L036194K542038J148434O78215
$$ y = [227481136, 229237995, 228590832, 228355980, 230387630, 231560345, 231383533, 232372570, 234522591, 237002316, 238015556, 237278519, 238023853, 238088970, 239597473, 242786064, 243794918, 243768463, 243370056, 244724140, 246399879, 247742920, 249717007, 250721951, 251083603, 252331219, 253191853, 253181877, 256202545, 257539787, 257587738, 258258820, 257957535, 260270863, 261548939, 262800064, 264992504, 266254940, 269691200, 272837658, 272327309, 270880852, 273508759, 275403690, 276550999, 278558769, 278339996, 280571766, 282534599, 284943256, 285945969, 285123482, 288555565, 290244598, 290495663, 291155739, 292212811, 294315014, 297314587, 299699745, 301622219, 304808464, 306436005, 307801552, 307658062, 307588921, 309852161, 311008968, 314045162, 316587200, 317735634, 318413849]
3588.4C18413849J478500N092583L812752K864990K73514J042328M673729J415100
3596.1C39067345J596145K576905K053604L271942K542190J056290O11649K798271
3603.9C55574341M093895K717705K826957K225151K828789K647667K699318M961395
3611.6C80575218K20070L0899N024758K057266L439026L722953K939911L083725O50139
3620.3D01743965J928864L459625N604286N304604K656555J692734L330650N890770
3628D31612053q22449n436058N847778O913529O741180L963814R59931L628845M726715
3636.6D58135338M200439L206559J939086K285500L933907L847541K858467L516503
3644.4D83923340M058418O078301L144950q30764N330620K382965J065178L954467
$$ y = [318413849, 319892349, 324984932, 328797684, 331662674, 331936188, 332978516, 337652245, 339067345, 340663490, 343240395, 345293999, 348565941, 351108131, 352164421, 352776070, 355574341, 359668236, 362385941, 365212898, 367438049, 370266838, 372914505, 375613823, 380575218, 380795288, 380826187, 385850945, 387908211, 391347237, 395070190, 398010101, 401093826, 401743965, 403672829, 407132454, 412736740, 418041344, 420697899, 422390633, 425721283, 431612053, 430789604, 425353546, 431201324, 438114853, 444856033, 448819847, 449779778, 453408623, 458135338, 462335777, 465542336, 467481422, 469766922, 473700829, 477548370, 480406837, 483923340, 487981758, 494060059, 497205009, 496374245, 501704865, 504087830, 505153008, 509107475]
3652.1E09107475N305100K938347M450035Q674812l852768J441193N107727J064377
3659.8E34236298M494896M352302L319321P32918J962738M299774K709541N027580
3667.5E61135368K680817J029739K252312j302681J573715M097176P322884L337631
3675.2E82126961j0341530k61040O707344M776039r15908M283294K882004L85780K949181
3683.9E92592125K644691J597329K687149M870071o297226K79770J0876198o256981
3691.6F02993126l197289N313912J861152K203026q96072j124306J913033P2059L420334
3700.3F12558975M505005m954224j279106N284882L663788K143821r97924j84174L404961
3709F24146004k737961M815292M653588j2987519M862252O787757j50680j06583J892662
$$ y = [509107475, 514412575, 517350922, 521800957, 530475769, 526623001, 528064194, 533171921, 534236298, 538731194, 543083496, 546402817, 547135735, 549098473, 553398247, 556107788, 561135368, 563816185, 564845924, 567098236, 565795555, 567369270, 571466446, 578789330, 582126961, 571785431, 571524391, 578231735, 583007774, 582091866, 586375160, 589257164, 589642944, 592592125, 595236816, 596834145, 599521294, 604391365, 598094139, 598373909, 609250107, 602993126, 599795837, 605109749, 606970901, 609173927, 608277855, 607153549, 609066582, 609138641, 612558975, 617063980, 612109756, 610830650, 616115532, 619779320, 621923141, 620925217, 620741043, 624146004, 621408043, 626223335, 630876923, 617889404, 622751656, 629539413, 629388733, 629282150, 631174812]
3717.7F31174812K021904k988815l16658O709023L75823l600807K605095q55026j910210
3726.3F33215141k445335M81872L613282M379883Q448486m367829q770904R956665
3734F44511261L218918r785156j102028L940696N83344p77512J715546j317215K379456
3742.7F43367310J2171630k295913k3008194O496086P046471R911880o81229j3066444
3750.4F39941597J2895622k741852j3308219M868125O215363M210510o220474K135773
3758.2F47996445O799850r954452l625489M444352N73196J998749O463775k122268
3765.9F52574158n886765L370285P119446K053375j1167297k067490L227921L056640
3773.6F52280273k47192j319580K566376Q14132K792130j660385r467240J710740K139358
$$ y = [631174812, 633196716, 630207901, 629891243, 636600266, 636976089, 633375282, 635980377, 635125351, 633215141, 630769806, 631251678, 634864960, 639244843, 647693329, 643325500, 634554596, 644511261, 647730179, 637945023, 636842995, 640783691, 641367035, 640589523, 642305069, 640987854, 643367310, 655538940, 653243027, 630234833, 636730919, 643777390, 653689270, 653008041, 639941597, 652837219, 650095367, 636787148, 641655273, 647870636, 652081146, 645860672, 647996445, 654796295, 644841843, 641216354, 645660706, 646233902, 648232651, 654696426, 652574158, 646687393, 650057678, 657177124, 659230499, 648063202, 645995712, 649223633, 652280273, 652033081, 650713501, 653279877, 654094009, 656886139, 655225754, 645758514, 647469254, 649608612]
3782.3F49608612K595902L798522j384811q72955q7586q33358J496048K121124o08597
3790.9F55832901q33359J823349m79355k5329K849884l634262k474976K576828L753357
3799.6F59389038M581223n171280o353379R44138J491547K856292K735443q138580
3807.3F52334442m208832O992951K861099q71277N3024K28959L356857M174957o019211
3816F58902969j2882385P611542O811600L612518Q181839j8372727o371460O709061
3823.7F54202957M390106K686921j244126m600067q31985L216934M948349Q80966q354721
3832.4F55295334K562103P105942p353211j600799Q855667n013275n984421M426499
3840.1F58293839n331193q05206P028504k516556l132706M920349K856751m17252j284942
$$ y = [649608612, 652204514, 656003036, 654618225, 653745270, 653657684, 652824326, 654320374, 656441498, 655832901, 654999542, 656822891, 656343536, 656318207, 659168091, 655533829, 653058853, 655635681, 659389038, 663970261, 658798981, 652445602, 653389740, 654881287, 657737579, 660473022, 652334442, 648125610, 655118561, 657979660, 657108383, 657161407, 657390366, 660747223, 664922180, 658902969, 646020584, 653632126, 660443726, 664056244, 672238083, 653865356, 647493896, 654202957, 658593063, 661279984, 660035858, 655435791, 654603806, 657820740, 662769089, 663650055, 655295334, 657857437, 664963379, 657610168, 656009369, 664865036, 659851761, 653867340, 658293839, 652962646, 652157440, 659185944, 656669388, 653536682, 658457031, 661313782, 660896530, 659611588]
3848.8F59611588l027115K612075N456315q331986K033768o205292k404175R400025
3856.5F59145203J98898l225021P82165K341309J581802n763702N57480N554885l535461
3865.2F57637558m479904K005005L334503O108627j672134r968491L22342N088425
3872.9F58375931M150696q655243J017456M319534k020493J087342M299392j394958
3880.6F61179657o670532L666229L031845J828919K634353j4037170J445389M055862
3888.3F57134552N86548M441070n60226o424637q04901M563293L09220j270065K21633
3897F58196487J270600K78396j0521392N980148N928497n159454K354202m270553K48565
3905.7F54305496J141663L98025K387619k749405n91964J747360J102447P82624j238861
$$ y = [659611588, 656584473, 659196548, 664652863, 656320877, 658354645, 652149353, 649745178, 659145203, 659344101, 656119080, 656901245, 659242554, 660824356, 655060654, 655618134, 661173019, 657637558, 653157654, 655162659, 658497162, 664605789, 662933655, 652965164, 653287506, 658375931, 662526627, 653871384, 654888840, 659208374, 657187881, 658275223, 662574615, 661179657, 654509125, 658175354, 661207199, 663036118, 665670471, 651633301, 653078690, 657134552, 657721100, 662162170, 661601944, 655177307, 654372406, 658935699, 659244919, 657974854, 658196487, 659467087, 659745483, 649224091, 655204239, 661132736, 655973282, 658327484, 654056931, 654305496, 655447159, 655845184, 658232803, 655483398, 654891434, 656638794, 657741241, 658523865, 657285004]
3914.4F57285004n7221J025467l237839j560363L458404q07342j763230K478333Q97140
3923.1F57718353j074371j935425n64575J545258j97220j976776q68989J419755L326797
3931.7F57392807j24741k501068M01917P09076J382141K01111j687775j767654k233887
3940.4F51771927P32193J188278j998672J35040J649246K442398L82996l503189J364135
3949.1F54164352Q12836k507553L314590K372666j787415j001892q11538r06067L37219
3957.8F53987198O65665p29371j30233j61057j300278j924133j0605K992859O88095
3966.5F54078140q71582J009293J974411M8828j778259k024384M32358L469009L01133
3975.1F56638947j724320n4855J354751r89532l541489q14285k6093K498398K604370
$$ y = [657285004, 657227783, 658253250, 655015411, 653455048, 656913452, 656106110, 654342880, 656821213, 657718353, 656643982, 654708557, 654143982, 655689240, 655492020, 653515244, 652646255, 654066010, 657392807, 657268066, 654766998, 655168915, 655877991, 657260132, 657461243, 655773468, 654005814, 651771927, 652504120, 653692398, 651693726, 651828766, 653478012, 655920410, 656303406, 652800217, 654164352, 654977188, 652469635, 655784225, 658156891, 656369476, 655367584, 654556046, 653649979, 653987198, 654652863, 653923492, 653793259, 653632202, 652331924, 650407791, 650397186, 653390045, 654078140, 653206558, 654215851, 656190262, 656239090, 654460831, 652436447, 652868805, 656337814, 656638947, 654914627, 654859772, 656214523, 655224991, 651683502, 650869217, 650843124, 653341522, 655945892]
3983.8F55945892l91388l61175j200638J010056J355819p80868k284317j863480P41043
3992.5F52170944m40597n21317L34473n5924J80588L27759K91214K59247
4000.2F52546387
$$ y = [655945892, 655554504, 655193329, 653992691, 655002747, 656358566, 655577698, 653293381, 651429901, 652170944, 651730347, 651209030, 651543503, 651487579, 651668167, 651995926, 652287140, 652546387]
##END=$$ End of the data block
