##TITLE=$$ Begin of the data block
##JCAMP-DX=5.00 $$ ACD/SpecManager v 10.08
##SPECTROMETER/DATA SYSTEM=Varian
##DATE=07 Jan 2013 10:37:32
##DATA TYPE=INFRARED SPECTRUM
##DATA CLASS=XYDATA
##ORIGIN=
##OWNER=
##NPOINTS=3735
##FIRSTX=399.26403809
##LASTX=4000.35498047
##MAXX=4000.35498047
##MINX=399.26403809
##MAXY=89.59434509
##MINY=5.23307467
##XFACTOR=1.0000000000
##YFACTOR=0.000000100000000
##FIRSTY=76.24846649
##DELTAX=0.96440572
##XUNITS=1/CM
##YUNITS=TRANSMITTANCE
##XYDATA=(X++(Y..Y))
$$ plain form
399.3 762484665 895943451 675919952 401825104 393664474 684558105 730520325 483839607
406 483839607 445210915 521580391 590069923 644083328 588989601 510145073 417343445 387441673
413.7 387441673 534487762 649735641 708023605 735469131 713232117 429297142 292659302
420.5 292659302 345305328 386416702 481397820 532831306 487572784 470545502 469265976 517363052
428.2 517363052 574823723 605589066 649496613 654780807 558981209 499552574 532934303 451434555
435.9 451434555 345856476 359300194 403196297 485896721 497613754 451061745 499725876
442.7 499725876 520454216 500034370 525429344 533744240 523127365 490525322 481897049 516915703
450.4 516915703 473981667 470791664 592648659 597832565 516614838 476350746 508158150 542529259
$$ packed form
399.3G62484665J33458786k20023499k74094848q160630K90893631M5962220k46680718
406D83839607l8628692P6369476O8489532N4013405n5093727p8844528r2801628k9901772
413.7C87441673J47046089J15247879N8287964K7445526k2237014k83934975j36637840
420.5B92659302N2646026M1111374R4981118N1433486m5258522j7027282j279526M8097076
428.2E17363052N7460671L0765343M3907547N284194r5799598n9428635L3381729q1499748
435.9D51434555j05578079J3443718M3896103Q2700424J1717033m6552009M8664131
442.7D99725876K0728340k0419846K5394974Q314896j0616875l2602043q628273L5018654
450.4E16915703m2934036l190003J21856995N183906q1217727m0264092L1807404L4371109
$$ plain form
458.1 542529259 482215919 439549217 409417877 400301628 435292015 453555031 474704094 503751259
465.8 503751259 503963394 495527229 478396111 490000191 436459541 363105125 452701797 539988136
473.5 539988136 509794388 505937119 491800575 458805923 466328545 455939369 431295128 462301979
481.2 462301979 491476364 520412941 480302010 429345436 466373978 478351936 494471970
488 494471970 545179176 515298347 471835785 487752914 479437561 475293274 512107544 511326103
495.7 511326103 517992630 509793434 474248238 493348465 539945869 559060020 519209862 500724945
503.4 500724945 532371788 529445305 515791206 506829872 469026642 451263161 491501846 516347847
511.1 516347847 487103691 466452217 474393463 466388168 440905647 441499214 434944534 422282715
$$ packed form
458.1E42529259o0313340m2666702l0131340r116249L4990387J8263016K1149063K9047165
465.8E03751259K12135q436165j7131118J1604080n3540650p3354416Q9596672Q7286339
473.5E39988136l0193748l857269j4136544l2994652P522622j0389176k4644241L1006851
481.2D62301979K9174385K8936577m0110931n0956574L7028542J1977958J6120034
488D94471970N0707206k9880829m3462562J5917129q315353m144287L6814270p81441
495.7E11326103O666527q199196l5545196J9100227M6597404J9114151l9850158j8484917
503.4E00724945L1646843k926483j3654099q961334l7803230j7763481M0238685K4846001
511.1E16347847k9244156k0651474P941246q005295k5482521N93567o554680j2661819
$$ plain form
518.9 422282715 441101418 452459030 436205788 435481262 446848869 448366928 456198730 457132378
526.6 457132378 469066048 480233345 462897835 433899040 405046768 402219925 420822258 444358749
534.3 444358749 452197075 455188789 466858368 447341385 438947868 458497047 446526718 434192886
542 434192886 455874290 462484627 448222198 446862297 463135948 474960480 462779655 466261406
549.7 466261406 483389053 465711899 436003494 418827057 436760941 466025429 470386467 459457169
557.4 459457169 438778992 431718903 453644333 495162582 503076057 468197441 451270828 458352089
565.1 458352089 474642563 469912338 446325150 444570236 430450706 416323128 438219261 452180824
572.9 452180824 451223030 443793602 436719398 453993874 462706833 460001183 460636902 451466942 448682518
$$ packed form
518.9D22282715J8818703J1357612j6253242p24526J1367607J518059P831802R33648
526.6D57132378J1933670J1167297j7335510k8998795k8852272k826843J8602333K3536491
534.3D44358749P838326K991714J1669579j9516983q393517J9549179j1970329j2333832
542D34192886K1681404O610337j4262429j359901J6273651J1824532j2180825L481751
549.7D66261406J7127647j7677154k9708405j7176437J7933884K9264488M361038j0929298
557.4D59457169k0678177p060089K1925430M1518249P913475l4878616j6926613P081261
565.1D58352089J6290474m730225k3587188j754914j4119530j4127578K1896133J3961563
572.9D52180824r57794p429428p074204J7274476Q712959k705650O35719r169960k784424
$$ plain form
581.5 448682518 451971130 446714134 458123131 473261452 469048576 467584572 454623070 456506729
589.3 456506729 471631203 457919388 457700462 458294411 454741478 455640526 438487549 443402176
597 443402176 446343956 425602837 421573410 438379784 447246780 444967728 457350082 451802483
604.7 451802483 425845261 419379959 407145920 390381775 382418671 373555450 357957001 330409241
612.4 330409241 306152210 297138138 304968796 321801033 315309505 306757698 311164055 307509022
620.1 307509022 299176655 271903191 254697857 260517349 254285088 251272106 267813663 295882454
627.8 295882454 321250725 348597069 361694641 349997406 332372704 327580185 346337852 341737976
635.5 341737976 314131947 307769737 315081329 321746101 326370354 335095329 348089561 374389229
$$ packed form
581.5D48682518L288612n256996J1408997J5138321m212876j464004j2961502J883659
589.3D56506729J5124474j3711815k18926N93949l552933Q99048j7152977M914627
597D43402176K941780k0741119m029427J6806374Q866996k279052J2382354n547599
604.7D51802483k5957222o465302j2234039j6764145p963104q863221j5598449k7547760
612.4C30409241k4257031r014072P830658J6832237o491528q551807M406357l655033
620.1C07509022q332367k7273464j7205334N819492o232261l012982J6541557K8068791
627.8B95882454K5368271K7346344J3097572j1697235j7624702m792519J8757667m599876
635.5C41737976k7606029o362210P311592O664772M624253Q724975J2994232K6299668
$$ plain form
643.3 374389229 391968918 401470985 429672165 451233101 461907349 473791580 476346931 470649834
651 470649834 477175255 487154541 479827995 479674377 484215012 485319443 501486244 519664001 510351181
659.7 510351181 493344460 491237526 488976898 497361488 509521027 509319229 508758125 494356728
667.4 494356728 455430794 467263451 489931679 507263908 502578392 506078491 512136955 506028709
675.1 506028709 504378052 505534782 514642525 516314011 503641663 502939262 513638382 520220604
682.8 520220604 513575630 505181007 510638542 517084045 520851021 519700851 504687309 505643997
690.5 505643997 516229019 506584854 500964203 501161003 499140434 502036438 496868858 489334908
698.2 489334908 483644638 480843086 487053871 490424385 490043793 492689133 490113335 474640312
$$ packed form
643.3C74389229J7579689R502067K8201180K1560936J0674248J1884231K555351n697097
651D70649834O525421R979286p326546j53618M540635J104431J6166801J8177757r312820
659.7E10351181j7006721k106934k260628Q384590J2159539k01798n61104j4401397
667.4D94356728l8925934J1832657K2668228J7332229m685516L500099O058464o108246
675.1E06028709j650657J156730R107743J671486j2672348p02401J0699120O582222
682.8E20220604o644974q394623N457535O445503L766976j150170j5013542R56688
690.5E05643997J0585022r644165n620651J96800k020569K896004n167580p533950
698.2D89334908n690270k801552O210785L370514l80592K645340k575798j5473023
$$ plain form
705.9 474640312 473388519 493659668 503205223 497747421 496429024 512083511 523369598 518056679
713.7 518056679 518100777 523054504 527280197 526782761 525405045 526174927 527180939 530269737 525759315
722.3 525759315 524443436 528127556 524276237 513939514 504712219 512252846 520474091 512463913
730.1 512463913 505292892 512299919 524395218 524419403 521451721 520614471 517061081 522800827 527390862
738.7 527390862 523583450 521361313 515885124 516761284 523789825 524328079 521226654 517846260 521924171
747.4 521924171 526128769 528593559 534086914 537140312 545564919 552811661 552820396 551581535 552318268
756.1 552318268 557099419 557220497 555661087 559968567 559076500 553926277 555915184 558477974 564237213
764.8 564237213 569985046 567233658 567462349 571206665 581193466 584298058 573716354 566546707
$$ packed form
705.9D74640312j251793K0271149R545555n457802j318397J5654487J1286087n312919
713.7E18056679M4098M953727M225693m97436j377716P69882J006012L088798m510422
722.3E25759315j315879L684120l851319j0336723r227295P540627Q221245q010178
730.1E12463913p171021P007027J2095299K4185k967682q37250l553390N739746M590035
738.7E27390862l807412k222137n476189Q76160P028541N38254l101425l380394M077911
747.4E21924171M204598K464790N493355L053398Q424607P246742Q735j238861P36733
756.1E52318268M781151J21078j559410M307480q92067n150223J988907K562790N759239
764.8E64237213N747833k751388K28691L744316R986801L104592j0581704p169647
$$ plain form
772.5 566546707 562417717 568454781 575773697 579354286 584168358 580740852 575300865 569648666
780.2 569648666 572783775 589261246 600836029 597855186 591999168 598263435 607272644 609663544
787.9 609663544 611809235 612020187 601200638 590095329 589695244 594189987 601971321 607350769
795.6 607350769 606151543 599642906 598539848 604697990 610101128 617467384 617372665 614155312 614123001
804.3 614123001 609921227 606808891 601175766 593621712 596138039 605071220 609154434 606339188
812 606339188 600288773 601390152 606838684 610145531 613716011 605983734 599911041 603892899 604189720
820.7 604189720 608283348 616175613 617583771 611179276 606184921 603397217 601158714 608452835
828.4 608452835 617328606 615220375 600645905 581705818 571511497 572575493 575742950 570780373
$$ packed form
772.5E66546707m128990O037064P318916L580589M814072l427506n439987n652199
780.2E69648666L135109J6477471J1574783k980843n856018O264267R009209K390900
787.9F09663544K145691K10952j0819549j1105309m00085M494743P781334N379448
795.6F07350769j199226o508637j103058O158142N403138P366256r4719l217353l2311
804.3F14123001m201774l112336n633125p554054K516327Q933181M083214k815246
812F06339188o050415J101379N448532L306847L570480p732277o072693L981858K96821
820.7F04189720M093628P892265J408158o404495m994355k787704k238503P294121
828.4F08452835Q875771k108231j4574470j8940087j0194321J063996L167457m962577
$$ plain form
836.1 570780373 556819038 552906723 561773567 558978691 554941025 553452759 545931015 538139839
843.9 538139839 528996353 528183479 530181313 531282082 533872833 539821815 549995956 551506844
851.6 551506844 544388733 536496964 550544510 570106506 567572441 566887817 572709923 577878647
859.3 577878647 577973557 579236984 584190025 584886322 589542809 592895584 592743073 592097664 595175896
868 595175896 598105011 596962318 599756622 596724930 595216751 597735291 598591728 600023270 596295738
876.7 596295738 597812958 600245399 597618103 592280655 583921700 585394478 593823013 595290337
884.4 595290337 589510269 586824532 587936897 585910454 579857941 572565880 572731705 578880005 580853539
893 580853539 577566986 575990677 580900650 584382133 580845184 577168922 578700294 584124069 583586617
$$ packed form
836.1E70780373j3961335l912315Q866844k794876m037666j488266p521744p791176
843.9E38139839r143486q12874J997834J100769K590751N948982J0174141J510888
851.6E51506844p118111p891769J4047546J9561996k534065o84624N822106N168724
859.3E77878647R4910J263427M953041O96297M656487L352775j52511o45409L078232
868E95175896K929115j142693K794304l031692j508179K518540Q56437J431542l727532
876.7E96295738J517220K432441k627296n337448q358955J472778Q428535J467324
884.4E95290337n780068k685737J112365k026443o052513p292061J65825O148300J973534
893E80853539l286553j576309M909973L481483l536949l676262J531372N423775n37452
$$ plain form
901.7 583586617 575620575 573912506 578264160 577297325 568694458 566534729 569344444 563700333 564794312
910.4 564794312 568543930 560045242 549675789 545447350 543305664 536280937 534611435 533396721
918.1 533396721 523903122 517261620 513531113 514299431 515339050 511219749 503174515 495379868 496860580
926.8 496860580 503161583 511018181 513300285 506427078 501655579 499275856 502901917 509543877
934.5 509543877 510539856 510724945 512324524 515727005 520499268 526308670 529506187 529060135 534724541
943.2 534724541 546941872 554429970 553846397 556298790 562514763 563305206 560927620 559187698 558763504
951.9 558763504 562198982 566841850 569048615 571191139 571593208 570245132 567265968 562501945 560588837
960.6 560588837 556738777 550196571 545452003 542930069 537176476 528799477 531040268 531696129 527135773
$$ packed form
901.7E83586617p966042j708069M351654r66835q602867k159729K809715n644111J093979
910.4E64794312L749618q498688j0369453m228439k141686p024727j669502j214714
918.1E33396721r493599o641502l730507P68318J039619m119301q045234p794647J480712
926.8D96860580O301003P856598K282104o873207m771499k379723L626061O641960
934.5E09543877R95979J85089J599579L402481M772263N809402L197517m46052N664406
943.2E34724541J2217331P488098n83573K452393O215973P90443k377586j739922m24194
951.9E58763504L435478M642868K206765K142524M02069j348076k979164m764023j913108
960.6E60588837l850060o542206m744568k521934n753593q376999K240791O55861m560356
$$ plain form
969.2 527135773 529130707 527576370 521058884 511699104 511495285 521875534 519684105 510902367
976.9 510902367 507546654 505232811 507263718 513161163 510004349 504512367 503632278 501520004 499226265
985.6 499226265 492609596 487409172 485600777 483474655 477007942 466277351 459411316 444684792
993.3 444684792 428333931 410147247 389767799 390145111 406795349 428123131 436798897 440680695
1001.1 440680695 447625046 448373375 448942184 444635239 443579712 442457352 438333168 438037720 433038292
1009.7 433038292 431239433 434495544 438567276 437255936 431348839 423545189 415221062 418651733
1017.5 418651733 421049080 418349915 415860710 410298500 406499748 403637123 400506134 393459358
1025.2 393459358 389099159 390189972 389723701 389322777 383360710 377490196 379486198 378498077 373131256
$$ packed form
969.2E27135773J994934j554337o517486r359780k03819J0380249k191429q781738
976.9E10902367l355713k313843K030907N897445l156814n491982q80089k112274k293739
985.6D99226265o616669n200424j808395k126122o466713j0730591o866035j4726524
993.3D44684792j6350861j8186684k0379448L77312J6650238K1327782Q675766L881798
1001.1D40680695O944351P48329N68809m306945j055527j122360m124184k95448m999428
1009.7D33038292j798859L256111M071732j311340n907097p803650q324127L430671
1017.5D18651733K397347k699165k489205n562210l798752k862625l130989p046776
1025.2C93459358m360199J090813m66271m00924n962067n870514J996002r88121n366821
$$ plain form
1033.8 373131256 366826286 362009392 360759964 358874016 357553711 356095085 359296074 362703972
1041.6 362703972 352586365 346130142 352551537 359313240 361764297 362279167 359363480 358404198
1049.3 358404198 365783920 367851486 363679543 360912323 364472160 368589401 360863037 356618118
1057 356618118 357695847 356150093 356804237 359524078 362829018 361436920 358852501 358341141 354655342
1065.7 354655342 351518745 352301331 353228035 354147606 355274467 352943764 346940727 344169579 345835991
1074.4 345835991 344495125 341772346 338984451 339703293 341912346 337451477 334951897 335099831 333991508
1083 333991508 331421051 330869064 330777397 326236191 323035965 319570179 316526985 309891949 304502201
1091.7 304502201 300939522 288138866 277143707 265691872 251862011 239131260 230464897 221566925
$$ packed form
1033.8C73131256o304970m816894j249428j885948j320305j458626L200989L407898
1041.6C62703972j0117607o456223O421395O761703K451057N14870k915687r59282
1049.3C58404198P379722K067566m171943k767220L559837M117241p726364m244919
1057C56618118J077729j545754O54144K719841L304940j392098k584419n11360l685799
1065.7C54655342l136597P82586R26704R19571J126861k330703o003037k771148J666412
1074.4C45835991j340866k722779k787895P18842K209053m460869k499580J47934j108323
1083C33991508k570457n51987r1667m541206l200226l465786l043194o635036n389748
1091.7C04502201l562679j2800656j0995159j1451835j3829861j2730751q666363q897972
$$ plain form
1099.4 221566925 205081406 194970322 185324917 175534286 167556400 159570484 154083529 145502129
1107.1 145502129 136189919 126831799 121610851 114158382 110126429 108973284 101674271 97909527
1114.9 97909527 94716206 95637970 96393337 94811678 92424402 92547703 93686504 89296131 94269781
1123.5 94269781 98836727 98841877 99788561 102123928 105168142 105013103 107924232 104367313 100301600
1132.2 100301600 99730387 98030462 95742760 89919977 84939871 79627986 81565866 83333912
1139.9 83333912 80130882 77803335 73756995 68845620 65246592 67398477 66118035 65411768 64344773
1148.6 64344773 60239716 59001279 56476765 55455232 52330747 53912921 57161555 60597315
1156.3 60597315 64667711 61258240 61579857 62088027 63196907 67310004 70252328 72575593 76535649
$$ packed form
1099.4B21566925j6485519j0111084r645405r790631p977886p985916n486955q581400
1107.1A45502129r312210r358120n220948p452469m031953j153145p299013l764744
1114.9I7909527l193321R21764P55367j581659k387276J23301J138801m390373M973650
1123.5I4269781M566946N150R46684K335367L044214j55039K911129l556919m065713
1132.2A00301600n71213j699925k287702n822783m980106n311885J937880J768046
1139.9H3333912l203030k327547m046340m911375l599028K151885j280442p06267j066995
1148.6F4344773m105057j238437k524514j021533l124485J582174L248634L435760
1156.3F0597315M070396l409471L21617N08170J108880M113097K942324K323265L960056
$$ plain form
1165 76535649 81805830 83461142 85047388 86582861 90719881 92910442 96938992 104420595 111518536
1173.7 111518536 121322136 122670078 128652601 141169701 148169546 151419630 157962465 169739475
1181.4 169739475 175998192 183261204 187206135 191075420 201107121 212064114 222788448 224795513
1189.1 224795513 227920513 232155476 235643196 242319946 250415058 259446888 262880840 267484207
1196.8 267484207 273043671 278816338 287530460 295376606 302118549 310148506 319335976 323023834
1204.5 323023834 326321869 331728630 337897530 344319878 350528793 357788048 360678711 363604622
1212.3 363604622 368887482 372433128 373554802 376466141 379657326 380401077 384722137 387050438
1220 387050438 387982368 388741760 389473114 392951393 394153557 396754646 396788025 394096184 395005798
$$ packed form
1165G6535649N270181J655312J586246J535473M137020K190561M028550P481603P097941
1173.7A11518536R803600J347942N982523J2517100O999845L250084O542835J1777010
1181.4A69739475O258717P263012L944931L869285J0031701J0956993J0724334K007065
1189.1B24795513L125000M234963L487720O676750Q095112R031830L433952M603367
1196.8B67484207N559464N772667Q714122P846146O741943Q029957R187470L687858
1204.5C23023834L298035N406761O168900O422348O208915P259255K890663K925911
1212.3C63604622N282860L545646J121674K911339L191185P43751M321060K328301
1220C87050438R31930P59392P31354L478279J202164K601089L3379k691841R09614
$$ plain form
1228.6 395005798 396997337 398396797 399353752 402132912 403470802 403556137 403712997 402943954 403777161
1237.3 403777161 405930748 407010231 407713966 409640274 411293831 413326378 411356125 410429726 415492401
1246 415492401 417369728 416728439 414599228 414424515 416760292 418433723 420128288 420203018 421863213
1254.7 421863213 423135490 423248787 424622421 425731316 426181335 426275215 425787163 426630173 428820000
1263.4 428820000 428033943 430337944 434620247 436743889 439174500 440343323 441717834 441117439 441739883
1272 441739883 443431244 445172615 448799477 450732765 454512672 458167305 460123291 459478188 458467445
1280.7 458467445 461851463 466551666 471423264 473481178 475081062 477687187 482101440 486402550
1288.4 486402550 486408882 489167671 492979851 493696594 494006310 496078033 498646736 501364708 506007347
$$ packed form
1228.6C95005798J991539J399460R56955K779160J337890Q5335J56860p69043Q33207
1237.3D03777161K153587J079483P03735J926308J653557K032547j970253r26399N062675
1246D15492401J877327o41289k129211j74713K335777J673431J694565P4730J660195
1254.7D21863213J272277J13297J373634J108895M50019R3880m88052Q43010K189827
1263.4D28820000p86057K304001M282303K123642K430611J168823J374511o00395O22444
1272D41739883J691361J741371L626862J933288L779907L654633J955986o45103j010743
1280.7D58467445L384018M700203M871598K057914J599884K606125M414253M301110
1288.4D86402550O332K758789L812180P16743L09716K071723K568703K717972M642639
$$ plain form
1297.1 506007347 507780571 507902031 509683914 512519341 516372871 518327179 517692986 517293701 516815605
1305.8 516815605 517035751 520851860 524271927 526103058 526698990 526585846 528614273 529012108 529208832
1314.5 529208832 530558548 531108246 530971985 531269684 534255981 535003853 533971825 535507889 537336693
1323.2 537336693 536727753 537149734 540451088 542088852 543675194 544109917 543151169 545333824 545207138
1331.8 545207138 542058144 540653229 541236534 545576210 548729401 544377594 542659264 545282822
1339.6 545282822 545082321 545296364 546081772 547469902 546207581 544063377 545233345 545923653 546302719
1348.2 546302719 543452873 540749130 542627335 544347267 545813179 545297432 542077217 539361992
1355.9 539361992 539410744 539200668 538791008 540942307 541811485 540022278 534983788 533329277 537072754
$$ packed form
1297.1E06007347J773224J21460J781883K835427L853530J954308o34193l99285m78096
1305.8E16815605K20146L816109L420067J831131N95932j13144K028427L97835J96724
1314.5E29208832J349716N49698j36261K97699K986297P47872j032028J536064J828804
1323.2E37336693o08940M21981L301354J637764J586342M34723r58748K182655j26686
1331.8E45207138l148994j404915N83305M339676L153191m351807j718330K623558
1339.6E45282822k00501K14043P85408J388130j262321k144204J169968O90308L79066
1348.2E46302719k849846k703743J878205J719932J465912n15747l220215k715225
1355.9E39361992M8752k10076m09660K151299Q69178j789207n038490j654511L743477
$$ plain form
1364.6 537072754 538413200 537076988 534415321 534843979 535337639 533977470 531430626 528635025 530438004
1373.3 530438004 530582581 526666107 523955498 523676949 525320206 525740204 524696465 522373924 522242966
1382 522242966 521774635 519121513 518477707 520190277 523141289 524299965 524992104 526001701 526369896
1390.7 526369896 526379585 525777817 527979469 530369873 528768311 526762695 524215927 523000336 520928955
1399.3 520928955 519997215 521049309 519558372 517374496 519387703 520041924 514588852 512967148 514535294
1408 514535294 515528297 514480324 512971039 513684845 513797569 512814026 510709648 508963203 508555717
1416.7 508555717 507710953 509054146 509775391 509826889 511714363 512238426 510652390 508349953 511053123
1425.4 511053123 514239235 514744339 515528069 517161751 518597488 519791527 521167526 520068855 519199600
$$ packed form
1364.6E37072754J340446j336212k661667M28658M93660j360169k546844k795601J802979
1373.3E30438004J44577l916474k710609k78549J643257M19998j043739k322541j30958
1382E22242966m68331k653122o43806J712570K951012J158676O92139J009597L68195
1390.7E26369896R689o01768K201652K390404j601562k005616k546768j215591k071381
1399.3E20928955r31740J052094j490937k183876K013207O54221n453072j621704J568146
1408E14535294R93003j047973j509285P13806J12724r83543k104378j746445m07486
1416.7E08555717q44764J343193P21245N1498J887474N24063j586036k302437K703170
1425.4E11053123L186112N05104P83730J633682J435737J194039J375999j098671q69255
$$ plain form
1434.1 519199600 521148682 523294487 523251762 522473030 526639442 529779854 527469902 525965004 528844719
1442.7 528844719 533162003 535802116 536350746 535762939 538968658 540615005 537136192 537617836 539909515
1451.4 539909515 539850540 538121223 539251823 542894478 545809135 545378990 543144302 545217896 547184639
1460.1 547184639 550697365 553208084 554088211 558311424 561426239 559627724 559385033 558806076 558306351
1468.8 558306351 559785118 561831779 562456398 566473351 571407585 573293724 575163498 578243179
1476.5 578243179 581914139 585194321 585916214 584180565 585190201 589738617 593228569 593553696 592574158
1485.2 592574158 593495979 592120781 590506935 595379143 599987907 598893318 594747353 590636253
1492.9 590636253 588976707 590236397 593810577 593389320 593120461 592311440 588714447 587922821 584116096
$$ packed form
1434.1E19199600J949082K145805m2725p78732M166412L140412k309952j504898K879715
1442.7E28844719M317284K640113N48630n87807L205719J646347l478813M81644K291679
1451.4E39909515n8975j729317J130600L642655K914657m30145k234688K073594J966743
1460.1E47184639L512726K510719Q80127M223213L114815j798515k42691n78957m99725
1468.8E58306351J478767K046661O24619M016953M934234J886139J869774L079681
1476.5E78243179L670960L280182P21893j735649J009636M548416L489952L25127r79538
1485.2E92574158R21821j375198j613846M872208M608764j094589m145965m111100
1492.9E90636253j659546J259690L574180m21257k68859q09021l596993p91626l806725
$$ plain form
1501.6 584116096 581604462 582412796 585819321 593456039 590502892 572921867 573645439 575868950
1509.3 575868950 571661720 567769852 564201813 561274872 562752266 564236870 562647514 558533592
1517 558533592 555052261 555285606 558201141 559609070 554799271 552917786 552198448 551126251 547171898
1525.7 547171898 548555298 550871201 550552216 549227638 545974121 542164688 542063637 547399902 545489845
1534.3 545489845 541695862 539439888 537307930 535570107 529589806 533679008 537912674 540360870
1542.1 540360870 537871284 536385422 535188675 530895844 532538986 533855133 533065529 531563950
1549.8 531563950 531944962 534452629 535058899 534155350 535229721 537555809 537158813 535641098 524971619
1558.5 524971619 526706467 544053650 543677940 545127945 547132797 549934006 551052933 549940643
$$ packed form
1501.6E84116096k511634Q08334L406525P636718k953147j7581025P23572K223511
1509.3E75868950m207230l891868l568039k926941J477394J484604j589356m113922
1517E58533592l481331K33345K915535J407929m809799j881485p19338j072197l954353
1525.7E47171898J383400K315903l18985j324578l253517l809433j01051N336265j910057
1534.3E45489845l793983k255974k131958j737823n980301M089202M233666K448196
1542.1E40360870k489586j485862j196747m292831J643142J316147p89604j501579
1549.8E31563950L81012K507667O06270r03549J074371K326088l96996j517715j0669479
1558.5E24971619J734848J7347183l75710J450005K004852K801209J118927j112290
$$ plain form
1566.2 549940643 549840355 549020767 552139778 551571465 550759087 551285973 548966904 547955093 545675659
1574.9 545675659 544556694 543560753 542791862 541780586 541324272 541115112 536915054 535971107 535648422
1583.5 535648422 534063950 530835876 526145439 523729706 520693741 518451805 515629158 512838097
1591.2 512838097 509030457 506618881 504820557 501920509 500883713 496776314 493462753 491437645
1599 491437645 489513817 485476570 480165443 476496811 472800407 470383377 466301804 465863533 464472427
1607.6 464472427 460923157 458544197 453081245 448362465 444069595 443069267 440823479 442145615
1615.4 442145615 444259148 432252159 432174644 430352478 428535576 425293617 423620071 423843498 418152962
1624 418152962 415917473 412654877 411590576 410646400 408805885 407984276 407468033 406035004 402781448
$$ packed form
1566.2E49940643j00288q19588L119011n68313q12378N26886k319069j011811k279434
1574.9E45675659j118965r95941p68891j011276m56314k09160m200058r43947l22685
1583.5E35648422j584472l228074m690437k415733l035965k241936k822647k791061
1591.2E12838097l807640k411576j798324k900048j036796m107399l313561k025108
1599D91437645j923828m037247n311127l668632l696404k417030m081573m38271j391106
1607.6D64472427l549270k378960n462952m718780m292870j000328k245788J322136
1615.4D42145615K113533j2006989p7515j822166j816902l241959j673546K23427n690536
1624D18152962k235489l262596j064301r44176j840515q21609n16243j433029l253556
$$ plain form
1632.7 402781448 401734047 401810226 399771576 393290176 394065819 395707359 398462181 400272827 396637344
1641.4 396637344 396376801 395735970 396966362 398296585 397812080 399272079 394623299 393894501 393823929
1650.1 393823929 397706375 401014595 406046715 406625175 401635246 404954491 406102600 408920631
1657.8 408920631 410629272 412573776 413911705 414895630 419413185 420860901 424408493 425302811 427416382
1666.5 427416382 431206169 433989868 439385567 442166939 446566811 446836090 449173050 452711220
1674.2 452711220 455414505 459411125 462305908 465979767 467881622 470919724 472328720 474984398
1681.9 474984398 479310036 479679985 478108864 484115524 492195930 495677147 498871231 503154373
1689.6 503154373 505966415 511269798 516703835 522645149 528267059 534751472 534615707 537839432
$$ packed form
1632.7D02781448j047401P6179k038650o481400P75643J641540K754822J810646l635483
1641.4C96637344k60543o40831J230392J330223m84505J459999m648780p28798p0572
1650.1C93823929L882446L308220N032120N78460m989929L319245J148109K818031
1657.8D08920631J708641J944504J337929R83925M517555J447716L547592Q94318K113571
1666.5D27416382L789787K783699N395699K781372M399872K69279K336960L538170
1674.2D52711220K703285L996620K894783L673859J901855L038102J408996K655678
1681.9D74984398M325638L69949j571121O006660Q080406L481217L194084M283142
1689.6E03154373K812042N303383N434037N941314N621910O484413j35765L223725
$$ plain form
1697.3 537839432 543319473 547684288 553433189 552366104 559190941 564271393 569516640 575721970
1705 575721970 579993629 585155258 586876602 591042175 596569672 596733856 596132507 598795319 604029884
1713.7 604029884 605748978 606459770 611478958 618961182 622134514 619521484 621604309 623722687
1721.4 623722687 624408150 625363884 624431229 626867905 630800934 632023582 633226738 634279747 634063377
1730.1 634063377 634485893 639549980 647001648 645589752 635643158 638574791 643058777 646239700
1737.8 646239700 650085068 649312210 644465332 647605362 650726013 652264328 654478989 659085999
1745.5 659085999 662715759 663918686 666025772 667848740 674099960 676807632 672835312 674586029
1753.3 674586029 676002579 678398895 682316055 684715424 686529160 687636185 687923431 689543076
$$ packed form
1697.3E37839432N480041M364815N748901j067085O824837N080452N245247O205330
1705E75721970M271659N161629J721344M165573N527497J64184o01349K662812N234565
1713.7F04029884J719094P10792N019188P482224L173332k613030K082825K118378
1721.4F23722687O85463R55734r32655K436676L933029J222648J203156J053009k16370
1730.1F34063377M22516N064087P451668j411896r946594K931633M483986L180923
1737.8F46239700L845368p72858m846878L140030L120651J538315K214661M607010
1745.5F59085999L629760J202927K107086J822968O251220K707672l972320J750717
1753.3F74586029J416550K396316L917160K399369J813736J107025K87246J619645
$$ plain form
1761 689543076 689019241 688360062 690917587 693174438 694113312 694960709 697174683 697330627 698969650
1769.7 698969650 701892471 703899918 706904755 701874695 701219330 702321243 702989731 705562210 705837173
1778.3 705837173 707484283 709998474 709453812 709179459 709260178 709081039 708672485 708484650 709715118
1787 709715118 712182236 713160858 713889465 714625549 714920731 712523575 712039490 715806656 717388000
1795.7 717388000 717894211 718242187 719093552 719222107 717723846 719354858 717984314 717401810 719110489
1804.4 719110489 720682678 721783676 720710297 721309738 722944641 724171906 722555771 721161118
1812.1 721161118 721903915 723167953 724957733 724138107 724467926 724600525 723454437 723707657 723579865
1820.8 723579865 724119110 724391479 727399216 731291962 729365234 728275146 729402924 730628891 732323990
$$ packed form
1761F89543076n23835o59179K557525K256851R38874Q47397K213974J55944J639023
1769.7F98969650K922821K007447L004837n030060o55365J101913O68488K572479K74963
1778.3G05837173J647110K514191n44662k74353Q0719j79139m08554j87835J230468
1787G09715118K467118R78622P28607P36084K95182k397156m84085L767166J581344
1795.7G17388000N06211L47976Q51365J28555j498261J631012j370544n82504J708679
1804.4G19110489J572189J100998j073379N99441J634903J227265j616135j394653
1812.1G21161118P42797J264038J789780q19626L29819J32599j146088K53220j27792
1820.8G23579865N39245K72369L007737L892746j926728j090088J127778J225967J695099
$$ plain form
1829.4 732323990 730058365 729169693 730055771 728610306 729301758 731035919 731307983 731628036 731445465
1838.1 731445465 731869965 731564331 731451950 731380539 732602081 732208023 727963791 731307831 733646164
1846.8 733646164 734219589 734432602 734613495 733947754 732387314 733705215 735259705 736307831 735176392
1855.5 735176392 734407654 735224991 734922867 735319672 734363174 734381561 733740692 732706070 734240265
1864.2 734240265 736818771 738985062 737764206 738115845 738078461 735596848 735979233 737399521 738005600
1872.8 738005600 737460785 738547134 738368530 738284378 738877258 739806976 741542435 739852676 738274841
1881.5 738274841 737758179 738683243 739338531 739151306 740425797 739729767 739985886 741138458 740319214
1890.2 740319214 739222946 738758316 738037262 737111206 738244247 738691330 739627380 740276184 738920898
$$ packed form
1829.4G32323990k265625q88672Q86078j445465O91452J734161K72064L20053j82571
1838.1G31445465M24500l05634j12381p1411J221542l94058m244232L344040K338333
1846.8G33646164N73425K13013J80893o65741j560440J317901J554490J048126j131439
1855.5G35176392p68738Q17337l02124L96805r56498J8387o40869j034622J534195
1864.2G34240265K578506K166291j220856L51639l7384k481613L82385J420288O06079
1872.8G38005600n44815J086349j78604q4152N92880R29718J735459j689759j577835
1881.5G38274841n16662R25064O55288j87225J274491o96030K56119J152572q19244
1890.2G40319214j096268m64630p21054r26056J133041M47083R36050O48804j355286
$$ plain form
1898.9 738920898 739088135 739636002 740190887 741269760 740636139 739138641 739169998 739322052 739966660
1907.6 739966660 740597839 741124573 741519012 740208588 740008469 738997269 738901978 739620819 740297089
1916.2 740297089 743136826 741516876 739671555 740466309 740973892 742094955 741624146 739865417 738282471
1924.9 738282471 739322281 740290070 739879303 739886093 739743652 740087204 739939117 740062943 739072495 738966751
1934.6 738966751 740455780 740095062 739217072 739073792 740420990 740655670 740028915 740208588 739418488
1943.2 739418488 738411636 737903671 737594528 737403488 739220123 739926224 739258041 740095520 740246124
1951.9 740246124 739657364 739002838 739251480 740114746 740038452 738833771 738928375 739593964 738217316 737914047
1961.6 737914047 737451324 736539230 736757126 737325439 738725815 739794388 740252075 739845963 739656296
$$ packed form
1898.9G38920898J67237N47867N54885J078873o33621j497498L1357J52054O44608
1907.6G39966660O31179N26734L94439j310424k00119j011200r5291P18841O76270
1916.2G40297089K839737j619950j845321P94754N07583J121063m70809j758729j582946
1924.9G38282471J039810R67789m10767O790j42441L43552j48087J23826r90448j05744
1934.6G38966751J489029l60718q77990j43280J347198K34680o26755J79673p90100
1943.2G39418488j006852n07965l09143j91040J816635P06101o68183Q37479J50604
1951.9G40246124n88760o54526K48642Q63266p6294j204681R4604O65589j376648l03269
1961.6G37914047m62723r12094K17896N68313J400376J068573M57687m06112j89667
$$ plain form
1970.2 739656296 739227142 737659912 737097626 737396927 736741180 735763168 737280121 738841095 738227158
1978.9 738227158 737304306 737727737 738328552 737981796 738559952 737102585 734824753 733849411 733130798
1987.6 733130798 733969345 734657516 736095886 736147995 735345001 736157227 734955673 734750290 735135727
1996.3 735135727 735881119 737508469 737153473 737297745 736141205 733530426 733740311 733613358 732508011
2005 732508011 733868256 735056686 734419022 734528503 734541245 733295517 731976166 732243576 733498459
2013.6 733498459 733117142 733182678 734278793 734263000 734497681 734075851 733146744 733190384 732897415 731632233
2023.3 731632233 731061554 731331787 730784073 732028122 733497543 731868591 729837799 729511490 730183411
2032 730183411 728921585 728802795 730283890 730646820 731426086 730214844 728260269 727724991 729580536
$$ packed form
1970.2G39656296m29154j567230n62286K99301o55747r78012J516953J560974o13937
1978.9G38227158r22852M23431O00815l46756N78156j457367k277832r75342p18613
1987.6G33130798Q38547O88171J438370N2109q02994Q12226j201554k05383L85437
1996.3G35135727P45392J627350l54996J44272j156540k610779K09885j26953j105347
2005G32508011J360245J188430o37664J09481J2742j245728j319351K67410J254883
2013.6G33498459l81317O5536J096115j5793K34681m21830r29107M3640k92969j265182
2023.3G31632233n70679K70233n47714J244049J469421j628952k030792l26309O71921
2032G30183411j261826j18790J481095L62930P79266j211242j954575n35278J855545
$$ plain form
2040.6 729580536 731620941 730811081 730921326 730734940 730412979 730227280 729539795 728926926 727904663
2049.3 727904663 728831024 728658142 727730255 727412796 726193848 726271515 726062775 726070557 726483231 725923309
2059 725923309 726758347 727653809 725844574 724234848 724987564 726017380 726067581 724952850 724304504
2067.6 724304504 723916473 723648911 724775238 724735031 723269272 722039719 721355057 721628113 722499619
2076.3 722499619 721655807 720610428 721631470 720400314 718659592 718654633 718411789 718634796 717208099
2085 717208099 716430969 718051300 717723007 717250061 718210144 718840561 719345551 718810654 717293549 715848541
2094.6 715848541 715820770 716760864 716519165 716986618 717970200 718711624 719583893 719680557 720053253 720438614
2104.3 720438614 720606232 720087051 719712143 720031967 720714035 722378540 722682571 722039566 720984497
$$ packed form
2040.6G29580536K040405q09860J10245j86386l21961j85699o87485o12869j022263
2049.3G27904663R26361j72882r27887l17459j218948P7667k08740P782M12674n59922
2059G25923309Q35038Q95462j809235j609726P52716J029816N0201j114731o48346
2067.6G24304504l88031k67562J126327m0207j465759j229553o84662K73056Q71506
2076.3G22499619q43812j045379J021042j231156j740722m959k42844K23007j426697
2085G17208099p77130J620331l28293m72946R60083O30417N04990n34897j517105j445008
2094.6G15848541k7771R40094k41699M67453R83582P41424Q72269R6664L72696L85361
2104.3G20438614J67618n19181l74908L19824O82068J664505L04031o43005j055069
$$ plain form
2113 720984497 720550308 721452637 722039948 722845001 722924194 722703171 721519623 721134796 723217926 723891068
2122.6 723891068 722801590 721044235 719834900 719390411 720348434 720836487 719765854 719779053 719683914
2131.3 719683914 719858475 719044342 718649063 720535431 721062164 720716934 720648880 721584702 722765350
2140 722765350 723097076 721918335 720272217 721224976 722893753 722851028 721965103 722259521 722405396 722476501
2149.6 722476501 723827209 724503784 723069687 721649933 724168243 724990005 723358307 723768082 723667679
2158.3 723667679 724214172 723884430 723259201 724757690 725059280 723507309 722658234 724169388 725734634
2167 725734634 725522308 724049454 723605499 724556046 724734802 723448792 722721710 724192734 723876801
2175.6 723876801 722612686 722463531 722237701 722477417 722055283 722018967 722723999 723416672 723517227 723487320
$$ packed form
2113G20984497m34189R02329N87311Q05053P9193k21023j183548l84827K083130O73142
2122.6G23891068j089478j757355j209335m44489R58023M88053j070633J3199r5139
2131.3G19683914J74561q14133l95279J886368N26733l45230o8054R35822J180648
2140G22765350L31726j178741j646118R52759J668777m2725q85925K94418J45875P1105
2149.6G22476501J350708O76575j434097j419754K518310Q21762j631698M09775j00403
2158.3G23667679N46493l29742o25229J498489L01590j551971q49075J511154J565246
2167G25734634k12326j472854m43955R50547J78756j286010p27082J471024l15933
2175.6G23876801j264115j49155k25830K39716m22134l6316P05032O92673J00555k9907
$$ plain form
2185.3 723487320 724344025 725313492 726537247 726033325 724096603 722840347 723113403 724406357 725614395
2194 725614395 727315292 727504730 727298050 727668304 726364365 725362396 726058121 727237091 728223801
2202.6 728223801 728860245 729259796 729398956 728617630 728670120 729840317 729332275 727679138 727530594
2211.3 727530594 728788223 728585892 729211121 731366272 731314774 729959030 729293594 730316315 730963745
2220 730963745 730572205 730279694 730262222 730978546 731153946 731486588 731215210 730716782 731197205 730816040
2229.7 730816040 730402908 729407654 727949371 727691727 728120117 729715576 731162872 730834351 731302261
2238.3 731302261 731956863 730334015 728930511 729258957 730079117 729834442 729942856 731403809 731529846
2247 731529846 730098572 729013596 729387894 729751892 730236282 730830231 729952621 729650726 730473251 730889969
$$ packed form
2185.3G23487320Q56705R69467J223755n03922j936722j256256K73056J292954J208038
2194G25614395J700897J89438k06680L70254j303939j001969O95725J178970R86710
2202.6G28223801O36444L99551J39160p81326N2490J170197n08042j653137j48544
2211.3G27530594J257629k02331O25229K155151n1498j355744o65436J022721O47430
2220G30963745l91540k92511j7472P16324J75400L32642k71378m98428M80423l81165
2229.7G30816040m13132r95254j458283k57644M28390J595459J447296l28521M67910
2238.3G31302261O54602j622848j403504L28446Q20160k44675J08414J460953J26037
2247G31529846j431274j084976L74298L63998M84390N93949q77610l01895Q22525M16718
$$ plain form
2256.7 730889969 729899368 729862747 731344528 731063995 730595169 730988541 730078430 728802032 730332870
2265.3 730332870 732129822 731412735 730596848 729748993 728560257 728750000 730363083 730479736 729573822
2274 729573822 729131775 729175339 729751358 729866562 731197357 731394577 730150757 729940872 729926758 730979919
2283.7 730979919 731652374 731852341 730819473 730122452 731899948 732227173 731136627 729698715 729589996
2292.3 729589996 729696808 728725204 729057236 730175629 731908951 731473770 729501190 730550842 731836014
2301 731836014 729720688 728650208 730971298 731955795 732404404 732295761 730910339 731255646 730962143
2309.7 730962143 729401169 729027252 729793701 729564285 728365936 728416672 729084625 729610596 729340591
2318.4 729340591 728716049 730200729 729984055 728567963 733156128 735102539 730191956 727050629 725883484
$$ packed form
2256.7G30889969r90601l6621J481781k80533m68826L93372r10111j276398J530838
2265.3G30332870J796952p17087q15887q47855j188736J89743J613083J16653r05914
2274G29573822m42047M3564N76019J15204J330795J97220j243820k09885j4114J053161
2283.7G30979919O72455J99967j032868o97021J777496L27225j090546j437912j08719
2292.3G29589996J06812r71604L32032J118393J733322m35181j972580J049652J285172
2301G31836014k115326j070480K321090R84497M48609j08643j385422L45307k93503
2309.7G30962143j560974l73917P66449k29416j198349N0736O67953N25971k70005
2318.4G29340591o24542J484680k16674j416092M588165J946411m910583l141327j167145
$$ plain form
2327.1 725883484 726035080 727601700 729209747 730617828 732120667 729855270 726314926 725795898 727068558
2335.7 727068558 731869202 731130676 728909073 729580154 727173233 729183655 728981476 727886429 731418915
2344.4 731418915 731137924 728788147 727384262 729430542 732378082 732648239 732517853 734440918 737231064
2353.1 737231064 737629166 732145691 731201859 738414230 737497787 732933807 732419128 730248795 728676758
2361.8 728676758 731921234 733796310 727558289 726265945 732247314 734083481 732447281 731954651
2369.5 731954651 731885300 733443832 736772690 736893311 736602249 734991074 732913132 734812012 735837173
2378.2 735837173 735780182 735396042 734179001 734593506 736701584 737674942 736397400 736600037 737599945
2386.8 737599945 736931076 736619949 736560745 736509857 737839355 738253250 736676407 736063461 735979004 735689468
$$ packed form
2327.1G25883484J51596J566620J608047J408081J502839k265397l540344n19028J272660
2335.7G27068558M800644p38526k221603O71081k406921K010422k02179j095047L532486
2344.4G31418915k80991k349777j403885K046280K947540K70157j30386J923065K790146
2353.1G37231064L98102n483475r43832P212371r16443m563980n14679k170333j572037
2361.8G28676758L244476J875076o238021j292344N981369J836167j636200m92630
2369.5G31954651o9351J558532L328858J20621k91062j611175k077942J898880J025161
2378.2G35837173n6991l84140j217041M14505K108078R73358j277542K02637R99908
2386.8G37599945o68869l11127n9204n0888J329498M13895j576843o12946q4457k89536
$$ plain form
2396.5 735689468 735533676 735125656 734774170 734857788 736022263 737289734 737615585 736321945 734624329
2405.2 734624329 734402695 735259476 735984802 735366898 735430603 735794907 734313278 733513184 735459366
2413.8 735459366 737045364 736144485 735461502 734801254 735018158 735267105 733113327 733108292 735028000
2422.5 735028000 735124435 734510269 735050735 735580368 735001526 734178772 733583908 733862839 734571915 735461426
2432.2 735461426 735099258 734336395 734100037 732086029 731908722 734146347 735018539 734693375 734117889
2440.8 734117889 733638763 733372269 734038315 734793243 734445648 732853165 731143341 731084595 732409363
2449.5 732409363 732776337 731763077 732260590 732435608 731496887 732020416 732162552 731392288 730787888
2458.2 730787888 731563568 732517242 731253586 730861588 731346054 730664139 730919037 730930786 730312805 730435867
$$ packed form
2396.5G35689468j55792m08020l51486Q3618J164475J267471L25851j293640j697616
2405.2G34624329k21634Q56781P25326o17904O3705L64304j481629q00094J946182
2413.8G35459366J585998r00879o82983o60248K16904K48947k153778n035J919708
2422.5G35028000R6435o14166N40466N29633n78842q22754n94864K78931P09076Q89511
2432.2G35461426l62168p62863k36358k014008j77307K237625Q72192l25164n75486
2440.8G34117889m79126k66494O66046P54928l47595j592483j709824n8746J324768
2449.5G32409363L66974j013260M97513J75018r38721N23529J42136p70264o04400
2458.2G30787888P75680R53674j263656l91998M84466o81915K54898J1749o17981J23062
$$ plain form
2467.8 730435867 729670258 728954239 729207764 730157852 730693970 729710083 728927460 728396683 728418198 727816772
2477.5 727816772 726958618 728784027 729927216 729167938 728425064 728371887 729319534 728884811 728069229
2486.2 728069229 728738480 728966217 727730255 725039291 723754196 725330353 726244736 726539078 727515335
2494.8 727515335 728090897 727246017 725450439 724214401 724326096 726035233 725815735 724954834 725700073
2503.5 725700073 724608383 723923340 723921967 724213943 725021362 724025192 723657379 724364929 725234146 726120834
2513.2 726120834 725873489 724480743 723961792 724467239 722989044 721277390 721217422 722055740 723193665
2521.9 723193665 723234177 722321472 722421036 722915573 721137085 719566269 720304642 721586151 721238785
2530.5 721238785 719942856 720154266 720608521 721336136 721781311 722009277 722755203 722203751 722370911
$$ packed form
2467.8G30435867p65609p16019K53525R50088N36118r83887p82623n30777K1515o01426
2477.5G27816772q58154J825409J143189p59278p42874n3177R47647m34723q15582
2486.2G28069229O69251K27737j235962k690964j285095J576157R14383K94342R76257
2494.8G27515335N75562q44880j795578j236038J11695J709137k19498q60901P45239
2503.5G25700073j091690o85043j373K91976Q07419r96170l67813P07550Q69217Q86688
2513.2G26120834k47345j392746n18951N05447j478195j711654n9968Q38318J137925
2521.9G23193665M0512r12705R9564M94537j778488j570816P38373J281509l47366
2530.5G21238785j295929K11410M54255P27615M45175K27966P45926n51452J67160
$$ plain form
2539.2 722370911 722575073 720673294 719541626 720556030 721832047 721190414 719258881 719235687 719674377
2547.9 719674377 718516235 718050919 717603836 718722992 721428528 721845932 720706635 719266891 719149780
2556.6 719149780 719169083 718252258 717230148 716853867 718021240 718189621 718036957 717786331 716489182
2565.2 716489182 715900574 717056732 718018417 716854172 717431564 718579483 717760620 716723938 715728531
2573.9 715728531 715345230 715197678 715770950 716447067 716497192 714784698 712181015 712921448 714952774
2582.6 714952774 715032043 713849411 713517227 713588943 713898849 715283432 715284424 715116196 715181351 713540497
2592.2 713540497 712814713 713548279 712698364 711524048 712235031 713349457 713634109 713229141 712802963
2600.9 712802963 711532898 710211563 709771957 709865952 710423813 710362091 710706406 709786911 709076309 710722504
$$ packed form
2539.2G22370911K04162j901779j131668J014404J276017o41633j931533k3194M38690
2547.9G19674377j158142m65316m47083J119156K705536M17404j139297j439744j17111
2556.6G19149780J9303r16825j022110l76281J167373J68381j52664k50626j297149
2565.2G16489182n88608J156158R61685j164245N77392J147919q18863j036682r95407
2573.9G15728531l83301j47552N73272O76117N0125j712494k603683P40433K031326
2582.6G14952774P9269j182632l32184P1716L09906J384583R92j68228O5155j640854
2592.2G13540497p25784P33566q49915j174316P10983J114426K84652m04968m26178
2600.9G12802963j270065j321335m39606R3995N57861o1722L44315r19495p10602J646195
$$ plain form
2610.6 710722504 710350494 709262543 709676437 709542389 707568665 706008377 706410675 707969055 708809052
2619.3 708809052 707929687 708302689 708064575 707015076 706744690 706883774 707387085 705719604 705058823
2627.9 705058823 705154266 704167328 703362274 703007278 704335175 704001541 702725525 701926270 701665497
2636.6 701665497 702576828 703277283 704371414 703221207 701536560 701011429 699694748 699521332 700184708
2645.3 700184708 700679016 699801941 698710785 698968811 698294907 696756363 696302261 697461090 698763428
2654 698763428 698622894 697284851 696323013 696277390 696445618 696364212 696090393 695888290 695653687 695508957
2663.6 695508957 695682220 696996994 697972641 696568527 695316162 695705490 695275497 693303070 692492065
2672.3 692492065 692809525 691884613 691632843 693435287 693686600 692456512 691884079 691412430 691231995
$$ packed form
2610.6G10722504l72010j087951M13894j34048j973724j560288M02298J558380Q39997
2619.3G08809052q79365L73002k38114j049499k70386J39084N03311j667481o60781
2627.9G05058823R5443r86938q05054l54996J327897l33634j276016p99255k60773
2636.6G01665497R11331P00455J094131j150207j684647n25131j316681j73416O63376
2645.3G00184708M94308q77075j091156K58026o73904j538544m54102J158829J302338
2654F98763428j40534j338043r61838m5623J68228q1406k73819k02103k34603j44730
2663.6F95508957J73263J314774R75647j404114j252365L89328m29993j972427q11005
2672.3F92492065L17460r24912k51770J802444K51313j230088n72433m71649j80435
$$ plain form
2681 691231995 690106583 689651718 690392532 690018539 690242081 690212250 689455185 689220276 689604568 689709320
2690.6 689709320 688909760 688432999 687469254 686860809 686794281 687076721 687333832 686288757 686810532 687249680
2700.3 687249680 685893707 685539017 685668945 684809418 683797226 683751297 683436584 683220901 683690186
2708.9 683690186 683167191 682770767 684071274 684628525 683539124 682663040 681897583 681669617 682178268
2717.6 682178268 682232742 680924683 679435196 679369583 680308838 681337814 680286407 678100433 676864014
2726.3 676864014 676919785 677806549 678255997 678314285 676924210 676100082 676860809 677126694 676472321 674789886
2735.9 674789886 674027557 673988953 674685593 675407715 674404984 673607864 673654709 674728241 675635300 674685898
2745.6 674685898 673257828 673057861 672787476 671671371 670703659 669950790 670544128 671015015 671018295 671821899
$$ packed form
2681F91231995j125412m54865P40814l73993K23542k9831p57065k34909L84292J04752
2690.6F89709320p99560m76761r63745o08445o6528K82440K57111j045075N21775M39148
2700.3F87249680j355973l54690J29928q59527j012192m5929l14713k15683M69285
2708.9F83690186n22995l96424J300507N57251j089401q76084p65457k27966N08651
2717.6F82178268N4474j308059j489487o5613R39255J028976j051407k185974j236419
2726.3F76864014N5771Q86764M49448N8288j390075q24128P60727K65885o54373j682435
2735.9F74789886p62329l8604O96640P22122j002731p97120M6845J073532R07059r49402
2745.6F74685898j428070j99967k70385j116105r67712p52869N93338M70887L280Q03604
$$ plain form
2755.2 671821899 672148590 671260910 670035553 669615479 668588943 668872528 669560547 668349075 668453674
2763.9 668453674 668143997 666891708 666210937 665719528 665179749 664914322 665433121 664809952 663617325
2772.6 663617325 663422241 664446411 665085220 663895798 661852646 660629349 660739212 659804687 659795380
2781.3 659795380 660577621 659381714 658531570 658811417 659705582 659220810 657888336 657791672 657161865
2789.9 657161865 656059952 655941162 655750427 654760132 654903641 655013504 653723907 653101120 652967911
2798.6 652967911 651780396 650699387 651522827 651242523 648384323 646373749 646128235 646595688 647697906
2807.3 647697906 648262253 647047424 645191803 643626328 642875671 642628708 643077774 643170395 641456070
2816 641456070 640763702 639935760 637977448 637332077 637569656 637927856 637840195 637786942 637578087 636433868
$$ packed form
2755.2F71821899L26691q87680j225357m20074j026536K83585O88019j211472J04599
2763.9F68453674l09677j252289o80771m91409n39779k65427N18799o23169j192627
2772.6F63617325j95084J024170O38809j189422k043152j223297J09863r34525r307
2781.3F59795380P82241j195907q50144K79847Q94165m84772j332474r6664o29807
2789.9F57161865j101913j18790j90735r90295J43509J09863j289597o22787j33209
2798.6F52967911j187515j081009Q23440k80304k858200k010574k45514M67453J102218
2807.3F47697906N64347j214829j855621j565475p50657k46963M49066R2621j714325
2816F41456070o92368q27942j958312o45371K37579L58200q7661n3253k08855j144219
$$ plain form
2825.6 636433868 634538345 632931404 632240486 631971588 631726761 630828362 630503769 629547768 627382469
2834.3 627382469 626387215 625647888 624611206 624094009 624634209 623592987 620512733 618569260 617143059
2843 617143059 615417747 613335953 611442375 609358063 606582069 603534508 600589409 599122162 598015137
2851.7 598015137 597686081 598467522 597837906 595585594 594214401 594878006 594855156 593939362 593691368
2860.3 593691368 594590149 594382133 592084007 592121086 592403641 590582123 589412766 588751335 587852898
2869 587852898 585569649 583344383 582021217 580907440 582112961 582677231 580817528 580468750 581135674
2877.7 581135674 580035591 577503281 576692772 577619743 577419930 576778793 576290131 575278931 573834915
2886.4 573834915 572841873 572721176 572135201 570858612 569133797 567626343 567280693 566959572 565534630
$$ packed form
2825.6F36433868j895523j606941o90918k68898k44827q98399l24593r56001k165299
2834.3F27382469r95254p39327j036682n17197N40200j041222l080254j943473j426201
2843F17143059j725312k081794j893578k084312k775994l047561k945099j467247j107025
2851.7E98015137l29056P81441o29616k252312j371193O63605k2850r15794k47994
2860.3E93691368Q98781k08016k298126L7079K82555j821518j169357o61431q98437
2869E87852898k283249k225266j323166j113777J205521N64270j859703l48778O66924
2877.7E81135674j100083k532310q10509R26971j99813o41137m88662j011200j444016
2886.4E73834915r93042j20697n85975j276589j724815j507454l45650l21121j424942
$$ plain form
2895.1 565534630 563818474 563269844 562992172 561531372 560625076 560660057 560085068 559519196 558177643
2903.7 558177643 556410370 556582069 557333717 557314453 557116432 555894814 553051910 552434235 553422318
2912.4 553422318 552210884 550933762 548919640 547357903 547188187 546042595 544938698 543245163
2920.1 543245163 541607742 539837799 538580627 538282356 538628311 540157852 538915901 538600998 540776711
2928.8 540776711 540618629 539510727 539126701 539425583 539935265 541306915 541035347 539239769 538683815
2937.5 538683815 538931084 540773964 542071877 542870560 543269157 543187447 544007683 543532333 544223518
2946.2 544223518 545647087 544622726 543661156 543455963 543284111 543554230 543025208 541477356 541661987
2954.8 541661987 542233124 540903168 539296227 539037247 539280281 538574333 539463310 541968994 542834740
$$ packed form
2895.1E65534630j716156n48630k77672j460800r06296L4981n74989n65872j341553
2903.7E58177643j767273J71699P51648j9264j98021j221618k842904o17675R88083
2912.4E53422318j211434j277122k014122j561737j69716j145592j103897j693535
2920.1E43245163j637421j769943j257172k98271L45955J529541j241951l14903K175713
2928.8E40776711j58082j107902l84026K98882N09682J371650k71568j795578n55954
2937.5E38683815K47269J842880J297913P98683L98597q1710Q20236m75350O91185
2946.2E44223518J423569j024361r61570k05193j71852K70119n29022j547852J84631
2954.8E41661987N71137j329956j606941k58980K43034p05948Q88977K505684Q65746
$$ plain form
2963.5 542834740 542207870 541702614 541805534 542773590 544990807 546589165 546921234 547488136 548884888
2972.2 548884888 550643044 551561661 551742401 551755791 552401695 554209061 555481606 555161476 555086441
2980.9 555086441 556181068 557650261 558308792 558336792 559889526 561259232 562069016 564304619 565286598
2989.6 565286598 564358978 564058723 564805412 565469208 565184708 563792572 564039497 566382027 567366791
2998.2 567366791 567917595 569093971 570029869 569590416 568520126 568662262 568244934 568282051 568903351
3006.9 568903351 568479691 568820267 569109001 568317719 568321457 568282318 566624870 565946846 566468544 565980682
3016.6 565980682 565218620 565262260 565293465 564196701 563690681 563875771 562782555 561226425 560128708
3025.2 560128708 559700203 560085716 559781265 558433495 558539810 559751740 559359818 556513519 554094086
$$ packed form
2963.5E42834740o26870n05256J02920R68056K217217J598358L32069N66902J396752
2972.2E48884888J758156R18617J80740J3390O45904J807366J272545l20130p5035
2980.9E55086441J094627J469193O58531K8000J552734J369706Q09784K235603R81979
2989.6E65286598r27620l00255P46689O63796k84500j392136K46925K342530R84764
2998.2E67366791N50804J176376R35898m39453j070290J42136m17328L7117O21300
3006.9E68903351m23660L40576K88734p91282L738l9139j657448o78024N21698m87862
3016.6E65980682p62062M3640L1205j096764n06020J85090j093216j556130j097717
3025.2E60128708m28505L85513l04451j347770J06315J211930l91922k846299k419433
$$ plain form
3033.9 554094086 554323883 554807205 555353737 555496407 554951363 554593201 553268127 552471008 551752014
3042.6 551752014 550158043 548438759 546975555 546565094 546565323 547085686 547500267 547091866 545564423
3051.3 545564423 543888474 543466148 542087822 540816689 541007538 540988197 540695190 540167694 540059929
3060 540059929 539294014 537321663 537198524 537915840 536252747 534145660 534188499 535057983 534186821 531954918
3069.6 531954918 530702057 531076012 531520081 530904961 530440788 530579796 530160599 528792992 527351189
3078.3 527351189 527355042 528066483 527348137 526077003 525736694 524995537 524866562 525267677 522748566 520490723
3087.9 520490723 521095619 521961708 522268333 520881844 518716850 518615189 518992424 517462845 516025085
3096.6 516025085 516728859 517809143 517224579 515790596 514181480 512513161 511861725 511331558 510186996
$$ packed form
3033.9E54094086K29797M83322N46532J42670n45044l58162j325074p97119p18994
3042.6E51752014j593971j719284j463204m10461K29N20363M14581m08401j527443
3051.3E45564423j675949m22326j378326j271133J90849j9341k93007n27496j07765
3060E40059929p65915j972351j23139P17316j663093k107087M2839Q69484q71162k231903
3069.6E31954918j252861L73955M44069o15120m64173J39008m19197j367607j441803
3078.3E27351189L853P11441p18346j271134l40309p41157j28975M01115k519111k257843
3087.9E20490723O04896Q66089L06625j386489k164994j01661L77235j529579j437760
3096.6E16025085P03774J080284n84564j433983j609116j668319o51436n30167j144562
$$ plain form
3105.3 510186996 508978539 508436127 508527412 508399200 507929344 506339989 505000916 504725227 504005699
3114 504005699 503235283 503017082 502869072 501948547 500283852 498480606 498975601 499696045 497202110
3122.6 497202110 496413879 497006226 495683060 494314880 493462105 493174782 493215561 492435532 490643997
3131.3 490643997 489080734 487783089 487013359 486518860 485296173 484629250 483857117 481543694 479583626
3140 479583626 479855652 479473190 477680740 476780891 476390457 476312675 475272789 474935417 474900932 472691841
3149.6 472691841 471307564 470954781 469848518 467628860 466422119 465557632 464282265 465013809 465248184
3158.3 465248184 464369812 461773911 458729897 458006935 457381859 457109528 456853256 455467453 453522949
3167 453522949 452760391 453160553 453292122 452703209 450268288 448822670 447823601 445967026 446020355 446084824
$$ packed form
3105.3E10186996j208457n42412R1285j28212m69856j589355j339073k75689p19528
3114E04005699p70416k18201j48010r20525j664695j803246M94995P20444k493935
3122.6D97202110p88231N92347j323166j368180q52775k87323M0779p80029j791535
3131.3D90643997j563263j297645p69730m94499j222687o66923p72133k313423j960068
3140D79583626K72026l82462j792450q99849l90434p7782j039886l37372l4485k209091
3149.6D72691841j384277l52783j106263k219658j206741q64487j275367P31544K34375
3158.3D65248184q78372k595901l044014p22962o25076k72331k56272j385803j944504
3167D53522949p62558M00162J31569n88913k434921j445618r99069j856575N3329O4469
$$ plain form
3176.6 446084824 444947548 443296013 440898781 439456291 439977226 439257240 438208771 439123421 438694382
3185.3 438694382 436324272 432765388 431658974 433361130 433164215 432361107 431002274 429366379 428404503
3194 428404503 427033882 425200958 423313217 421955147 420672264 421166115 421602287 420659027 420618324
3202.7 420618324 419272537 417764854 417010040 416348343 415820885 413831482 412951660 412777405 411517181
3211.4 411517181 410479393 409524574 409079552 408554039 408066177 407079277 405215340 404202728 403364105
3220 403364105 403072891 402799988 401428795 400098495 398745003 398365211 398429985 397829056 397864227 397063942
3229.7 397063942 395031319 394106140 393177071 391304016 390039177 389823494 390713921 391293449 389788055
3238.4 389788055 388068008 388109283 387267723 384526138 383757172 384347572 383684082 382802505 382481041
$$ packed form
3176.6D46084824j137276j651535k397232j442490N20935p19986j048469R14650m29039
3185.3D38694382k370110l558884j106414J702156j96915q03108j358833j635895r61876
3194D28404503j370621j832924j887741j358070j282883M93851M36172r43260m0703
3202.7D20618324j345787j507683p54814o61697n27458j989403q79822j74255j260224
3211.4D11517181j037788r54819m45022n25513m87862r86900j863937j012612q38623
3220D03364105k91214k72903j371193j330300j353492l79792O4774o00929L5171q00285
3229.7C97063942k032623r25179r29069j873055j264839k15683Q90427N79528j505394
3238.4C89788055j720047M1275q41560k741585p68966N90400o63490q81577l21464
$$ plain form
3247 382481041 381997337 380962791 380418243 379858246 378630486 377677383 378291817 378761406 376826553
3255.7 376826553 375896988 376187019 376036568 375760117 374810219 373751945 373187141 372819557 370641022
3264.4 370641022 369707146 369942169 367661095 367296562 368377876 368473663 367395935 365858459 365433044
3273.1 365433044 364318466 363724442 362451859 360877914 361534538 361341591 360118408 359898376 361279716
3281.8 361279716 361810226 360072937 358386002 358029823 357568855 355597763 354912720 355614853 355083580
3290.4 355083580 354245338 354282265 354944801 354940910 353748970 353204880 353684769 352597351 350538521 350025330
3300.1 350025330 351158371 351575470 349981537 348855972 348861732 349253883 348569717 347159729 347279778
3308.8 347279778 346938591 345179024 343282967 342859383 343132935 342565346 342951546 343060455 341528931
$$ packed form
3247C82481041m83704j034546n44548n59997j227760r53103O14434M69589j934853
3255.7C76826553r29565K90031j50451k76451r49898j058274n64804l67584k178535
3264.4C70641022r33876K35023k281074l64533J081314R5787j077728j537476m25415
3273.1C65433044j114578n94024j272583j573945O56624j92947j223183k20032J381340
3281.8C61279716N30510j737289j686935l56179m60968j971092o85043P02133n31273
3290.4C55083580q38242L6927O62536l891j191940n44090M79889j087418k058830n13191
3300.1C50025330J133041M17099j593933j125565N760L92151o84166j409988J20049
3308.8C47279778l41187j759567j896057m23584K73552n67589L86200J08909j531524
$$ plain form
3317.4 341528931 339804420 339418526 339367218 337977295 337241631 336730194 335751801 335682793 335758972 334871635
3327.1 334871635 332733841 330715408 329182129 329541016 332481537 332549057 329920692 328387222 327366524
3335.8 327366524 327286339 326665306 325132828 324110565 323798218 323980904 322579117 321306572 320444641
3344.4 320444641 319033985 318709431 318201923 318070030 317528019 316452484 316125698 314560204 313776817
3353.1 313776817 314095001 313918324 313577232 312058086 311260700 311477051 310148697 309381180 309778595
3361.8 309778595 307773170 305377312 305826721 306036091 303766136 302416630 302478294 301171894 300503273
3370.5 300503273 301722603 302367229 300772057 298846607 297887535 296364174 296231918 296200752 295220070
3379.2 295220070 295471973 295069447 294963055 295017796 293733673 292442093 292053223 292551270 292224865
$$ packed form
3317.4C41528931j724511l85894n1308j389923p35664n11437r78393o9008P6179q87337
3327.1C34871635k137794k018433j533279L58887K940521O7520k628365j533470j020698
3335.8C27366524q0185o21033j532478j022263l12347J82686j401787j272545q61931
3344.4C20444641j410656l24554n07508j31893n42011j075535l26786j565494p83387
3353.1C13776817L18184j76677l41092j519146p97386K16351j328354p67517L97415
3361.8C09778595k005425k395858M49409K09370k269955j349506O1664j306400o68621
3370.5C00503273J219330O44626j595172j925450r59072j523361j32256l1166r80682
3379.2B95220070K51903m02526j06392N4741j284123j291580l88870M98047l26405
$$ plain form
3387.8 292224865 291537552 291217728 291298141 290988865 290109425 290385723 289399033 288046017 288787918 289574986
3397.5 289574986 289935684 289603577 287839470 285349064 284157906 284612007 284658566 284628353 284752579
3406.2 284752579 284174500 284241562 284052315 281886978 281637020 284575729 286142979 284631138 282733192
3414.8 282733192 282921009 283587513 283472900 284040375 284660492 283980484 283048573 283260803 283710403 283350067
3424.5 283350067 283222256 283602448 283087730 282530975 282060051 280235386 280662975 283850708 283913746
3433.2 283913746 281896172 283040791 285444717 285336113 284723606 284568806 284196644 284215393 283530083
3441.8 283530083 283539658 285760880 287261887 286600494 285377560 285674953 287225800 287484341 286510830
3450.5 286510830 287734318 289955101 289921589 290079498 290398121 289444580 290545254 293674488 294794102
$$ packed form
3387.8B92224865o87313l19824Q0413l09276q79440K76298r86690j353016P41901P87068
3397.5B89574986L60698l32107j764107k490406j191158M54101M6559l0213J24226
3406.2B84752579n78079O7062j89247k165337k49958K938709J567250j511841j897946
3414.8B82733192J87817O66504j14613N67475O20117o80008r31911K12230M49600l60336
3424.5B83350067j27811L80192n14718n56755m70924j824665M27589L187733O3038
3433.2B83913746k017574J144619K403926j08604o12507j54800l72162J8749o85310
3441.8B83530083R575K221222J501007o61393j222934K97393J550847K58541r73511
3450.5B86510830J223488K220783l3512J57909L18623r53541J100674L129234J119614
$$ plain form
3459.2 294794102 293978081 292715302 291664276 293218212 295450497 295750370 295889606 296824150 298671894
3467.9 298671894 299401398 299093819 300025921 300428677 301394405 302994671 301905003 301842651 303977203
3476.6 303977203 304735470 306048851 308182507 308862858 308607788 308591080 309096680 309480305 310130730
3485.2 310130730 311194000 311937542 311850243 311519547 312969341 314904785 315290928 315607376 317183228
3493.9 317183228 317754421 316388435 316771297 318780613 320401955 321820717 322878838 323716049 324265976
3502.6 324265976 325128670 324525833 323643074 325788918 327892570 328735962 330040054 331744347 332851410
3511.3 332851410 332740364 333454857 335419579 337093811 337727928 337438774 338143578 339470253 340119820
3520 340119820 341099892 342099609 342909622 342921333 342442665 344897995 347931786 348682671 348985596 348402100
$$ packed form
3459.2B94794102q16021j262779j051026J553936K232285K99873J39236R34544J847744
3467.9B98671894P29504l07579R32102M02756R65728J600266j089668o2352K134552
3476.6C03977203P58267J313381K133656O80351k55070j6708N05600L83625O50425
3485.2C10130730J063270P43542q7299l30696J449794J935444L86143L16448J575852
3493.9C17183228N71193j365986L82862K009316J621342J418762J058121Q37211N49927
3502.6C24265976Q62694o02837q82759K145844K103652Q43392J304092J704293J107063
3511.3C32851410j11046P14493J964722J674232O34117k89154P04804J326675O49567
3520C40119820R80072R99717Q10013J1711m78668K455330L033791P50885L02925n83496
$$ plain form
3529.6 348402100 349191856 350700150 351352539 353362541 354965935 356841316 359397812 358899155 358024139
3538.3 358024139 359850311 362541275 364600143 366399193 366869087 368303452 371577530 371888809 370977554
3547 370977554 370819321 371287880 373636169 376987114 378302231 378331299 379620132 379656754 380815239
3555.6 380815239 382940369 383540421 384956703 386487808 388361664 389818726 391859856 394493408
3563.4 394493408 395114975 398080482 400708656 400586052 401765823 401974373 403891258 405843391 407383804
3572 407383804 408038406 407146797 408493614 412158508 415149803 417189255 419343414 419817200 419936447
3580.7 419936447 422042389 424299507 425868111 427572136 432158279 435683899 434696159 435089188 435462952
3589.4 435462952 439224892 443476906 445455856 446131363 447943726 452021828 452379341 453669128 456331635
$$ packed form
3529.6C48402100P89756J508294O52389K010002J603394J875381K556496m98657q75016
3538.3C58024139J826172K690964K058868J799050M69894J434365L274078L11279r11255
3547C70977554j58233M68559K348289L350945J315117K9068J288833L6622J158485
3555.6C80815239K125130O00052J416282J531105J873856J457062K041130K633552
3563.4C94493408O21567K965507K628174j22604J179771K08550J916885J952133J540413
3572D07383804O54602q91609J346817L664894K991295K039452K154159M73786J19247
3580.7D19936447K105942K257118J568604J704025M586143L525620r87740L93029L73764
3589.4D35462952L761940M252014J978950O75507J812363M078102L57513J289787K662507
$$ plain form
3598.1 456331635 457423592 460379601 461572266 463501129 466285286 468084984 471620979 474650230
3605.8 474650230 475361290 475164223 479825935 480835953 480618248 487990952 490743523 490803337 494465790
3614.5 494465790 493641891 497818069 503268929 504987373 506099892 504855804 507397003 511325035
3622.2 511325035 513074570 514133339 516997375 520672607 523466377 528603172 529015160 523876038
3629.9 523876038 529449196 535228004 540152435 543037605 543951950 545693092 549121323 552739067
3637.6 552739067 553418961 555522194 559132462 562078781 563652039 564590721 567728004 572438126 578874664
3646.3 578874664 579400749 577213478 582752075 586860695 587220421 581816216 584065247 588345718 591817360
3655 591817360 599173355 597343826 598046684 602585411 603677139 606092987 607213135 608363495 608837814
$$ packed form
3598.1D56331635J091957K956009J192665J928863K784157J799698L535995L029251
3605.8D74650230P11060j97067M661712J010018k17705P372704K752571N9814L662453
3614.5D94465790q23899M176178N450860J718444J112519j244088K541199L928032
3622.2E11325035J749535J058769K864036L675232K793770N136795M11988n139122
3629.9E23876038N573158N778808M924431K885170R14345J741142L428231L617744
3637.6E52739067O79894K103233L610268K946319J573258R38682L137283M710122O436538
3646.3E78874664N26085k187271N538597M108620L59726n404205K249031M280471L471642
3655E91817360P355995j829529P02858M538727J091728K415848J120148J150360M74319
$$ plain form
3663.6 608837814 609732971 613211098 615904732 621005363 624076042 624522018 628532982 619141426 617815132
3672.3 617815132 626176720 635524254 640419998 629496269 627979965 632287598 636239433 634845047
3680 634845047 634499779 636925087 637577400 640050964 641572647 641202316 645654907 651606369 644056168
3688.7 644056168 642517548 652463379 647369995 643339081 648142395 649024811 648967514 648714905 649515305
3697.4 649515305 650243683 650195847 653578186 656547394 651543427 650162354 655690079 657541580 657643814
3706.1 657643814 657791595 660404739 664136429 656202774 661915817 671289978 660235138 660357742
3713.8 660357742 662852478 664294128 665239410 667472687 670467758 666594009 665655212 672821503 671978531
3722.5 671978531 665202255 669566116 672027054 671597366 669135590 668958588 672177048 672524948 680065384
$$ packed form
3663.6F08837814Q95157L478127K693634N100631L070679M45976M010964r391556j326294
3672.3F17815132Q361588R347534M895744j0923729j516304M307633L951835j394386
3680F34845047l45268K425308O52313K473564J521683l70331M452591N951462p550201
3688.7F44056168j538620R945831n093384m030914M803314Q82416n7297k52609Q00400
3697.4F49515305P28378m7836L382339K969208n003967j381073N527725J851501J02234
3706.1F57643814J47781K613144L731690p933655N713043R374161j1054840J22604
3713.8F60357742K494736J441650R45282K233277K995071l873749r38797P166291q42972
3722.5F71978531o776276M363861K460938m29688k461776j77002L218460L47900P540436
$$ plain form
3731.2 680065384 683004150 673886490 679123535 680372086 673133240 672745209 673780441 670730209
3738.9 670730209 671654816 676398697 674093933 674938583 681612625 676456757 668500977 674529953 679631195
3747.5 679631195 686031647 682861404 672809906 682832642 681110001 672945480 676884308 680541077
3755.3 680541077 683164673 679061203 680916138 687246170 678961258 672996368 677965546 680953217
3763 680953217 680705261 682652054 680345306 677778244 681115341 686091995 686395187 678519516 679430695
3771.7 679430695 681341705 681642227 681395111 679769058 680741501 682170029 686706467 688248444 679807053
3780.3 679807053 680963898 683292160 683594055 686088028 684912109 682532654 682148819 684094467 686833267
3789 686833267 686644440 684667816 682593613 684180679 684339066 683268433 686723328 683839951 679945755
$$ packed form
3731.2F80065384K938766r117660N237045J248551p238846l88031J035232l050232
3738.9F70730209R24607M743881k304764Q44650O674042n155868p955780O028976N101242
3747.5F79631195O400452l170243j0051498J0022736j722641q164521L938828L656769
3755.3F80541077K623596m103470J854935O330032q284912n964890M969178K987671
3763F80953217k47956J946793k306748k567062L337097M976654L03192p875671R11179
3771.7F79430695J911010L00522k47116j626053R72443J428528M536438J541977q441391
3780.3F79807053J156845K328262L01895K493973j175919k379455l83835J945648K738800
3789F86833267j88827j976624k074203J587066J58387j070633L454895k883377l894196
$$ plain form
3797.7 679945755 683105850 688565369 696624451 691342621 677965546 679881287 682533264 686558456
3805.4 686558456 693565369 688256073 680343857 683286514 684401245 683384933 684474258 685117569
3813.1 685117569 685936813 691180649 690817490 678880768 682276154 687674561 695653839 701742249
3820.8 701742249 683524933 681907043 685825500 687166672 688959579 687503738 682927628 683698273
3828.6 683698273 686207275 688901978 689296188 681515045 685145340 693436813 688222580 685125427
3836.3 685125427 692955627 689638367 683594513 689486160 683936386 682908478 690829315 688392487
3844 688392487 683387146 685917664 686408844 684054489 685965424 687615128 689578476 695287552 694607849
3852.7 694607849 697880707 677689667 676488266 688466415 687690353 683428116 685844803 690176315
$$ packed form
3797.7F79945755L160095N459519Q059082n281830j3377075J915741K651977M025192
3805.4F86558456P006913n309296p912216K942657J114731j016312J089325O43311
3813.1F85117569Q19244N243836l63159j1936722L395386N398407P979278O088410
3820.8G01742249j8217316j617890L918457J341172J792907j455841m576110P70645
3828.6F83698273K509002K694703L94210p781143L630295Q291473n214233l097153
3836.3F85125427P830200l317260o043854N891647n549774j027908P920837k436828
3844F88392487n005341K530518M91180k354355J910935J649704J963348N709076o79703
3852.7F94607849L272858k0191040j201401J1978149p76062m262237K416687M331512
$$ plain form
3860.4 690176315 692275238 686199188 684815063 690322723 688445969 682825241 685204773 689976044
3868.1 689976044 696967926 692467728 680454330 682510910 688795547 692990112 682761917 681723938
3875.8 681723938 685480652 683347168 684838028 691317368 688245392 680357971 684415970 687505798
3883.5 687505798 692266998 697774887 682988586 681090698 685663071 687226639 691091461 691343842
3891.2 691343842 683199539 684090729 687306824 685079193 685860901 686223297 688703232 691202850 681301804
3899.9 681301804 685131836 688445969 684652023 687319183 685709763 686309357 686890030 686329422 686931839
3908.6 686931839 687446365 688433228 687200165 685837250 686073380 686835632 686921921 687024307 685414505
3917.3 685414505 683357544 687028580 687307434 682266922 682460098 685307770 689025574 687180481 682926025
$$ packed form
3860.4F90176315K098923o076050j384125N507660j876754n620728K379532M771271
3868.1F89976044O991882m500198j2013398K056580O284637M194565j0228195j037979
3875.8F81723938L756714k133484J490860O479340l071976p887421M057999L089828
3883.5F87505798M761200N507889j4786301j897888M572373J563568L864822K52381
3891.2F91343842q144303Q91190L216095k227631P81708L62396K479935K499618r901046
3899.9F81301804L830032L314133l793946K667160j609420N99594N80673n60608O02417
3908.6F86931839N14526R86863j233063j362915K36130P62252Q6289J02386j609802
3917.3F85414505k056961L671036K78854n040512J93176K847672L717804j845093m254456
$$ plain form
3926 682926025 684446182 684987717 685485001 685759125 686011581 688206863 684640808 682343903 684047623
3934.6 684047623 684590225 685814133 685830154 683925476 682207565 683113098 686143417 687188873 684909210
3943.3 684909210 684134827 684093781 684565811 686275482 683357391 683258133 686494751 685025406 685946198
3952 685946198 686545258 684918365 685019608 684688950 683380127 683033447 682977676 681574249 684424896
3960.7 684424896 688129578 686561813 686093063 685838928 684090347 684592590 685405960 684094391 683419724
3969.3 683419724 683754883 684660110 685694656 685288239 684207230 682316513 683266449 686168518 686052094
3978 686052094 685127945 684735489 684753036 684186249 682911377 682227859 682095642 682783356 684730453 685592575
3987.7 685592575 684199982 685247498 686621704 685316544 685030060 685268326 685414276 684370499 682851944
$$ packed form
3926F82926025J520157N41535M97284K74124K52456K195282l566055k296905J703720
3934.6F84047623N42602J223908J6021j904678j717911R05533L030319J045456k279663
3943.3F84909210p74383m1046M72030J709671k918091r9258L236618j469345R20792
3952F85946198N99060j626893J01243l30658j308823l46680n5771j403427K850647
3960.7F84424896L704682j567765m68750k54135j748581N02243Q13370j311569o74667
3969.3F83419724L35159R05227J034546m06417j081009j890717R49936K902069j16424
3978F86052094r24149l92456J7547n66787j274872o83518j32217O87714J947097Q62122
3987.7F85592575j392593J047516J374206j305160k86484K38266J45950j043777j518555
$$ plain form
3996.3 682851944 682697220 682443542 683380661 684169693
4000.2 684169693
$$ packed form
3996.3F82851944j54724k53678R37119P89032
4000.2F84169693
##END=$$ End of the data block
