##TITLE=$$ Begin of the data block
##JCAMP-DX=5.00 $$ ACD/SpecManager v 10.08
##SPECTROMETER/DATA SYSTEM=Varian
##DATE=07 Jan 2013 10:37:28
##DATA TYPE=INFRARED SPECTRUM
##DATA CLASS=XYDATA
##ORIGIN=
##OWNER=
##NPOINTS=3735
##FIRSTX=399.26403809
##LASTX=4000.35498047
##MAXX=4000.35498047
##MINX=399.26403809
##MAXY=79.82476807
##MINY=5.09845972
##XFACTOR=1.0000000000
##YFACTOR=0.000000100000000
##FIRSTY=52.25185776
##DELTAX=0.96440572
##XUNITS=1/CM
##YUNITS=TRANSMITTANCE
##XYDATA=(X++(Y..Y))
399.3E22518578j40513306l2558479q8560219J34299316L29744072P3317719k06981621
$$ 522518578 382005272 349446793 260886574 395185890 724929962 798247681 591266060
406E91266060k3525200j2512436k3307991J11413765k5437164j33199616l0859489
$$ 591266060 567740860 555228424 531920433 643334198 617897034 484697418 453837929
412.8D53837929j3141785K1286087J3069077N5317802L8790779p660103o800232j26580543
$$ 453837929 440696144 461982231 475051308 530369110 569159889 561499786 554699554 428119011
420.5D28119011k0524178K1796265M8909798l3291550o8360176J00117302J04586372
$$ 428119011 407594833 429391098 478300896 445009346 376649170 476766472 581352844
427.2E81352844K4755287j553154n1814308j01051903j7758560K4586907o3542404
$$ 581352844 606108131 604554977 552740669 451688766 433930206 458517113 394974709
434C94974709o0278740L1504478J41749115N8409653o5277596K0191078M5545502K2561951
$$ 394974709 334695969 366200447 507949562 566359215 501081619 521272697 566818199 589380150
441.7E89380150L8642654m5681953q2817688k6315384j5301285P543564L4641571k1680412
$$ 589380150 628022804 582340851 499523163 473207779 457906494 465450058 500091629 478411217
449.4D78411217p192612j0753212k2255630P4386520M3862343j419525m5791359q1139870
$$ 478411217 471218605 460465393 438209763 512596283 556458626 555039101 509247742 428107872
457.1D28107872K2418785Q6862297K3186531l1482124L6696014N1942902o1334572
$$ 428107872 450526657 537388954 560575485 529093361 565789375 617732277 556397705
463.9E56397705m7882233m1943016n2606887J4632682M5031090K5051422l9491005
$$ 556397705 508515472 466572456 413965569 428598251 473629341 498680763 459189758
470.6D59189758j6524009N4045181J4861870l5606652n6595344m4328118K6436577
$$ 459189758 442665749 496710930 511572800 475966148 419370804 375042686 401479263
477.4D01479263O5487824N8409920j4041253l4804229J2406540q760415m5815391J9404793
$$ 401479263 466967087 525377007 511335754 476531525 488938065 480177650 434362259 453767052
485.1D53767052O2897148l276596k6750946K9153709n46570k5070495j8802109j7740898
$$ 453767052 516664200 513387604 486636658 515790367 515243797 490173302 471371193 453630295
492.8D53630295j1398277N41000M7600403J0005951o4605446Q667145R2323455j2997322
$$ 453630295 442232018 442773018 490373421 500379372 435773926 444441071 536764526 523767204
500.5E23767204p5384941L1117058m47121l6119117j2115784m554024J3691597K0162811
$$ 523767204 448382263 479499321 479052200 442933083 430817299 426263275 439954872 460117683
508.2D60117683M8700257n72815p1143570l4085007J4265633O0868301L1078606k4682007
$$ 460117683 508817940 508245125 437101555 403016548 417282181 478150482 509229088 484547081
516D84547081l3993721j0858116r862862j2002029K4915581J7800941J8472099j4567108
$$ 484547081 450553360 439695244 429832382 417830353 442745934 460546875 479018974 464451866
523.7D64451866m3395233J659622K0169258J7110367j1476097J891022K8735008k3937798
$$ 464451866 421056633 422716255 442885513 459995880 448519783 450410805 479145813 455208015
531.4D55208015j5915870J485100p729226J5771828J8644333K112732j4596291m758415
$$ 455208015 439292145 440777245 433048019 448819847 467464180 469576912 454980621 450222206
539.1D50222206J2965393m409714L70903J248970j8082771l070679j620712o99386
$$ 450222206 463187599 458777885 459148788 460397758 442314987 439244308 437623596 436924210
546.8D36924210J0659599J3383942J5684356j4246902j6306076R216690M993210j1386071
$$ 436924210 447583809 460967751 476652107 462405205 446099129 455315819 460309029 448922958
554.5D48922958o42967J5067406j631050n863953k583961J5090637J7666092j4701576
$$ 448922958 448279991 463347397 461716347 455852394 453268433 468359070 486025162 471323586
562.3D71323586r445076Q551139J1067467j5243835k3048249j549148L830948J7090263
$$ 471323586 461878510 470429649 481497116 466253281 443205032 441655884 445486832 462577095
570D62577095J1720047n574417q662376L168792q418159n828247K1523475q824653
$$ 462577095 474297142 468722725 460060349 463229141 454810982 448982735 470506210 461681557
577.7D61681557k0029717j4575882J705818L1399994M043122j6938324Q51745R468155
$$ 461681557 441651840 427075958 428781776 460181770 464224892 447286568 448138313 457606468
585.4D57606468q865356R29069Q45871r517784J1315079j577912r72518J2263794J0994224
$$ 457606468 448741112 449670181 450516052 440998268 452313347 450735435 449762917 462026711 473020935
594.1D73020935J0097542j7402725k1438866r864655l716926O231880O635361j1835366
$$ 473020935 483118477 465715752 444276886 434412231 430695305 436927185 443562546 431727180
601.8D31727180l660736J2656365j0337601j4651184r624634r610519j100426n865211
$$ 431727180 428066444 440722809 430385208 415734024 406109390 396498871 395398445 389533234
609.5C89533234j2912445j6936570k7030182l0222759j797027M690590J750202J7006530
$$ 389533234 376620789 359684219 332654037 302431278 300634251 305324841 307075043 324081573
617.2C24081573N835534l079949j3771801j8542328r395466j7639656k3700332n662289
$$ 324081573 329917107 326837158 313065357 294523029 285127563 267487907 243787575 238125286
624.9B38125286J5452194J5557423K4256210K5791035J7423344J3214912P430306J854362
$$ 238125286 253577480 269134903 293391113 319182148 336605492 349820404 357250710 359105072
632.7C59105072j215248m586754j7484245j1263695q16956P569733Q366203n759315
$$ 359105072 357889824 353303070 335818825 324555130 323738174 331307907 339674110 333914795
640.4C33914795Q588791J2452736J3502655K8908577K4023094J4230270P631378Q943978
$$ 333914795 342503586 354956322 368458977 397367554 421390648 435620918 443252296 452196274
648.1D52196274J0715103Q723450J1146125M826241m116058k428780n862007j1018791
$$ 452196274 462911377 471634827 482780952 487607193 483491135 481062355 475200348 464181557
655.8D64181557N983162J6071434K70462m406929N458603O83670q82492M639091J540108
$$ 464181557 470164719 486236153 486506615 482099686 487558289 488241959 487359467 491998558 493538666
664.5D93538666N521621M831124J1002121J1042824j9382706K458382m256592l752899
$$ 493538666 499060287 503891411 514893532 525936356 506553650 509012032 504755440 501002541
672.2E01002541P906684M740563K686767o580123J135330J1862221j551896j0320320
$$ 501002541 508909225 513649788 516336555 509756432 510891762 522753983 521202087 510881767
679.9E10881767k897072O984520J598778p67784l385277q365364M719696J1697006
$$ 510881767 507984695 514969215 516567993 515800209 512414932 504049568 508769264 520466270
687.6E20466270J081658j4488411p568169R129334N134201j127281q970414j0425071
$$ 520466270 521547928 507059517 499491348 508620682 513754883 512627602 503657188 493232117
695.3D93232117L02467M41361o207276m257545P189750Q398285P75032o000251k313614
$$ 493232117 493534584 493975945 487768669 483511124 490700874 499099159 499874191 493873940 491560326
704D91560326J2193985l59764j1206170r83810L235054M223709N173340J2288666M516296
$$ 491560326 503754311 503394547 492188377 491204567 494439621 498663330 503836670 516125336 520641632
712.7E20641632k258186J981621q379097p283936L302956Q110122Q92182l395119O058388
$$ 520641632 518383446 520365067 511985970 504702034 508004990 516115112 517007294 513612175 519670563
721.4E19670563N768356q05511q241005j09368J2248497J0662422M441605k377701
$$ 519670563 525438919 524633408 516392403 516283035 528531532 539193954 543635559 541257858
729.1E41257858m893837q612556p061463J689072Q959808K23809j0160713J178016
$$ 541257858 536364021 527751465 520690002 522379074 531338882 531562691 521401978 522579994
736.8E22579994L721771m101448M83818P026635l220711p323265k186623p654304L487396
$$ 522579994 526301765 522200317 522684135 529710770 526490059 519166794 516980171 509325867 512813263
745.5E12813263J0236626k718735J43776J7125282J1982193k730942K081108O873169
$$ 512813263 523049889 520331154 520474930 537600212 549582405 546851463 548932571 555805740
753.2E55805740J3113594K343331m386215K848587n705071J891136P2747l755990M400216
$$ 555805740 568919334 571262665 566876450 569725037 564019966 565911102 565983849 562227859 566628075
761.9E66628075J094284P424888J894875m488640L252525J929016n682868n511742
$$ 566628075 567722359 575147247 577042122 572553482 575806007 577735023 572052155 566540413
769.6E66540413N432472M741631o327324p790299K634201N898629J533966j430130
$$ 566540413 571972885 576714516 570387192 562596893 565231094 571129723 572663689 571233559
777.3E71233559N64766J1248550R147720M185486M992676k884865q426857j767006
$$ 571233559 571798325 583046875 592194595 596380081 601372757 598487892 590061035 588294029
785E88294029J19210K127723R919243k674904m783783M797058N92690j857414l707581
$$ 588294029 588413239 590540962 600460205 597785301 593001518 597798576 598391266 596533852 592826271
793.7E92826271R263420J6960449K370377r614143r065438j639328M73366Q99162n233192
$$ 592826271 602089691 619050140 621420517 611806374 602740936 601101608 601574974 602474136 597240944
802.4E97240944j418953P265243J958428J971970l62092n963707l218574L208427R94072
$$ 597240944 595821991 603087234 605045662 607017632 606655540 600691833 597473259 600681686 601675758
811.1F01675758m856147k343178L904724O107902M467354O554604j265602n247994
$$ 601675758 596819611 594476433 598381157 604489059 608956413 615511017 614245415 608997421
818.8F08997421j569633j760788L799400K594948K820473R32426o359329o205063m443893
$$ 608997421 607427788 605667000 609466400 612061348 614881821 615814247 609454918 603249855 598805962
827.5E98805962J865882K975617p8278K84577k033043j1495667j2388153n185394j0439491
$$ 598805962 600671844 603647461 603569183 603853760 601820717 590325050 577936897 572751503 562312012
836.1E62312012n833206O002693K166671p232475q267822l622627L53546j375961n259438
$$ 562312012 556478806 562481499 564648170 557415695 549147873 545525246 545878792 544502831 539243393
844.8E39243393m258041o751099K036667O649284k16865Q655166R485893j534004p346191
$$ 539243393 534985352 528234253 530270920 536920204 536703339 545358505 554844398 553310394 545964203
853.5E45964203L753471J1355782l25775n51834M728927N884438R35478K313156M681358
$$ 545964203 549717674 561073456 560747681 560195847 564924774 570809212 571744690 574057846 578739204
862.2E78739204j291389Q081894J0414963N613250m07257q124733j69372N763893N923233
$$ 578739204 577447815 585529709 595944672 601557922 601150665 593025932 592856560 598620453 604543686
870.9F04543686k244186m265709L346176J683502K887382l876190j0332908k956581
$$ 604543686 602299500 598033791 601379967 603063469 605950851 602074661 591741753 588785172
878.6E88785172K091293M639320j135673q630333R5787R581489P95136p333603k196541
$$ 588785172 590876465 595515785 594380112 585749779 585845566 595427055 596222191 588888588 586692047
887.3E86692047j420212m252357l822556j872596J872444j007767m631920L625031
$$ 586692047 585271835 581019478 577196922 575324326 577196770 576189003 571557083 575182114
895E75182114M606895p842522r55162R057122k432709k353592l77426l330155M803734
$$ 575182114 579789009 571946487 570991325 580048447 577615738 575262146 574884720 571554565 576358299
903.7E76358299L839607q12759k373238m996032l698921o92215j838608m118805K99911
$$ 576358299 580197906 579385147 577011909 572015877 568316956 567624741 565786133 561667328 561967239
912.3E61967239k571258o332741n901298q435898l516617K78511m055710p984733k341805
$$ 561967239 559395981 553063240 547161942 538726044 535209427 535487938 531432228 523447495 521105690
921E21105690J012840l961982p560883p990913j369820K578354M758529K132226n507470
$$ 521105690 522118530 518156548 510595665 502604752 501234932 503813286 508571815 510704041 505196571
929.7E05196571n209541j762009j404266j333542O819344N313453J249314O962929
$$ 505196571 499987030 498225021 496820755 495487213 502306557 507620010 508869324 515832253
937.4E15832253J722831k609062R46579O015129N064316N900497J2733002O607056
$$ 515832253 517555084 514946022 515892601 521907730 526972046 532872543 545605545 552212601
945.1E52212601J108207J698304L764152L967858k045708P04727N953255K137870k383041
$$ 552212601 553320808 555019112 558783264 562751122 560705414 561410141 567363396 569501266 567118225
953.8E67118225K03285k66647j977272L642273j954765j0177803m73443J151543r588814
$$ 567118225 567321510 567054863 565077591 568719864 566765099 556587296 556113853 557265396 547676582
962.5E47676582l960151j405754o037140j458779j245765k229691k322617Q33054k393265
$$ 547676582 543716431 542310677 536273537 534814758 533568993 531339302 529016685 529849739 527456474
971.2E27456474r029770k877426m46663K610703Q73756l615036m25148m067383m376678
$$ 527456474 518426704 515549278 515102615 517713318 518587074 514972038 514546890 510479507 506102829
979.8E06102829l823891j739769P94220m385528j634178k84081p43751k040406r746589
$$ 506102829 502278938 500539169 501333389 496947861 495313683 495029602 494285851 492245445 482498856
988.5D82498856o188393m235802o221504o024475j1409073j2521896j9831543j9934502
$$ 482498856 476310463 472074661 465853157 459828682 448419609 435897713 416066170 396131668
996.2C96131668J292229J4978103J3417016N650825N570183Q080253P393723J09940
$$ 396131668 397423897 412402000 425819016 431469841 437040024 445120277 452514000 452623940
1004D52623940m853440J913338k065659m990425m03633J616325p66487q035621m919777
$$ 452623940 447770500 449683838 447618179 442627754 442224121 443840446 443073959 435038338 430118561
1012.6D30118561K12517J735954k525520n652237l492432m799805j817589q06312l007431
$$ 430118561 430331078 432067032 429541512 423889275 420396843 415597038 413779449 412973137 409965706
1021.3D09965706p193184m573936K20031k866096j147614k718429k019997P94067K304573
$$ 409965706 402772522 398198586 398418617 395552521 394404907 391686478 389666481 390460548 392765121
1030C92765121J206971q369675j0688324o434708k100753l117142m07715M085579l862686
$$ 392765121 393972092 385602417 374914093 368479385 366378632 363261490 362853775 366939354 363076668
1038.7C63076668l863335L492241L76205n291137m415817k39869N034981J291771k093124
$$ 363076668 359213333 362705574 363081779 357790642 353374825 353134956 358169937 359461708 357368584
1047.4C57368584J783218k364311j095200K889138Q65821J617813K346650N3634P74384
$$ 357368584 359151802 356787491 355692291 358581429 359447250 361065063 363411713 363465347 364239731
1056C64239731N254783O52123n671310q838082o146850N585250O395836j026802R02672
$$ 364239731 369494514 370146637 364475327 355637245 349490395 355075645 361471481 360444679 361347351
1064.7C61347351J888504m456520k174416m37812p01638j40609n252877l479042l274383
$$ 361347351 363235855 358779335 356604919 356167107 355465469 355324860 350071983 346592941 343318558
1073.4C43318558l30277J454010k181282L12805k711181k994805k47612m089431r160996
$$ 343318558 342988281 344442291 342261009 342573814 339862633 336867828 336620216 332530785 323369789
1082.1C23369789r84230P631912J447792r24301m450493o077690l207245j276130j754856
$$ 323369789 322385559 330017471 331465263 330540962 326090469 320012779 316805534 315529404 313774548
1090.7C13774548q754006j0605755n611648n389309j4946099j4129829j1285839j3841133
$$ 313774548 305020542 294414787 288803139 283413830 268467731 254337902 243052063 229210930
1098.5B29210930j1292381j3659497j1132545r667607q346805r933491j2840738q382788
$$ 229210930 217918549 204259052 193126507 183458900 175112095 165178604 152337866 143955078
1106.2A43955078m972648m003048j1241322o234198k309103p196846m917202o54153
$$ 143955078 138982430 134979382 123738060 117503862 115194759 107997913 103080711 102426558
1113.9A02426558n32399q134212m055586j260529O78025M694624K844286J756734j113987
$$ 102426558 101894159 93759947 89704361 88443832 89121857 93816481 96660767 98417501 97303514
1122.6I7303514J526032k28853j7958J508284Q97884K142296K568874L454390l699951
$$ 97303514 98829546 98600693 98582735 100091019 100988903 103131199 105700073 109154463 105454512
1131.2A05454512m166890k750816j570625l662586o660881k450009k676153N442085
$$ 105454512 101287622 98536806 96966181 93303595 86642714 84192705 81516552 86958637
1139H6958637Q9970p587376k877960k038755j907745m488778O62866k108965m475637
$$ 86958637 87048607 79461231 76583271 74544516 72636771 68147993 68810859 66701894 62226257
1147.6F2226257o261367m980293O750674J834980j910081k495461j318397m53420J318707
$$ 62226257 55964890 50984597 57735271 59570251 57660170 55164709 53846312 53392892 54711599
1156.3E4711599N005265J600427L515086K182260J940355L64247N46631K875014K677851
$$ 54711599 59716864 61317291 64832377 67014637 68954992 69319239 69865870 72740884 75418735
1165G5418735O178364L809185M335499J669521K791930L625240J779833Q746195P160272
$$ 75418735 81597099 85406284 89741783 91411304 94203234 97828474 99608307 108354502 115514774
1173.7A15514774O860648N205202L725881O220627N603685Q059397R494200P107658
$$ 115514774 122375422 127580624 131306505 137527132 143130817 151190214 160684414 167792072
1181.4A67792072N692768Q954754O641789N865288R162731R197578N989533L700542
$$ 167792072 173484840 182439594 189081383 194946671 204109402 213306980 219296513 222997055
1189.1B22997055Q355408P666664N395126L743172N864754P015915K249603N906181
$$ 222997055 231352463 239019127 244414253 248157425 254022179 261038094 263287697 269193878
1196.8B69193878Q152142O760692M664650O440621N794811M361534R359646P493858
$$ 269193878 277346020 284106712 288771362 295211983 301006794 305368328 314727974 322221832
1204.5C22221832P689858N396232M253083O111946M600906O316528N993462M930382
$$ 322221832 329911690 335307922 339561005 345672951 350273857 356590385 362583847 367514229
1212.3C67514229j160698Q42094P206002P098236N605163j114540P70760J730766m24194
$$ 367514229 366353531 367195625 374401627 381499863 387105026 385990486 386761246 388492012 388067818
1220.9C88067818k10839J068726K547760j652107K717437J144486j308708L283767
$$ 388067818 387856979 388925705 391473465 389821358 392538795 393683281 392374573 395658340
1228.6C95658340J334839J777115M7150K711601L429604k120743L052Q79593k18087
$$ 395658340 396993179 398770294 398817444 401529045 404958649 402837906 402840958 403720551 403502464
1237.3D03502464O38466J434326N93262K110558L440437Q50372O53916L171730L249016
$$ 403502464 404140930 405575256 406168518 408279076 411719513 412569885 413223801 416395531 419644547
1246D19644547l29018l45078m37278j945610J116409J935463j061211n77431L107605
$$ 419644547 419315529 418970451 418533173 416587563 417703972 419639435 418578224 418000793 421108398
1254.7D21108398L089180R76410j581726k206878R81636M023666L335876n61065J48926
$$ 421108398 424197578 425173988 423592262 421385384 422367020 426390686 429726562 429165497 429314423
1263.4D29314423J857490J496391Q33703J20544Q87642J756019L254166J518173M36211
$$ 429314423 431171913 432668304 433502007 433622551 434510193 436266212 439520378 441038551 441474762
1272D41474762J795120K122727K287330K880974M693222M006767K965889m28810j309776
$$ 441474762 443269882 445392609 447679939 450560913 455254135 459260902 462226791 461797981 460488205
1280.7D60488205M398727M943924K308731J536560J882439K980538M247894L170166
$$ 460488205 464886932 469830856 472139587 473676147 475558586 478539124 482787018 485957184
1288.4D85957184R11789J550102K826729K422256J240235K100639L542557L896827
$$ 485957184 486868973 488419075 491245804 493668060 494908295 497008934 500551491 504448318
1296.2E04448318J611786J119652M239311K056847j79482J426087K945595L111419
$$ 504448318 506060104 507179756 511419067 513475914 513296432 514722519 517668114 520779533
1303.9E20779533J692048P1487j111412R60922K050018Q90694P1068j158867K15035
$$ 520779533 522471581 522543068 521431656 522392578 524442596 525333290 525404358 524245491 524460526
1312.5E24460526J831626R15718O04134K441635J054878L14942K807503N32798N23262
$$ 524460526 526292152 527207870 527812004 530253639 531308517 531623459 534430962 534963760 535487022
1321.2E35487022K15798j707230J078491M387665M989624N98297j688423j719513r19533
$$ 535487022 535702820 533995590 535074081 539461746 544451370 545049667 543361244 541641731 540722198
1329.9E40722198M386406K479821q29048R8381k000618O42852K869606j569442j608544
$$ 540722198 545108604 547588425 546759377 546857758 544857140 545499992 548369598 546800156 545191612
1338.6E45191612n91202p46994O08292j033020O83670J971283j341667k79083M42657
$$ 545191612 544600410 543853416 544461708 543428688 544112358 546083641 544741974 544462891 544905548
1347.3E44905548o34956k5254P80907J841316k12211l007012j567344L76243n50689
$$ 544905548 544270592 544245338 545026245 546867561 546655350 543648338 542080994 542457237 541906548
1355.9E41906548o78368J67313J343307Q53920k188454j737289j231728j565361r918
$$ 541906548 541228180 541395493 542738800 543592720 541404266 539666977 538435249 536869888 536859970
1364.6E36859970n57632n54009j031227k77519P61833j537514m377937k755203J837120
$$ 536859970 536302338 535748329 534717102 534439583 535201416 533663902 529285965 526530762 528367882
1373.3E28367882J280060j637879o56204M10767q35457j350403J05095m02222m73289
$$ 528367882 529647942 528010063 527353859 527764626 526929169 525578766 525683861 525281639 524808350
1382E24808350j577111j797676Q23822J096421m120Q73642J6746j546593R11599K730636
$$ 524808350 523231239 521433563 522257385 523353806 523349686 524223328 524240074 522693481 523605080 526335716
1391.6E26335716J553345J680412j538772m246178Q06656J301422j342392m929962
$$ 526335716 527889061 529569473 528030701 523784523 524591179 525892601 524550209 519620247
1399.3E19620247k425232O49567q18673j038627K305641K190170l892135k612076J978111
$$ 519620247 517195015 517844582 517025909 515987282 518292923 520483093 516590958 513978882 515956993
1408E15956993J237412k617569l316651L40691K994308l73993k429199j595421j620102
$$ 515956993 517194405 514576836 511260185 511600876 514595184 514221191 511791992 510196571 508576469
1416.7E08576469L23792K917938j459312l247910K357750K743034j16004q10967J451721
$$ 508576469 508900261 511818199 510358887 507110977 509468727 512211761 512095757 511284790 512736511
1425.4E12736511J262779J213341L644867K597923j290931j805306O63758K568779
$$ 512736511 513999290 515212631 518857498 521455421 520164490 518359184 519022942 521591721
1433.1E21591721m89388k74773K952309L18909O46896K009087P2670r39141N03960
$$ 521591721 521102333 520827560 523779869 524098778 524745674 526754761 526827431 525888290 526392250
1441.8E26392250L873024K580452l62015J612816J626511R03854J957855l79257j302643
$$ 526392250 530265274 532845726 532483711 534096527 535723038 536626892 538584747 538205490 536902847
1450.5E36902847K161827J959305j952629J294289J601944J299247R483109k854958
$$ 536902847 539064674 541023979 539071350 540365639 541967583 543266830 552749939 549894981
1458.2E49894981n598678J644745L770218J322364K614022L919944M17176o2866m3793
$$ 549894981 544296303 545941048 549711266 551033630 553647652 557567596 557984772 557921906 557878113
1466.8E57878113J255951J501846O26411J857453L047600O710548P55348J63422K276802
$$ 557878113 559134064 560635910 561262321 563119774 566167374 572877922 573633270 573796692 576073494
1475.5E76073494J232758L301429K675934Q45223J030426J466293K321548K550011
$$ 576073494 577306252 580607681 583283615 584128838 585159264 586625557 588947105 591497116
1483.2E91497116J804123J069298l70751l468780p45125N406227L131104l792076j409569
$$ 591497116 593301239 594370537 593999786 590531006 589785881 595192108 598323212 594531136 593121567
1491.9E93121567k94838k48795J001129J981125l051986k379074j005631j11084j008949
$$ 593121567 592826729 592577934 593579063 595560188 592508202 590129128 589123497 589012413 588003464
1500.6E88003464l055153j360436m40902J482963M721031K421494j6073914k919654
$$ 588003464 584948311 583587875 583146973 584629936 589350967 591772461 575698547 572778893
1508.3E72778893K334480l431854j654168l776283n935097J77269K400132J722793
$$ 572778893 575113373 571681519 570027351 566251068 560315971 560493240 562893372 564616165
1516E64616165j422577o349945j827431L504639Q82683o048737j452903j546364J739311
$$ 564616165 563193588 556843643 555016212 558520851 559403534 553354797 551901894 550355530 552094841
1524.7E52094841l88222j847725j788025j77421J361771k559433l178521q10127L203163
$$ 552094841 551706619 549858894 548070869 547893448 549255219 546695786 543517265 542707138 545910301
1533.4E45910301p53555k868805j392975j304169k884140j6447792L198395R831810
$$ 545910301 545156746 542287941 540894966 539590797 536706657 520258865 523457260 533289070
1541.1E33289070J74179p66258J408730J853981m057198l45459K445374J928634q10127
$$ 533289070 533463249 532696991 534105721 535959702 531902504 531557045 534002419 535931053 535120926
1549.8E35120926n98602L061027K40631j689491n7030K299767J715050Q50830J670036
$$ 535120926 534522324 537583351 537823982 536134491 536077461 538377228 540092278 540943108 542613144
1558.5E42613144k12784P098961R7771j444855P68890M02069j566314P88345J936607
$$ 542613144 542400360 549499321 549597092 548152237 548921127 549323196 547756882 548545227 550481834
1567.1E50481834K178917J900063k499809l089486j497001N17540J064682K129631
$$ 550481834 552660751 554560814 552061005 548971519 547474518 547992058 549056740 551186371
1574.9E51186371q74825j1783294K124786L75938O55175j00174l461838j652756k511406
$$ 551186371 550311546 538528252 540653038 541028976 541684151 541583977 538122139 536469383 533957977
1583.5E33957977k520408m041901j244774J108437j795464k974357l931504k028122
$$ 533957977 531437569 527395668 526150894 527259331 525463867 522489510 518558006 516529884
1591.2E16529884m601211l402176l889656m935112j291847l589249j544151m02642
$$ 516529884 511928673 508526497 504636841 499701729 498409882 494820633 493276482 492873840
1599D92873840p25555m585190n280800l819046m858207j651764k850647j297570n012283
$$ 492873840 492148285 487563095 482282295 478463249 473605042 471953278 469102631 467805061 462792778
1607.6D62792778n171700k628822l469505j774635l359261O92406k144738k576446
$$ 462792778 457621078 454992256 451522751 449748116 446388855 447081261 444936523 442360077
1615.4D42360077m869080j2080154L089447j439285r35860j964607l92952k400055
$$ 442360077 437490997 425410843 428500290 427061005 426125145 424160538 423767586 421367531
1623.1D21367531n096398j025428l020134J993255k191353k812385j272240k509270
$$ 421367531 416271133 415245705 412225571 414218826 412027473 409215088 407942848 405433578
1630.8D05433578q01620j579857J80588j522522r32007o445808P6751L077202O18134
$$ 405433578 404631958 403052101 403232689 401710167 400778160 394332352 394409103 397486305 398104439
1639.5C98104439P34558l370438m47731n5046K780228K538681l280373K288246j296844
$$ 398104439 398838997 395468559 395020828 394965782 397746010 400284691 397004318 399292564 397995720
1648.1C97995720j686173j278686N059128N679588o645241n614738L925781P281876
$$ 397995720 396309547 395030861 400089989 405769577 399124336 393509598 397435379 404717255
1655.9D04717255J845169L196335K515869K701950K392311n89752K415695K305984
$$ 404717255 406562424 409758759 412274628 414976578 417368889 416779137 419194832 421500816
1663.6D21500816M486084J863518J820755L526497L201294M298401K15339K860718
$$ 421500816 425986900 427850418 429671173 433197670 436398964 440697365 440912704 443773422
1671.3D43773422K26059K494354M799614N733757K812195J071320L068466L076096
$$ 443773422 443999481 446493835 451293449 457027206 459839401 460910721 463979187 467055283
1679D67055283N616874K814522K300377L225899J979179L758316P49893N403633K277222
$$ 467055283 472672157 475486679 477787056 481012955 482992134 486750450 487500343 492903976 495181198
1687.7D95181198M182968O502381K421379M116630N501824N807724O286735R055062
$$ 495181198 499364166 505866547 508287926 512404556 517906380 523714104 530000839 539055901
1695.4E39055901k305794N99708O311646P628326R919014q733024O248741N879288
$$ 539055901 536750107 537349815 543661461 551289787 561208801 552475777 558724518 564603806
1703.1E64603806N963478N099411M353523N919876P13730L929634O458244J820908
$$ 564603806 570567284 575666695 580020218 585940094 586653824 590583458 597041702 598862610
1710.8E98862610N28107K752304L685150J484985J853752L148880K831726P56684L207779
$$ 598862610 599390717 602143021 605828171 607313156 609166908 612315788 615147514 615904198 619111977
1719.5F19111977M060974K359886J517792M89196o28891Q52051K884865K416954k04735
$$ 619111977 623172951 625532837 627050629 627539825 626910934 627762985 630647850 633064804 632860069
1728.2F32860069k02446Q08373K278671L518524M622994j81351j0512886L559418M316215
$$ 632860069 632657623 633465996 635744667 639263191 643886185 643704834 633191948 636751366 641067581
1736.9F41067581L013306N163193N88226m474640M147491N133210L03421K60696M153290
$$ 641067581 644080887 649244080 649832306 645357666 649505157 654638367 654941788 655202484 659355774
1745.5F59355774K678299J003189L151703K661514L148880R44519O29883L682556K501297
$$ 659355774 662034073 663037262 666188965 668850479 671999359 672943878 673573761 677256317 679757614
1754.2F79757614K568512J455689k046967J892319L508911K823715L018265k757111
$$ 679757614 682326126 683781815 681734848 683627167 687136078 689959793 692978058 690220947
1761.9F90220947j142502L695908K061157J137314P79877N93490k716369J514282N664139
$$ 690220947 689078445 692774353 694835510 695972824 696752701 697346191 694629822 696144104 701808243
1770.6G01808243K798309j379700k873611K845001L612061j137314q99201J481095
$$ 701808243 704606552 703226852 700353241 703198242 706810303 705672989 704773788 706254883
1778.3G06254883M170303K110443k427978j497574J262512P07855j867599O86951J868057
$$ 706254883 710425186 712535629 710107651 708610077 709872589 710580444 708712845 709399796 711267853
1787G11267853J298675M77448P56836J099472J897812k60163l718872K030335L885803
$$ 711267853 712566528 713043976 713800812 714900284 716798096 716537933 712819061 714849396 718735199
1795.7G18735199K045135l78570p81403l89480j164398J675872k76336j720505J001663
$$ 718735199 720780334 720401764 719620361 719230881 718066483 719742355 719466019 717745514 718747177
1804.4G18747177K211151O77338p15332J286468J090775J890640j43051j810837N17578
$$ 718747177 720958328 721635666 720920334 722206802 723297577 725188217 725045166 723234329 723751907
1813G23751907L66745P62558r25293M71268K75574j575699J997681J442794k31781
$$ 723751907 724118652 724881210 723955917 724427185 724702759 723127060 725124741 726567535 726335754
1821.7G26335754k97699K019043L020783k262879r25979J310806K166367J439514m127579
$$ 726335754 726038055 728057098 731077881 728815002 727889023 729199829 731366196 732805710 728678131
1830.4G28678131R8267M85534j046371J536407J292572P52335m61960p49206J504364
$$ 728678131 728776398 729261932 728215561 729751968 731044540 731796875 731334915 730585709 732090073
1839.1G32090073J00021k10648Q22831K868347J738205n784683K99453K130814m26788
$$ 732090073 732190094 731979446 732802277 735670624 737408829 731624146 731923599 734054413 733627625
1847.8G33627625j146775J608429P27005j689148J292496J212311o68869r26590R64508
$$ 733627625 732480850 734089279 734816284 733127136 734419632 735631943 734963074 734036484 735000992
1856.4G35000992K101288m94309j155700q95539M49600P02057m1198J103820J728669
$$ 735000992 737102280 736607971 735452271 734556732 735006332 735708389 735667191 736771011 738499680
1865.1G38499680Q3236j526489J87378j487351j364059J907501K221985R73282j079865
$$ 738499680 738582916 737056427 737243805 735756454 734392395 736299896 738521881 739495163 738415298
1873.8G38415298N31693J380463K9754j030349k83661M81796q66089R0637J145630
$$ 738415298 738946991 740327454 740357208 739326859 739043198 739524994 738658905 738749542 739895172
1882.5G39895172J359253q56857k768021k02713J746597J541443q1863L51028N20325
$$ 739895172 741254425 740397568 737629547 737426834 739173431 740714874 740633011 740984039 741504364
1891.2G41504364q57620o72760Q46634N10254j667023K7542O97021n61447j687393
$$ 741504364 740646744 739973984 740820618 741330872 739663849 739691391 740388412 739826965 738139572
1899.8G38139572j048202K742614K129517j281281o59103J243897k02637k244568O180
$$ 738139572 737091370 739833984 741963501 740682220 740023117 741267014 741064377 738819809 738825989
1908.5G38825989K775192k62756j540985R75494m02985M2038M22440Q54034K428055
$$ 738825989 741601181 741338425 739797440 740772934 740369949 740411987 740834427 741688461 744116516
1917.2G44116516j748886j542892N69076J179428Q45108k829895p59277J392746M35562
$$ 744116516 742367630 740824738 741393814 742573242 743418350 740588455 739829178 741221924 741657486
1925.9G41657486j101151n60607J184616p38678j789246K62451J256104m38767K63443
$$ 741657486 740556335 739995728 741180344 740441666 738652420 738914871 740170975 739732208 739995651
1934.6G39995651Q05664n22232K95716J29928L89633L85132N08042J217269j510314
$$ 739995651 740801315 740279083 740574799 740704727 741094360 741479492 741987534 743204803 741694489
1943.2G41694489j384049k71378k8152K13165J63727L75366j085205k29110J038513
$$ 741694489 740310440 740039062 740010910 740224075 740387802 740763168 739677963 739448853 740487366
1951.9G40487366j348114j075211J084213J179352k22320l68958P50733m61197m22287
$$ 740487366 739139252 738064041 739148254 740327606 740105286 739736328 740487061 740025864 739603577
1960.6G39603577Q50372l61252k033768j246032J260833J543274Q58918m92783n33676
$$ 739603577 740453949 740092697 738058929 736812897 738073730 739617004 740475922 739983139 739449463
1969.3G39449463J408462R36356p63931r50165J15814j336899k065429O36139J746292
$$ 739449463 740857925 741794281 741030350 740080185 740195999 738859100 736793671 737429810 739176102
1978G39176102N91964j223449l65982N61981L30887N3177j380768r65348n60684l05786
$$ 739176102 739768066 738544617 738178635 738740616 739071503 739124680 737743912 736778564 736217880 735912094
1987.6G35912094J04523p24030p71179L09448O20652O1264R02404j45568j190339m7607
$$ 735912094 736016617 735292587 734521408 734830856 735451508 735512772 736415176 736269608 735079269 735031662
1997.2G35031662M98886L20587K28577n20859j712036J079483K086792n33218j350403
$$ 735031662 735530548 735851135 736079712 735558853 733846817 734926300 737013092 736479874 735129471
2005.9G35129471l96042J784668n24521k474747n09338L33481R96551O34842j54648
$$ 735129471 734733429 736518097 735993576 733518829 733009491 733342972 734339523 734974365 734819717
2014.6G34819717j92794m48609r00421J33896R3918J22604Q80051j601868j650238
$$ 734819717 734626923 734178314 733277893 733411789 733505707 733628311 734508362 732906494 731256256
2023.3G31256256J11771M21600K55280q52433r32922n69077P17469J383209k93121
$$ 731256256 731368027 731789627 732044907 731192474 730259552 729690475 730407944 731791153 731498032
2032G31498032q37937R42536N50537r44062l04489J27869J5717r99604K15073J235733
$$ 731498032 730660095 731602631 732153168 731209106 730904617 731032486 731048203 730048599 730263672 731499405
2041.6G31499405P40051M92630j943741j031189q850J04294O20194m14505q1940m21982
$$ 731499405 732239456 732732086 730788345 729757156 729748306 729852600 730472794 730058289 729976349 729554367
2051.2G29554367j41449j078796j208420L54538k74735P77893J428833n7220r95102
$$ 729554367 729412918 728334122 727125702 727480240 727205505 727983398 729412231 729355011 728359909
2059.9G28359909K54822N1727q94165n84640j620255k59247P18384k92740j384125
$$ 728359909 728614731 728666458 727772293 727187653 725567398 725308151 726026535 725733795 724349670
2068.6G24349670o67038R71146k38724m00543p36465j366654q15811L65067R91668
$$ 724349670 723682632 724653778 724415054 724014511 723278046 721911392 721095581 721460648 722452316
2077.3G22452316j38626J3123r51081j386108p07931p64008M87137m53491j060410
$$ 722452316 722313690 722326813 721375732 719989624 719281693 718517685 719004822 718551331 717490921
2086G17490921R56116L43094j04142Q58384k33155K43302P56378n5924j50604r50775
$$ 717490921 718447037 718790131 718685989 719544373 719311218 719554520 720310898 720254974 720104370 719153595
2095.6G19153595j109695n34897J107254J064148M76455O76346J58920M30451j637955
$$ 719153595 718043900 717509003 718616257 719680405 720156860 720833206 720992126 721422577 719784622
2104.3G19784622l74908J528091R35364J575851j503219j396332Q08945O18438O50635
$$ 719784622 719409714 720937805 721873169 723449020 721945801 720549469 721358414 721976852 722627487
2113G22627487k44217q47778r25217P80564J575622N03769q78448J907J377335j66016
$$ 722627487 722383270 721535492 720610275 721390839 722966461 723470230 722591782 722593689 723971024 723805008
2122.6G23805008j0223j197815k015534n0659P63779O35452j144180j234131P39746
$$ 723805008 723794785 722596970 720581436 720530777 721294556 721930008 720785828 719551697 720291443
2131.3G20291443J09634j468429J27182P50122N51071J488113K71302n3788n00564
$$ 720291443 720401077 718932648 719059830 719809952 720361023 721849136 722120438 722066650 721566086
2140G21566086n96543M41361J286621K141266J00479j446609k37275J140976j8387
$$ 721566086 720969543 721410904 722697525 724838791 724939270 723492661 723255386 724396362 724377975
2148.6G24377975p32193O20957M15497l83683j91192J163330j64948j041336J88370
$$ 724377975 723645782 724266739 724682236 724298553 724107361 725270691 725105743 724064407 724252777
2157.3G24252777M60663J100922j76621m87900j81503J62811N85480q84399o02570
$$ 724252777 724713440 725814362 725637741 725149841 724968338 725131149 725716629 724832230 724229660
2166G24229660M14887R91134l29895j038437L63312O69556J21307q89893K07978N99899
$$ 724229660 724644547 725635681 725305786 724267349 724630661 725300217 725421524 724531631 724739609 725339508
2175.6G25339508l52936o53991p85523p67212r11560J009216Q21839L662J317673N18188
$$ 725339508 724986572 724332581 723547058 722779846 721868286 722877502 723699341 723703003 725020676 725538864
2185.3G25538864L43475K39945n30243j76239q91953j143341N76249J724701J747436
$$ 725538864 725882339 726122284 725592041 725415802 724523849 723380508 723956757 725681458 727428894
2194G27428894J365204L88336j203384j084977o27670p11441J985550J038742j224212
$$ 727428894 728794098 729182434 727979050 726894073 726266403 725554962 727540512 728579254 727355042
2202.6G27355042n9205Q03910K609329P34177n42756m3258j329804J27106J02539p934
$$ 727355042 727295837 728099747 730709076 731443253 730900497 730857239 729527435 729654541 729757080 729749146
2212.3G29749146R09652J678314M23127k255707j99051P44095l03574k47803K66648
$$ 729749146 730658798 732337112 732760239 730504532 730305481 731049576 730746002 730498199 730764847
2221G30764847M09775Q56170J559220j394425j639175J03607k35901P64923n9738j079178
$$ 730764847 731174622 732030792 733590012 732195587 730556412 730660019 730424118 731189041 731129303 730050125
2230.6G30050125p61871j240463k79847J208725J598664Q68530l36304M73023L22570
$$ 730050125 729288254 728047791 727767944 728976669 730575333 731443863 731107559 731580582 731903152
2239.3G31903152r85717k64817K27662J07955m85839K53372N54657p90634n02243M19921
$$ 731903152 730917435 730652618 730880280 730988235 730502396 730755768 731310425 730519791 730017548 730437469
2248.9G30437469J923829J026153j488800k233734p32727Q90884J14594J135406O79551
$$ 730437469 732361298 733387451 731898651 729664917 728932190 729823074 729937668 731073074 731752625
2257.6G31752625n06211K74124m68368J53580Q30154r6207q66165l45917Q5373j20926
$$ 731752625 731246414 731520538 731052170 731205750 732035904 731939697 731073532 730727615 730812988 730692062
2267.3G30692062M80118P05719l63464q77075P85751j25885r20486N60531K62451l12042
$$ 730692062 731172180 731877899 731514435 730637360 731423111 731297226 730376740 730937271 731199722 730887680
2276.9G30887680J53732K000885J79215j837082m76685m61197n16815l45230P42188
$$ 730887680 731041412 733042297 733221512 731384430 730907745 730446548 729929733 729584503 730326691
2285.6G30326691M86297J06354K76718l30200K39182m1428P48062L10974j359405k44751
$$ 730326691 730812988 730919342 731196060 730865860 731105042 731063614 731811676 732122650 730763245 730518494
2295.2G30518494R15069L98865R8190r1705r15222O90994n14603j438369R85412P31583
$$ 730518494 731433563 731832428 731930618 731838913 730923691 731614685 731100082 729661713 730647125 731378708
2304.9G31378708J199493k76642p40432P70111j63040m0284L663l53394o42853q8119
$$ 731378708 732578201 732301559 731561127 732331238 732168198 732127914 732131577 731778183 731135330 731047211
2314.5G31047211r8954M05121N570j759873k05230P72323m58679j471405K214203K508011
$$ 731047211 730948257 731353378 731358948 729599075 729393845 730166168 729707489 728236084 730450287 732958298
2324.2G32958298j798859j993103q21152P21894K83203L045196J252060k497101k78396
$$ 732958298 731159439 729166336 728345184 729067078 729350281 732395477 733647537 731150436 730872040
2332.8G30872040k82898o10733k272110P37686J93481K67868K844925j233291m13971
$$ 730872040 730589142 729978409 727706299 728443985 728637466 728905334 731750259 730516968 730102997
2341.5G30102997j318970O11572m51736R19037M449463j918030N87692J511765m07410
$$ 730102997 728784027 729395599 728943863 729862900 734312363 732394333 732982025 734493790 734086380
2350.2G34086380M27170j452027k15835L874740m0588n134659K247010m61579l356018
$$ 734086380 734513550 733061523 732845688 736720428 736679840 731545181 733792191 733330612 729974594
2358.9G29974594J400147l203278j742172P67364L558808N67093J71585M225158P11899
$$ 729974594 731374741 728171463 726429291 727196655 730755463 731322556 731494141 735719299 736431198
2367.6G36431198J535263j247101j153564L030472O22711l79868l43628j379852n91049
$$ 736431198 737966461 736719360 735565796 738596268 739218979 738839111 738495483 737115631 736524582
2376.2G36524582Q25958O42090o41556m30069K62680n81436Q26187Q89130n64194J709290
$$ 736524582 737350540 737992630 737351074 736921005 737183685 736602249 737428436 738317566 737753372 739462662
2385.9G39462662J068649j369095j486206o33850m98123l510J691361j8768k24686
$$ 739462662 740531311 739162216 737676010 737042160 736544037 736540527 738231888 738213120 737988434
2394.6G37988434j04447j347808M0283Q14590P20291p72705K5482J027604m45557k20795
$$ 737988434 737883987 736536179 736576462 737391052 738111343 737338638 737364120 738391724 737946167 737725372
2404.2G37725372l54767o0806K16217K36969k74963j569138n79071P32117N99747R20333
$$ 737725372 737370605 737309799 737526016 737762985 737488022 735918884 735339813 736071930 736671677 737592010
2413.8G37592010N48325j420288p43332m14352l28522R32770p92542n93872k7847m65927
$$ 737592010 738140335 736720047 735976715 735562363 735233841 736166611 735374069 734780197 734752350 734286423
2423.5G34286423P00760L60717o45523P7973R60464j16501K91825R536j459198m04434
$$ 734286423 734987183 735347900 734702377 734780350 735740814 735624313 735916138 735925674 734466476 734062042
2433.1G34062042R88922Q85315j710205r46884O87943n66178L47901O89544R82666
$$ 734062042 735050964 735936279 734226074 733279190 733967133 733400955 733748856 734438400 735421066
2441.8G35421066P14569o02951j18179k07214q08182o64826J00708L80784m38462n21698
$$ 735421066 736135635 735532684 735414505 735207291 734399109 733734283 733834991 734215775 733777313 733255615
2451.5G33255615M50287n57098j530609j49994J07193Q87756Q05740n28717Q3237j003952
$$ 733255615 733705902 733148804 731618195 731468201 731575394 732463150 733268890 732740173 732823410 731819458
2461.1G31819458j094666M83628J81045L60871J02005J23443R0714o87561m61426j859512
$$ 731819458 730724792 731208420 731389465 731750336 731852341 731975784 732066498 731378937 730917511 729057999
2470.7G29057999j331330N85022N61905J849060P08237j432648r40094o8664R77935
$$ 729057999 727726669 728311691 728873596 730722656 731430893 729998245 729058151 728989487 729967422
2479.4G29967422O17219p90864j519470l00827J086350j80893n56412O23245l72619
$$ 729967422 730584641 729793777 728274307 727973480 729059830 728878937 728322525 728945770 728573151
2488.1G28573151j224594m77372m6768R08203j69067j396179L68957J543732J281357
$$ 728573151 727348557 726871185 726824417 727732620 727563553 726167374 726536331 728080063 729361420
2496.8G29361420j163102k332611j42517R98307J94702l09449k86178p96814P0343
$$ 729361420 728198318 725865707 725723190 726721497 726916199 726606750 726320572 725523758 725594101
2505.5G25594101L67508m53949l79562J29776O84280j75018O30111J694947J8005j407013
$$ 725594101 725961609 725507660 725128098 725257874 725942154 725767136 726397247 728092194 728110199 726703186
2515.1G26703186r49249O6833o27746j283646j151276J92719R14154N94482R8420j810227
$$ 726703186 725753937 725820770 725193024 723909378 722758102 722950821 723864975 724459457 724557877 722747650
2524.7G22747650p95059o4240J43433J375885n0278o24084j329498p36237M11911o77185
$$ 722747650 721952591 721888351 722031784 723407669 723357391 722733307 721403809 720667572 721079483 720402298
2534.4G20402298O08673J614838O84662j64643o42471J66778K81601r53292p57828
$$ 720402298 721010971 722625809 723310471 723145828 722503357 722670135 722951736 721998444 721240616
2543.1G21240616L22800k80076j279754R7961J184464n42221q42438j44196M93393
$$ 721240616 721563416 721283340 720003586 720101547 721286011 720743790 719901352 719757156 720250549
2551.7G20250549J119767q11692j416244Q926n7907q14438n00946K87628Q82263l94439
$$ 720250549 721370316 720558624 719142380 719151306 719093399 718278961 717778015 718065643 718947906 718553467
2561.4G18553467j473007J399383J235199n24521K76413M9591n99975j183472N33829
$$ 718553467 717080460 718479843 719715042 719190521 719466934 719516525 718916550 717733078 718266907
2570.1G18266907J21307j675873m76989N7830Q55713l1433l49884O37741r2392l47061
$$ 718266907 718388214 716712341 716235352 716293182 717148895 717117462 716767578 717405319 717312927 716965866
2579.7G16965866r19037p17773k66876k33612j79749k24686O7215P92465J628800m13590
$$ 716965866 716046829 715329056 715062180 714828568 714648819 714424133 714491348 715283813 716912613 716499023
2589.4G16499023j433029l3569m43649l30658L45993q94394j409989J88752N12619
$$ 716499023 715065994 715032425 714588776 714258118 714604111 713709717 712299728 712488480 713001099
2598G13001099J57623N25894l51410j850815p45697R32083m68750j68838R33456p38601
$$ 713001099 713158722 713684616 713333206 711482391 710736694 711668777 711200027 711031189 711964645 711226044
2607.7G11226044r68628K77633O66886L55530n80597j755905j289902J37253L00445
$$ 711226044 710257416 710535049 711201935 711557465 710976868 709220963 707931061 708068314 708368759
2616.4G08368759m25110m20379N72586O25381j5411o39725m6463P38373l81775q51517
$$ 708368759 707943649 707523270 708095856 708721237 708705826 708066101 708019638 708758011 708376236 707524719
2626G07524719p15408o78711l48511k60391q10242n17273J156922M21447j401519j113663
$$ 707524719 706809311 706130600 705782089 705521698 704711456 704194183 705351105 705772552 704371033 703257370
2635.6G03257370K44293J60370q02689Q4992K57873p64465j285477r47952J092301
$$ 703257370 703501663 703662033 702859344 702944336 703202209 702437744 701152267 700204315 701296616
2644.3G01296616Q40835j289978m84848J91116j23748o5537n87997m36478p40509M5853
$$ 701296616 702137451 700847473 700362625 700553741 700429993 700364456 699776459 699339981 698599472 698645325
2654F98645325J191711n49011j094666M82712K53906j877060j114578M60816n2719
$$ 698645325 699837036 699288025 698193359 698676071 698929977 697052917 695938339 696399155 696346436
2662.6F96346436n44129r29642P59278O11114m8752J055680r99069j436692k77252
$$ 696346436 695802307 694872665 695631943 696243057 696194305 697249985 696250916 694814224 694536972
2671.3F94536972Q6746M85230p12128r12170J21383n43289r13696J028442P01676j521149
$$ 694536972 694623718 695108948 694396820 693484650 693606033 693062744 692149048 693177490 693879166 692358017
2681F92358017j703110k47421J309662N91888j066284r40247J17493j01166K95411
$$ 692358017 690654907 690407486 691717148 692309036 691242752 690302505 690419998 690318832 690614243
2689.6F90614243O29730r78394p03048O6299l31116p52945o24466k30255l37143J88599
$$ 690614243 691243973 690265579 689562531 689628830 689297714 688544769 687920303 687690048 687352905 687541504
2699.3F87541504N112j186982o88400J488724L95889j138077m41742j793289o90613
$$ 687541504 687546616 686359634 685671234 687159958 687555847 686417770 685976028 684182739 683492126
2708F83492126Q63953J5259J04065k9373n27115j739426p31201J204681O85425K30103
$$ 683492126 684356079 684371338 684475403 684446030 683918915 682179489 681448288 682652969 683338394 683568497
2717.6F83568497J06201q05054j924667p64923R24530M59289q19854j017838q697L62396
$$ 683568497 683674698 682869644 680944977 680180054 681104584 681563873 680744019 679726181 679717484 680079880
2727.3F80079880j7853o22406m80118j85928r13086p86972N30395M66538j45264m30908
$$ 680079880 680062027 679439621 678959503 678773575 677860489 677073517 677603912 678070450 677925186 677494278
2736.9F77494278j601715o15158N50842m10156q82874k92206P39823k9602o0654J77765
$$ 677494278 675892563 675277405 675828247 675418091 674535217 674243011 674982834 674953232 674892578 675070343
2746.5F75070343q26187p43179j481400j041946N40008R92n646J681366Q83560j165084
$$ 675070343 674244156 673500977 672019577 670977631 671517639 671518631 671512985 673194351 674077911 672912827
2756.2F72912827o09894o20804j256561n04303K67868m73633j290283o96488j80053
$$ 672912827 672302933 671682129 670425568 669921265 670189133 669715500 668425217 667728729 667548676
2764.9F67548676j77765n43976k72217p97043r89227J59607q4152N11856J212387j99356
$$ 667548676 667370911 666826935 666554718 665757675 664768448 664928055 664843903 665355759 666568146 666368790
2774.5F66368790j896515j448670r03625n26276R53293j64947l06931J98364j003647
$$ 666368790 664472275 663023605 662119980 661593704 662546997 662382050 662075119 662273483 661269836
2783.2F61269836n85784p1106k20643o86950k09580n55801j578980p95517j4190K3269
$$ 661269836 660684052 660612946 660392303 659705353 659495773 658939972 657360992 656565475 656551285 656574554
2792.8F56574554j182022p91244M3259p61872l25851M87671L48053q00324j250763
$$ 656574554 655392532 654601288 654644547 653882675 653556824 654044495 654392548 653592224 652341461
2801.5F52341461q97445p59583j132050j075515Q14743Q95309r74197j330872j204529
$$ 652341461 651444016 650684433 649552383 648476868 649291611 650186920 649212723 647881851 646677322
2810.2F46677322j790542j402970n5008L08533q43811j235275L41873j46942k217941
$$ 646677322 644886780 643483810 643428802 643737335 642893524 641658249 642000122 641853180 639635239
2818.9F39635239j942177K84195Q68988l37219k80571p24297j056404j444283j473503
$$ 639635239 637693062 637977257 638846245 638509026 638228455 637504158 636447754 635003471 633529968
2827.6F33529968m83169j882820j208687J303253P09991j356735j984329j237602r74503
$$ 633529968 633046799 631163979 629955292 631258545 631968536 630611801 628627472 627389870 626415367
2836.2F26415367j74751o07605j032410r18808k468872j867599j719017l093567j997986
$$ 626415367 626240616 625633011 624600601 623681793 621212921 619345322 617626305 614532738 612534752
2844.9F12534752j068039j878166k244683j848068k897606l545723q80241o7062j664467
$$ 612534752 611466713 609588547 607343864 605495796 602598190 599052467 598172226 598105164 596440697
2853.6E96440697m92707L82462O3019j92681r80148N7755L62892l35312q50639k286873
$$ 596440697 595947990 596330452 596393471 596200790 595220642 595278397 595641289 595305977 594455338 592168465
2863.2E92168465j607132m95644r2277J165504l67165l063430j820412N19104j77460
$$ 592168465 590561333 590065689 589973412 591138916 590771751 587708321 585887909 586407013 586229553
2871.9E86229553j860542j421852r16367j650047r01756L99894n37910j270943L15476
$$ 586229553 584369011 582947159 582030792 580380745 579478989 579878883 579340973 578070030 578385506
2880.6E78385506N25970m39529j063996j705322q27141o70662j4648M75502r43489
$$ 578385506 578911476 578471947 577407951 575702629 574875488 574204826 574190178 574665680 573722191
2889.3E73722191r15947q56285j028748k073364k106094o61850l6736l9177k126350
$$ 573722191 572806244 571949959 570921211 568847847 566741753 566079903 566043167 566003990 563877640
2897.9E63877640r37348L18108j204872j001969j392211r07746j145706o35185R72175
$$ 563877640 562940292 563258400 562053528 561051559 559659348 558751602 557605896 556970711 557942886
2906.6E57942886k25105j067772j216392q18673l25737k49137q65822j769753l005867
$$ 557942886 557717781 556650009 555433617 554614944 554289207 554040070 553174248 551404495 548398628
2915.3E48398628l242035n32722N78689K32773j478538j881180L84674l87192p03125
$$ 548398628 545156593 544623871 545202560 545435333 543956795 542075615 542460289 542073097 541369972
2924E41369972M84658J55982j513862j207390K31819l16162l40500P63512K351646
$$ 541369972 541854630 542010612 540496750 539289360 539521179 539205017 538864517 539628029 541979675
2932.7E41979675N27306j118393L62434r14993j515808J078377K496643M20418j031266
$$ 541979675 542506981 541388588 541751022 540836029 539320221 540398598 542895241 543315659 542284393
2941.3E42284393P22695K988624K045365j804924j654854J194076J198311j126900
$$ 542284393 543007088 545995712 548041077 546236153 544581299 545775375 546973686 545846786
2949.1E45846786j886558r58290k80037j42136j624069l92647O55442j486741r68704
$$ 545846786 543960228 543001938 542721901 542579765 540955696 540563049 541218491 539731750 538763046
2957.7E38763046N85175J054840P22275P30362J144600J97601K09503R33495m41285
$$ 538763046 539348221 540403061 541125336 541855698 543000298 543197899 543407402 544340897 543899612
2966.4E43899612j45111J393738O93550K295647K416344m73366n38750N99480J246681
$$ 543899612 543754501 545148239 545841789 548137436 550553780 550080414 549541664 550141144 551387825
2975.1E51387825O56815P43675J297645J528397J419182L72314J072731J252785Q58078
$$ 551387825 552044640 552788315 554085960 555614357 557033539 557405853 558478584 559731369 560589447
2983.8E60589447M72679l92532M54368J752663J615334K95219K42119K33421L96805
$$ 560589447 561062126 560669594 561123962 562876625 564491959 564787178 565029297 565262718 565659523
2992.5E65659523J255188L91006m47845j72157Q96301J186447N06363O15540J48315
$$ 565659523 566914711 567305717 566857872 566685715 567582016 568768463 569274826 569890366 570038681
3001.1E70038681j338196j4915O57348j414032J258469J833229r96551o33698q05511
$$ 570038681 568700485 568685570 569342918 567928886 569187355 571020584 570024033 569390335 568584824
3009.8E68584824o92788n10292L53814k27890j094552Q02460q14895j518708m61387
$$ 568584824 567892036 567381744 567735558 567507668 566413116 567215576 566400681 564881973 564420586
3018.5E64420586j154442n51338O50329J253205P4539r19304r89533j114006m23698
$$ 564420586 563266144 562714806 563365135 564618340 564692879 563773575 562784042 561670036 561246338
3027.2E61246338l03917j096039q05168M14085k72407k064743j733284K88849K79884
$$ 561246338 560942421 559846382 559041214 559455299 559182892 557118149 555384865 555673714 555953598
3035.9E55953598m33960M46358o6033o49986q50792j475944p44820n4474o47468j347771
$$ 555953598 555519638 555965996 555899963 555249977 554399185 552923241 552178421 552123947 551476479 550128708
3045.5E50128708p21398N82924k83928k144737j003876m00047j207084p4997l50953
$$ 550128708 549407310 549990234 549706306 547561569 546557693 546157646 544950562 544875565 544524612
3054.2E44524612j478920q16192Q2855R0447k81449n99403j418686j500015q97408
$$ 544524612 543045692 542229500 542312355 542402802 542121353 541521950 540103264 538603249 537705841
3062.9E37705841q14819l36495Q0872j234818j234512o3515o06651j14746n21355k68707
$$ 537705841 536891022 536554527 536635399 535400581 534166069 534102554 533495903 533381157 532859802 532591095
3072.5E32591095O84166j864586j584778K50206N6839k47345n54504K35481o39458
$$ 532591095 533275261 531410675 529825897 530076103 530132942 529885597 529331093 529566574 528927116
3081.2E28927116j530418l59573k23923o27403j239777j755257j046714L09600Q87261
$$ 528927116 527396698 527037125 526813202 526185799 524946022 523190765 522144051 522453651 523340912
3089.9E23340912k43721j192131k50015M60090j077728k229385o88668L81356K67028
$$ 523340912 523097191 521905060 521655045 522115135 521037407 518808022 518119354 518500710 518767738
3098.5E18767738j02119j134567j115494j379700j659546j123314r20181l97797j02424
$$ 518767738 518665619 517531052 516415558 515035858 513376312 512252998 511332817 510935020 510832596
3107.2E10832596M33502p65762k131806j220321o51474O10008k95181k258416r78355
$$ 510832596 511266098 510500336 508368530 507148209 506496735 507106743 506811562 504553146 503574791
3115.9E03574791k98805m87938k32086j090355j315575O4735m10575j161881m45900
$$ 503574791 503275986 502788048 502555962 501465607 500150032 500214767 499804192 498642311 498196411
3124.6D98196411j223678k026177r56345R77250j40190l072892k561607m39949k18392
$$ 498196411 496972733 494946556 493990211 494967461 494827271 491754379 489192772 488752823 488534431
3133.3D88534431j135406k28043q583j206245j830711k043038j03836N05791j442986
$$ 488534431 487399025 487170982 487162399 485956154 484125443 482082405 481978569 482484360 481041374
3141.9D81041374k392921j395684M84086J20620j272506j489678p48062n59921q69332
$$ 481041374 478648453 477252769 477736855 477857475 476584969 475095291 474347229 473787308 472917976
3150.6D72917976j08146j086197k217941j322022r84116p03964j102676j411553l02734
$$ 472917976 472809830 471723633 469505692 468183670 467199554 466495590 465392914 463981361 463678627
3159.3D63678627p14455j973076j465415r881n6419j715393k254372n59272M49295
$$ 463678627 462964172 460991096 459525681 459515800 459459381 457743988 455489616 454930344 455379639
3168D55379639j205178j154327J07460j280632k200012j944542j525269m86450L03841
$$ 455379639 454174461 453020134 453127594 451846962 449646950 447702408 446177139 445690689 445994530
3176.6D45994530K28843r00344k206955j845665p45774j662445j087532J007538l25432
$$ 445994530 446223373 445323029 443116074 441270409 440524635 438862190 437774658 438782196 438456764
3185.3D38456764j682319j222344j359939j332589j38740P9498j341057k066612j456528
$$ 438456764 436774445 435552101 434192162 432859573 432720833 432800331 431459274 429392662 427936134
3194D27936134k98500r04999j773414r92546m70047q46024j620788r02710M89464L01933
$$ 427936134 427637634 426732635 424959221 423966675 423496628 422650604 421029816 420127106 420616570 420918503
3203.6D20918503j164437j641082j297455j806603q63456N46608n58930j845474m3488
$$ 420918503 419754066 418112984 416815529 415008926 414145470 414692078 414133148 412287674 412244186
3212.3D12244186L24784k049866j104240k26212j195297j041718l38478j10702j177292
$$ 412244186 412568970 410519104 409414864 409188652 407993355 406951637 406613159 406502457 405325165
3221D05325165k061730j727790q63839j173744n53093L55339r89418o60896o06232
$$ 405325165 403263435 401535645 400671806 399498062 398944969 399300308 398310890 397649994 397043762
3229.7C97043762j381035K66991L48396j675415j008377m2152j421089j550980l27873
$$ 397043762 395662727 395929718 396278114 394602699 393594322 393552170 392131081 390580101 390252228
3238.4C90252228K33650j455078j925240J53847o47087k048302j095657N07851n1003
$$ 390252228 390485878 389030800 387105560 387259407 386612320 384564018 383468361 383976212 383925209
3247C83925209r06067n18379q04863n64537r62753n41115l14942j014671o0844q39157
$$ 383925209 383019142 382500763 381695900 381131363 380168610 379627495 379312553 378297882 378237038 377397881
3256.7C77397881j234932m76876n03807o39152r42803o39419r11103r10720l75443
$$ 377397881 376162949 375686073 375182266 374543114 373600311 372960892 372049789 371139069 370763626
3265.4C70763626p84569o81534P4311l86963l16124m78287j740799m61845l48396q82111
$$ 370763626 369979057 369297523 369371834 368984871 368668747 368190460 366449661 365987816 365639420 364757309
3275C64757309l5706o99272n39322q60061q75397J15242r62334q62274J70899q64411
$$ 364757309 364721603 364022331 363483009 362622948 361747551 361862793 360900459 360038185 360209084 359344673
3284.7C59344673j50528P46231j041107j116295r62219p27234p35626r71184J125984
$$ 359344673 359194145 359940376 358899269 357782974 356820755 356093521 355357895 354386711 355512695
3293.3C55512695K53373p18689n98336j010818N12352j87264j640396j427574o08978
$$ 355512695 355766068 355047379 354449043 353438225 353950577 353763313 352122917 350695343 350086365
3302C50086365o89278q24814J2169m06036j62888l21007p24487j78985m30260p93839
$$ 350086365 349397087 348572273 348584442 348178406 348015518 347694511 346970024 346791039 346360779 345566940
3311.7C45566940j035080r45282o89277J04370r25484j778221M71420M42391q06160
$$ 345566940 344531860 343586578 342897301 343001671 342076187 340297966 340769386 341211777 340405617
3320.3C40405617q78258o84853M5052m52805j484413j091804r78432j018066k88277
$$ 340405617 339527359 338842506 338887558 338434753 336950340 335858536 334880104 333862038 333573761
3329C33573761q88557j219483j053429o92710k03972j342011m84123M58794o39725
$$ 333573761 332685204 331465721 330412292 329719582 329515610 328173599 327689476 328148270 327508545
3337.7C27508545j214447k029839j524887j71203J70097K63863N79567o89126k541999
$$ 327508545 326294098 324264259 322739372 322568169 322738266 323002129 323581696 322892570 320350571
3346.4C20350571j011410p0686j998749k021351n43842m15211m79279L73535K77634
$$ 320350571 319339161 319268475 317269726 315248375 314704533 314289322 313810043 314183578 314461212
3355.1C14461212j453438j643963K26346M5509j242790p94239o74935j002826m85688
$$ 314461212 313007774 311363811 311590157 311635666 310392876 309598637 308923702 307920876 307435188
3363.7C07435188m40502j388264k434959j196365J040535K7027j054096q93136r66167
$$ 307435188 306994686 305606422 303171463 301975098 303015633 303042660 301988564 301095428 300129261
3372.4C00129261m57172p55024j12152l6469p07893l48378j098938j032447j334458
$$ 300129261 299672089 298917065 298804913 298768444 298060551 297712173 296613235 295580788 294246330
3381.1B94246330r89990K26498J583p668r68036n74189r02710j433315J028538J202412
$$ 294246330 293256340 293482838 293484421 293476753 292508717 291934528 291031818 289598503 290627041 291829453
3390.7B91829453l55702k575321j737728Q78467n49850j005917p3757J284828J148606
$$ 291829453 291473751 288898430 287160702 288039169 287489319 286483402 286409645 287694473 288843079
3399.4B88843079j207085j459484m83074N47008J84021k62775r36451j914444L70941
$$ 288843079 287635994 286176510 285693436 286240444 286424465 286161690 285225239 283310795 283681736
3408.1B83681736R20200L8624P6714m42486L10459l24211p37553M40998M90322m29630
$$ 283681736 284601936 284640560 284717274 284274788 284585247 284261036 283523483 283964481 284454803 284025173
3417.7B84025173k298965j348534J121044N51052K49577M51679m55112o62060n03197
$$ 284025173 281726208 280377674 281498718 282049770 282299347 282751026 282295914 281633854 281130657
3426.4B81130657r97639j23329K069931J021176n51167N35469o18286n66940J654930
$$ 281130657 280133018 280009689 282079620 283100796 282549629 283085098 282466812 281899872 283554802
3435.1B83554802P44934j11313J52264J59473k9087J87245j53370k54536J986504J216411
$$ 283554802 284299736 284188423 284340687 284500160 284471073 284658318 284504948 284250412 286236916 287453327
3444.7B87453327j96037J65977O73886P57713r82037L14866J234703J24149l95012
$$ 287453327 287257290 287423267 288097153 288854866 287872829 288187695 289422398 289546547 289151535
3453.4B89151535q18310J035042P40757P40852J939869J076699P90691k76356o70337
$$ 289151535 288333225 289368267 290109024 290849876 292789745 293866444 294657135 294380779 293710442
3462.1B93710442j75496P44973J448059O37989M10709M14429L91693O34747M12902
$$ 293710442 293534946 294279919 295727978 296365967 296776676 297191105 297582798 298217545 298630447
3470.8B98630447q9397J512566K534675P53136k81391l1548J52550m27113J378422
$$ 298630447 298541050 300053616 302588291 303341427 303060036 303028488 303181038 302753925 304132347
3479.5C04132347K671108R32923N97000j11008O7330R24224N35641N71995J719055
$$ 304132347 306803455 307736378 308333378 308222370 308289700 309213924 309749565 310321560 312040615
3488.1C12040615J577702Q70685L030110K003898j864834j565895N62287L05996R37118
$$ 312040615 313618317 314489002 317519112 319523010 317658176 316092281 316654568 316960564 317897682
3496.8C17897682K352486J163444J934624J159782n32684K29111N59463J568070M84238
$$ 317897682 320250168 321413612 323348236 324508018 323975334 324204445 324763908 326331978 326816216
3505.5C26816216P02171N98831k91977J407738J537704J295014P30781J470757J856270
$$ 326816216 327518387 328117218 327825241 329232979 330770683 332065697 332796478 334267235 336123505
3514.2C36123505K84423k40936Q95500L060303P07054n0812J945267R65920K60925
$$ 336123505 336407928 336166992 337062492 340122795 340829849 340779037 342724304 343690224 343951149
3522.9C43951149j132622j50490L383141L766823P99904n65644l93028L99704Q68378
$$ 343951149 342818527 342668037 346051178 349818001 350617905 350052261 349659233 350058937 350927315
3531.5C50927315J222038K937202J586762J278496J417846L37944J519127O76957J181373
$$ 350927315 352149353 355086555 356673317 357951813 359369659 359707603 361226730 361903687 363085060
3540.2C63085060J740952J967697J583938O90499J683540q8043N43632N96962N04609
$$ 363085060 364826012 366793709 368377647 369068146 370751686 370663643 371207275 371804237 372308846
3548.9C72308846J643219J877937L058739J688232Q07877p19109M28772K907295J729851
$$ 372308846 373952065 375830002 378888741 380576973 381384850 380665741 381094513 384001808 385731659
3557.6C85731659J809311Q35190R32274J131477K364921L203660J267013L034401J240768
$$ 385731659 387540970 388376160 389308434 390439911 392804832 396008492 397275505 400309906 401550674
3566.2D01550674k74391J308785P91740J184387l42292J392135K743378J765442Q20541
$$ 401550674 401276283 402585068 403376808 404561195 404218903 405611038 408354416 410119858 410940399
3574.9D10940399K428665L303681J727333K747688J289101o7406J730309L247108J356735
$$ 410940399 413369064 416672745 418400078 421147766 422436867 422369461 424099770 427346878 428703613
3583.6D28703613l57132M628640M084701L76930K109871l51066J143074K558403L052597
$$ 428703613 428346481 432975121 437059822 437436752 439546623 439195557 440338631 442897034 445949631
3592.3D45949631M74624L80516M133339Q34236K262879M691467K297974J788864J379318
$$ 445949631 446424255 446804771 450938110 451772346 454035225 458726692 461024666 462813530 464192848
3601D64192848K098007R03969R62181L816185L607102K092437M48761M178887J634483
$$ 464192848 466290855 467194824 468157005 471973190 475580292 477672729 478121490 482300377 483934860
3609.6D83934860j162452O057128K887078k29759L408737m61273M696922N933914K069778
$$ 483934860 482772408 488829536 491716614 491486855 494895592 494434319 499131241 505065155 507134933
3618.3E07134933K499466j359176M82521K733345K876663L782387L345413J929245
$$ 507134933 509634399 508275223 508757744 511491089 514367752 518150139 521495552 523424797
3626E23424797K749786P839165J374932j0745965M707833O749038N735055K785987
$$ 523424797 526174583 534013748 535388680 524642715 529350548 536099586 541834641 544620628
3633.8E44620628M39644K373085L651924L256722J429520K716903L211594K326088
$$ 544620628 545060272 547433357 551085281 554342003 555771523 558488426 561700020 564026108
3641.5E64026108J332969J807023L752937L842926N236206N25398k184562N855293
$$ 564026108 565359077 567166100 570919037 574761963 579998169 580523567 578339005 584194298
3649.2E84194298L819656m035110l216896O381225N042954K532386N554085k724380
$$ 584194298 588013954 583978844 580761948 587143173 592186127 594718513 600272598 597548218
3656.9E97548218J558838N094223R99221J389695L107185L938561Q26263Q52890K337341
$$ 597548218 599107056 604201279 605200500 606590195 609697380 613635941 614462204 615315094 617652435
3665.6F17652435J139031L413009k20985j275749N985145m319839O48384Q294105Q149720
$$ 617652435 618791466 622204475 621983490 620707741 626692886 622373047 623021431 631315536 639465256
3674.3F39465256O85119j5798378J155167Q838463O368561j205826r34601R61761M3641
$$ 639465256 640150375 624351997 625507164 634345627 640714188 639508362 638573761 639535522 639579163
3682.9F39579163K323150K236786R47724M310073O253891o790847l560715Q636093
$$ 639579163 641902313 644139099 645086823 649396896 655650787 648859940 645299225 653935318
3690.6F53935318m106216l479844L502121P33567J331634O30188N18418n32608j118317
$$ 653935318 649829102 646349258 649851379 650584946 651916580 652546768 653065186 652532578 651414261
3699.3F51414261L243484M904023l637085m106217N354233K942963J23825R17511K490844
$$ 651414261 654657745 659561768 655924683 651818466 657172699 660115662 660239487 661156998 663647842
3708F63647842K880249q122406N680466R062119j3345948O00815M262696J694183J586456
$$ 663647842 666528091 658405685 664086151 673148270 659802322 660403137 664665833 666360016 667946472
3716.7F67946472K936783J686935l242034k47117N248185q12760m943390M205475N45883
$$ 667946472 670883255 672570190 669328156 669081039 674329224 673516464 668573074 672778549 673324432
3725.4F73324432k675018k427139J095733M463730K319184Q434143M15420r238739
$$ 673324432 670649414 668222275 669318008 673781738 676100922 684535065 684950485 675711746
3733.1F75711746O640625k7313r919052l311615M006882L504943K425080J464691n964050
$$ 675711746 682352371 682325058 672406006 669094391 673101273 676606216 679031296 680495987 674531937
3741.8F74531937K301941J1062393p120514j4090882Q995972N952530O500244j419830
$$ 674531937 676833878 687896271 680775757 666684875 675680847 681633377 688133621 686713791
3749.5F86713791j4374313P864532q67386n498886N932541L192367P39060n453720
$$ 686713791 672339478 680204010 679336624 673837738 679770279 682962646 683701706 678247986
3757.2F78247986J745148O764755n107804l692321L890991J077194j169739L644333
$$ 678247986 679993134 686757889 681650085 677957764 681848755 682925949 681756210 685400543
3764.9F85400543o12945m367447K369613L992844n81665p730331K036209L723602Q05511
$$ 685400543 684787598 680420151 682789764 686782608 686200943 678470612 680506821 684230423 685035934
3773.6F85035934Q07801j624985n27115J621018L257141M47159p634278n19638K810059
$$ 685035934 685843735 684218750 683691635 685312653 688569794 689016953 681382675 680863037 683673096
3782.3F83673096K756195J372299l623276J80207K078857J77078M97360m65698k24151
$$ 683673096 686429291 687801590 684178314 684358521 686437378 686614456 687111816 686646118 686421967
3790.9F86421967j158371m81949M11682J474151L850174l059463m864121J413880N194015
$$ 686421967 685263596 684781647 685193329 686667480 690517654 687458191 682594070 684007950 689201965
3799.6F89201965Q933869o85959j2906342j840439K470551N578766Q439712o070251
$$ 689201965 698135834 697449875 684543533 682703094 685173645 690752411 699192123 693121872
3807.3F93121872j0573349J613769J544648J725845J316757p56454J907043O039200
$$ 693121872 682548523 684162292 685706940 687432785 688749542 687993088 689900131 695939331
3815.1F95939331m41132j3581771K989654O128922O065673L785325j6171875k263108
$$ 695939331 695498199 681916428 684906082 691035004 697100677 700886002 684714127 682451019
3822.8F82451019L999253J617660J733627J252900l386460j524124J694946L532563
$$ 682451019 686450272 688067932 689801559 691054459 687667999 686143875 687838821 691371384
3830.5F91371384L430710o610795M32892N691300o158753j675873P251587p226028
$$ 691371384 694802094 688191299 688624191 694315491 688156738 686480865 693732452 686506424
3838.2F86506424k781754J0858918l909150l925323O745453k24381n640106K03934
$$ 686506424 683724670 694583588 690674438 686749115 693494568 693270187 687630081 687834015
3845.9F87834015L99017p9269L575210N03846R34143N419159j314164K742920k0403213
$$ 687834015 688233032 688153763 691728973 692232819 693166962 698586121 697271957 700014877 679611664
3854.6F79611664j294327R889221l72162q75091K456512K849961K817993n865937k386474
$$ 679611664 678317337 688206558 687834396 686959305 689415817 692265778 695083771 689217834 686831360
3863.3F86831360O509781k982254o476898K119979M218064Q780670l493118j0804291
$$ 686831360 693341141 690358887 683881989 686001968 690220032 699000702 695507584 684703293
3871F84703293P70950K921753L065186p549057J089477L850479o22406J704941M678650
$$ 684703293 685474243 688395996 691461182 683912125 685001602 688852081 688229675 689934616 694613266
3879.7F94613266l026657q808212N633773L289261J485825L349838j1746521J361771
$$ 694613266 691586609 682778397 688412170 691701431 693187256 696537094 684790573 686152344
3887.4F86152344K306213J49613N123062K31476o576691R91745K349624l291549L16772
$$ 686152344 688458557 688608170 693731232 693962708 687386017 688377762 690727386 687435837 687752609
3896.1F87752609J406555K770157K791062j0099411L374633L906098m928284K148438
$$ 687752609 689159164 691929321 694720383 684620972 687995605 691901703 686973419 689121857
3903.8F89121857j786347j18103K024842r9411J93023N12467q3237j911469q62197
$$ 689121857 687335510 687217407 689242249 689142838 689335861 689848328 689765091 687853622 686991425
3912.5F86991425O74209m63409R08508L814316k369690k947846L672562j508331l094406
$$ 686991425 687665634 687202225 688110733 691925049 689555359 686607513 690280075 688771744 685677338
3921.1F85677338K183532K120591J861038k863922l929215J302490Q03147P61490j63117
$$ 685677338 687860870 689981461 691842499 688978577 685049362 686351852 687154999 687916489 687753372
3929.8F87753372k36587R12475k453766L76740J043320n01328J043854N36804J95618
$$ 687753372 687516785 688429260 685975494 686352234 687395554 686894226 687938080 688474884 688670502
3938.5F88670502q46024K46124K061539M11911l474045j987915J116867M29077J275559
$$ 688670502 687824478 688070602 690132141 690544052 687070007 685082092 686198959 686628036 687903595
3947.2F87903595q78449j114425J152267j89361P99255j388931q12836J982193o33392
$$ 687903595 687025146 685910721 687062988 686873627 687672882 686283951 685471115 687453308 686819916
3955.8F86819916j410904N48324K10343j304703J631088K137680q89206j107940o27594
$$ 686819916 685409012 685957336 686167679 684862976 686494064 688631744 687742538 686634598 686007004
3964.5F86007004L17535M9057P1869j40915k77481R23767J041947j01700j480179r69772
$$ 686007004 686324539 686373596 686445465 686304550 686027069 686950836 687992783 687891083 686410904 685441132
3974.2F85441132n7831J728821Q53118j878738r57107m01917O87714J361084r56879
$$ 685441132 685383301 687112122 687965240 686086502 685129395 684727478 685415192 686776276 685819397
3982.8F85819397j663742m0512J925888K395325p60270j783142Q33969M578J08337
$$ 685819397 684155655 684115143 686041031 688436356 687676086 685892944 686726913 686731491 686839828
3991.5F86839828Q42209l7613L68729p95288k53525j39084r46808N61371p59735
$$ 686839828 687682037 687644424 688013153 687217865 686964340 686825256 685878448 686439819 685680084
4000.2F85680084
$$ 685680084
##END=$$ End of the data block
