##TITLE=$$ Begin of the data block
##JCAMP-DX=5.00 $$ ACD/SpecManager v 10.08
##SPECTROMETER/DATA SYSTEM=Varian
##DATE=07 Jan 2013 10:37:20
##DATA TYPE=INFRARED SPECTRUM
##DATA CLASS=XYDATA
##ORIGIN=
##OWNER=
##NPOINTS=3735
##FIRSTX=399.26403809
##LASTX=4000.35498047
##MAXX=4000.35498047
##MINX=399.26403809
##MAXY=98.38694000
##MINY=5.27882862
##XFACTOR=1.0000000000
##YFACTOR=0.000000100000000
##FIRSTY=58.93033981
##DELTAX=0.96440572
##XUNITS=1/CM
##YUNITS=TRANSMITTANCE
##XYDATA=(X++(Y..Y))
399.3E89303398j14592857J8079796J01109123j08081856k2447357K47663536n4868088
406F56165695l7129288p9858932j47886734O9598541K1780396o0247193K7205010k5242653
413.7D24384842k2694473J0219955J5970917J66239319L89748840k39180450l01288186
420.5D43400764k5170402R1971168J40310097q3150291j84159737k7074127N325851
427.2C61453323M3509369P7756501k2445450L2786522n250168n4297219N0852852J7355995
434.9E01721725o1721534J0042190R4500809M4273834L3277092N0175934m3940163
441.7F28329887o5544738n0251732j9719200K4967193l3616104l5406265N6694908
448.4E05453949j901321r6625710j5267792R5995789Q6848259n0530396j6935501K1262474
$$ plain form
399.3 589303398 474710541 492790337 593899460 485817604 463370247 711033783 656165695
406 656165695 619036407 539177475 391290741 460889282 482669678 422422485 449627495 424384842
413.7 424384842 401690369 411910324 427881241 594120560 983869400 744688950 443400764
420.5 443400764 418230362 510201530 650511627 567361336 383201599 356127472 361453323
427.2 361453323 404962692 482719193 460273743 493060265 487810097 433512878 484365730 501721725
434.9 501721725 440000191 450042381 544543190 588817024 622094116 672270050 628329887
441.7 628329887 562785149 512533417 492814217 517781410 484165306 448759041 505453949
448.4 505453949 503552628 406926918 391659126 487654915 574503174 523972778 507037277 528299751
456.2E28299751P069397N7552986m5965042r4262504m5400429N9331856O8032264k5122184
463.9E09536095m4194603m78211O609802l4135169M9952926Q1053963p2414322p1128578
471.6D24801903J593513N1315880j6865501M718208K1311150l7554017K7522851K0455245
479.3D97299232q761634r433442P298928K8891525m9022026J4361610N4876175n697441
487E29812927n3453750l3430672K8933639k1106605n573502L2374153r963531M729996
494.7D72322655L2503204K2076988J2097321k2541619m3165779L2549134j456528p4922371
502.5D29463005J0576553K3498040J2413292m1504j1158333n14946J9164047M0206223
510.2E23606377j316719k5857010m0919304k1240807L9323158P960129l3854446l345719
$$ plain form
456.2 528299751 535369148 592922134 546957092 452694588 407294159 466626015 534658279 509536095
463.9 509536095 465341492 464863281 471473083 437337914 487290840 568344803 495930481 424801903
471.6 424801903 426395416 477711296 460845795 465564003 486875153 449321136 476843987 497299232
479.3 497299232 488537598 479104156 486403084 515294609 466272583 480634193 535510368 529812927
487 529812927 476359177 442928505 471862144 450755539 445182037 477556190 467592659 472322655
494.7 472322655 504825859 526902847 539000168 516458549 473292770 505841904 504385376 429463005
502.5 429463005 440039558 463537598 475950890 475909386 464751053 464236107 483400154 523606377
510.2 523606377 522289658 496432648 455513344 434272537 473595695 481555824 447701378 444355659
517.9D44355659M620820o790772l074531r612046J8241883L2941818K8529358J9700050
525.6E28912239n7642822k5577774L391113j3047295P906609J129608J1743775N139083
533.3D61954536j3428268j0060196l087311N612374j0554085J3047066K2245597M557114
541D70286827N529022k2197761l2064247p579499L6992607K5509682k3749809r625511
548.7D43101311K1287269R228669k5144387Q216477J8209648j9538880K325249M470558
556.5D62155914m396057L232193j2017021k82822K3333893k192383j9634666Q859978
564.2D59059029N019416l227081J158867j6641083J984215J9429474k38953l180313
571.9D63363571K127953o524506p298660j5764198k3750420Q153496J7581100J6073914
$$ plain form
517.9 444355659 448976479 442185707 439111176 429499130 447741013 480682831 509212189 528912239
525.6 528912239 471269417 445691643 449082756 436035461 443942070 445071678 456815453 461954536
533.3 461954536 448526268 438466072 435378761 440991135 430437050 443484116 465729713 470286827
541 470286827 475815849 453618088 421553841 413974342 450966949 476476631 452726822 443101311
548.7 443101311 464388580 473617249 448472862 456689339 474898987 455360107 457685356 462155914
556.5 462155914 457759857 460992050 448975029 448692207 472026100 469833717 450199051 459059029
564.2 459059029 464078445 460851364 462010231 445369148 447353363 466782837 466543884 463363571
571.9 463363571 465491524 458967018 451668358 435904160 412153740 420307236 437888336 453962250
579.6D53962250J9749374j222763j0991135j3462219p711601k320252Q765603J8803749
587.3D65573006l44162J0486870R363174j3090477p789497o033287J0322532Q731728
595D77219887j2343788q653489r783668n802765R196625J2812767j6220894k7719803
602.8D18704872L418961R790535m407235j2885894j6269303q625183j5006370k2538185
610.5C52182198j8022767r650917n041656q491726m571323J640358j110363l203335
618.2C03730469N43308Q72154o048050j5343742k1367569j6240044j234188J3830052
625.9B58742390K1308136J8823375J5062199K1360950K0677147R973030p407341j4570312
633.6C43969574n200272J775513k133446q398475p046280j6860314m652347K5957012
$$ plain form
579.6 453962250 473711624 472488861 461497726 448035507 440323906 438003654 446769257 465573006
587.3 465573006 465228844 475715714 485078888 471988411 464198914 458165627 468488159 477219887
595 477219887 464876099 456222610 446438942 440636177 449832802 462645569 446424675 418704872
602.8 418704872 422123833 431914368 427507133 414621239 398351936 389726753 374720383 352182198
610.5 352182198 334159431 324508514 319466858 310975132 306403809 308044167 306933804 303730469
618.2 303730469 304273777 305145931 299097881 283754139 262386570 246146526 244912338 258742390
625.9 258742390 280050526 298873901 313936100 335297050 355974197 365947227 358539886 343969574
633.6 343969574 338769302 340544815 338411369 330012894 322966614 306106300 301453953 327410965
641.3C27410965J4082184K0968132L7082977K1758385J5653534M602012Q69751J8447419
649D60875359J3766288K087403J0126648P824134o849708r7923J746101q708115O282082
657.7D87052269J7662315J362458r640656l915558L610115O414223J662331O049156
665.4E10256653J1369018n127258J2398300J65406k3700791r335327r176712O008644
673.2D92857933K3538361j272202j3019524m56810R038353l611679q064308Q840065
680.9E07850189J9944611Q532104j4535141q522987j57471r60922R254723N779800
688.6E27184906k1256065k2550087K094993J4062996J4402161l828812l340988K016563
696.3E08785667j0512199K3499k922249k81411J829224p310943O349639M630509M14162
$$ plain form
641.3 327410965 341493149 362461281 399544258 421302643 436956177 441558189 442427940 460875359
649 460875359 474641647 476729050 486855698 494679832 487830124 487732201 489478302 480770187 487052269
657.7 487052269 504714584 506077042 496436386 492520828 496130943 502545166 504207497 510256653
665.4 510256653 521625671 516498413 528896713 529062119 505361328 496026001 486849289 492857933
673.2 492857933 516396294 515124092 502104568 501647758 510686111 507074432 499010124 507850189
680.9 507850189 527794800 536326904 521791763 513268776 513111305 512150383 521405106 527184906
688.6 527184906 505928841 483378754 485473747 499536743 513938904 510110092 506769104 508785667
696.3 508785667 498273468 498296967 495374718 495093307 496922531 489611588 495961227 500591736 501005898
705E01005898p421151m350547J0931472k576103j400642J3328056P711639j0856781
712.7E06371841n941505J8301353J1621666k888984j304055Q91076M955673N310592
720.4E37317657m685745k570877o28548r085197k369423K413063J067734k327156m222336
729.1E14909172O288986N194245j923066l729209q88100N510025k840386n307464P385139
737.8E24599342J535454q399773p572059r357224L979645K0138664J2658196k754631
745.5E34827614n895081l174476r81369Q847808R642869L100204J990395O477775P461548
754.2E62297287j03188N006981m531860j0299568J1676864R036751n910225k902717
761.9E64270325K135467k888908k137489Q606338N987511p742958j1115990O403503
$$ plain form
705 501005898 493584747 489234200 500165672 497589569 496188927 509516983 517228622 506371841
712.7 506371841 500430336 518731689 530353355 527464371 526160316 527051392 532007065 537317657
720.4 537317657 532631912 530061035 529432487 520347290 517977867 520390930 521458664 519131508 514909172
729.1 514909172 521198158 526392403 524469337 520740128 519852028 525362053 522521667 517214203 524599342
737.8 524599342 526134796 517735023 510162964 500805740 504785385 524924049 537582245 534827614
745.5 534827614 528932533 525758057 524776688 533624496 543267365 546367569 548357964 554835739 562297287
754.2 562297287 562194099 567201080 562669220 552369652 564046516 573083267 567173042 564270325
761.9 564270325 566405792 563516884 561379395 569985733 575973244 568230286 557114296 563517799
769.6E63517799J1378708l253708m552803j289901k024002M815521J1297798N967178
777.3E85856590N391236K69355m041290O482811M257813L156738K376060n122833k523689
786E96102791K969208R551963j484260p567101O943779n52711r989281K08702J4266548
794.7F10449638J2399369j0256119p684517N171356n062752n474510J649170J778412
802.4F02970047O361809O809845l113632k008896N079116k713737r645844n332489
810.1E98406219L023224j184234l632698N048523K542610N900230p94716q235054O848221
818.8F07922325L924599k703171l735008K209053P364426p845040o980286K985077
826.5F03141975J635819k278328j144753m17137n980339l701935o114807q258552m578324
$$ plain form
769.6 563517799 574896507 571642799 567089996 565800095 563776093 568591614 579889412 585856590
777.3 585856590 591247826 591517181 587475891 593958702 598216515 601373253 603749313 598626480 596102791
786 596102791 599071999 608623962 607139702 599572601 606516380 605963669 595974388 596183090 610449638
794.7 610449638 622849007 612592888 604908371 610079727 605016975 599542465 601191635 602970047
802.4 602970047 609331856 616141701 613028069 611019173 616098289 613384552 603738708 598406219
810.1 598406219 601429443 600245209 596612511 601661034 604203644 610103874 609309158 601074104 607922325
818.8 607922325 611846924 609143753 605408745 607617798 614982224 607137184 600156898 603141975
826.5 603141975 604777794 602499466 601354713 600937576 594957237 591255302 585140495 576881943 572303619
835.2E72303619n027694l594437m767685n103912m598198Q76388N434113K424812k289238
843.9E55657768j1145744r279404m186096J449966N572472P86705Q059235O312637
851.6E53227539m354286K183037M494972N105133R323730M784432J835785j827088
859.3E74773254j867714P998124O321830J0376J222382K89459j56860J897468O122208
868E96610527M177094j069031l257904o228028L483010J0238495N907249L978119k285194
876.7F11554337k476578j576805o724396j0080872o298408M688873M969788N1994k793159
885.3E91314774l791848o59790l623810l522071K81448K033310K132072m096222m301109
894E75766754K976303K397080n720597n02624O892738l756218l886680J11885k867050
$$ plain form
835.2 572303619 567275925 563681488 558913803 553809891 549211693 550088081 555522194 557947006 555657768
843.9 555657768 544512024 535232620 531046524 532496490 538068962 538855667 546914902 553227539
851.6 553227539 548873253 551056290 555551262 560656395 569980125 574764557 576600342 574773254
859.3 574773254 572905540 580903664 587225494 587235870 588458252 588747711 588590851 590488319 596610527
868 596610527 600787621 599718590 596460686 590232658 593715668 603954163 609861412 613839531 611554337
876.7 611554337 609077759 607500954 600776558 590695686 584397278 589086151 594055939 594107933 591314774
885.3 591314774 587522926 586863136 583239326 579717255 579998703 582032013 584164085 580067863 575766754
894 575766754 578743057 581140137 575419540 574916916 581809654 578053436 574166756 574278641 571411591
902.7E71411591R31854Q4991J363831m53186m224777J199951j04294l246460o193123
911.4E60770378m554977m461251j0972061n761795R40933M140053m486885j0034294
919.1E25580101j265526m029846j045914r98916q676453o854324p282677J126289O886444
927.8E03439178L882828Q12721o516304k451095J243362J676903M839439J759644L798676
936.4E12485352O175804J204910j04256N846978N839424J692581O083946Q567162O566963
945.1E54358864J552734p33681N104065K745934j828384K143669K384109N26962O86989
953.8E66941261K979355M148064k957001n479088m705887o065254P83539N77011p938728
962.5E48283272n952683P79190J63002p073784m824485m07067m461326j997910r76143
$$ plain form
902.7 571411591 572343445 572428436 573792267 573339081 569114304 570314255 570209961 566963501 560770378
911.4 560770378 556215401 551754150 540782089 535020294 535961227 540101280 535614395 525580101
919.1 525580101 524314575 520284729 519238815 518239899 509563446 502709122 495426445 496552734 503439178
927.8 503439178 507322006 508134727 501618423 499167328 500410690 502087593 506927032 508686676 512485352
936.4 512485352 518661156 519866066 519761810 525608788 531448212 533140793 539224739 547791901 554358864
945.1 554358864 555911598 555177917 560281982 563027916 561199532 563343201 565727310 566254272 566941261
953.8 566941261 569920616 574068680 571111679 565632591 560926704 554861450 555644989 556222000 548283272
962.5 548283272 542330589 543109779 543272781 536198997 531374512 530967445 526506119 524508209 523532066
971.2E23532066l273964j901817J494827K026177n951882l083953O44683l613968J214409
979.8E11086578j02272m812736k708321k647209k895279O20728J100196p157440r204521
988.5D83279724o514892o725922l938446o458626j2911034j7662429k1999321j6695557
996.2C90373497L01819J5416908J7393227R278717O870651Q450012N315933j074523
1004D52326241p954255n196189N009918N135689k94114l625488l749428K364731J578369
1012.6D45595474p350311j1305046p788086o06422M319801K256965p133216r064560
1020.3D08924599l861008l154869K287064j18256p922096j314011M34685n804939p333336
1029C82137833l500710Q30307m272346n773201L240738Q12377n437850j114350J183663
$$ plain form
971.2 523532066 520258102 518356285 519851112 521877289 515925407 512841454 513486137 509872169 511086578
979.8 511086578 510984306 506171570 503463249 500816040 497920761 498541489 499641685 492484245 483279724
988.5 483279724 476764832 470038910 466100464 459641838 446730804 429068375 407069054 390373497
996.2 390373497 390675316 406092224 423485451 432764168 439634819 448084831 453400764 452326241
1004 452326241 444371986 439175797 444185715 449321404 449027290 445401802 441652374 444017105 445595474
1012.6 445595474 438245163 426940117 419152031 418545609 422865410 425122375 417989159 408924599
1020.3 408924599 405063591 401908722 404195786 404077530 396155434 394841423 395276108 389471169 382137833
1029 382137833 378637123 379467430 375195084 369421883 372662621 373474998 368037148 366922798 368106461
1037.7C68106461k49100n184364n350800J072311K34490j912918K96669J269569l220978
1046.4C55061340k964325L107033K796326L034248L085518l313103o13403N797653
1054.1C65991287L01934j371041k839432n142822J675301M259453R2430l256684J569710
1062.8C61280136R41773n444718m023743m17785J665115p13196J213723k370530m470443
1071.5C47660332K145881J06583J107712L69301O77452l986435j0610352l036842L14865
1080.1C34748497J348343k147827m373513p16400K8763k543640m773216P30247l62663
1088.8C21938591p409363j2223873l779697n86205j3057308p337170n196285j3848705
1096.5B58499985j7141819j2508240j1380444j7020626p613144m407749p445755j1487236
$$ plain form
1037.7 368106461 367857361 362672997 357322197 358394508 358628998 356716080 357012749 358282318 355061340
1046.4 355061340 352097015 355204048 358000374 361034622 364120140 360807037 360193634 365991287
1054.1 365991287 366293221 364922180 362082748 356939926 358615227 362874680 362967110 359710426 361280136
1062.8 361280136 362221909 356777191 352753448 352335663 354000778 353287582 354501305 352130775 347660332
1071.5 347660332 349806213 349912796 351020508 351389809 352067261 348080826 337470474 334433632 334748497
1080.1 334748497 336096840 333949013 329575500 328859100 328887863 326344223 321571007 322301254 321938591
1088.8 321938591 314529228 302305355 298525658 297939453 284882145 277544975 272348690 258499985
1096.5 258499985 241358166 228849926 217469482 200448856 192835712 188427963 180982208 169494972
1104.2A69494972j2779732o840276n004721o131954j4481201j2192364n982733m102297
1112A01979694m393978j755476K753935k684841q36077j034965M96187L12290j926489
1120.6I2910280J925307J530180J928520l111067Q87613K953415j36948K081624K091369
1129.3A03060293L490534j396646j104861k948503k318020j395807o876154l471823
1137H7039013m294558k925915m418564l527694k93770j076264J029801n09314j691189
1145.7F9331546p089949j123509J752262l301087k734646m046331J448684P9269J12157
1154.4E4428396J395421K737069K818633p10979Q70042k027164M265929O153617M468665
1163.1G4399629L429675O68039K177134j746917K495150M048901N944405M353351L315411
$$ plain form
1104.2 169494972 156715240 149874964 144870243 138738289 124257088 112064724 106081991 101979694
1112 101979694 97585716 95830240 98584175 95899334 95063257 94028292 94524479 94836769 92910280
1120.6 92910280 94835587 96365767 98294287 95183220 96070833 99024248 98887300 100968924 103060293
1129.3 103060293 106550827 105154181 104049320 101100817 98782797 97386990 90510836 87039013
1137 87039013 82744455 79818540 75399976 71872282 71578512 70502248 71532049 71022735 69331546
1145.7 69331546 62241597 61118088 62870350 59569263 56834617 52788286 54236970 54316239 54428396
1154.4 54428396 55823817 58560886 61379519 60668540 61538582 59511418 63777347 69930964 74399629
1163.1 74399629 77829304 78497343 80674477 78927560 81422710 85471611 91416016 95769367 99084778
1171.8I9084778J0619964N532341M868069N671625R580555J0642538L277207L146677
1179.5A52423754O881199J0473814Q177662P836494N251961O281662Q591480N044003
1187.2B10962029O899852O139908O775761N536346O361084R427185N338230L073368
1194.9B60513763N212822Q358498N716114N712586O247444M238300N794601P854157
1202.6C09648285Q688679O725139O849366N332908M386826L016472L765258Q096123
1210.3C56509056M460182M223328N097465K982865L170090L542938L908119J434555
1218C85328598k49443Q43315K429504k88352K73590M465179K814751J900139Q0261
1226.7C97597542j548004P05757K306633l74222l57780K809982J527862J646195Q60672
$$ plain form
1171.8 99084778 109704742 115237083 120105152 125776777 135357332 145999870 149277077 152423754
1179.5 152423754 159304953 169778767 177956429 185792923 191044884 197326546 205918026 210962029
1187.2 210962029 217861881 224001789 230777550 236313896 242674980 252102165 257440395 260513763
1194.9 260513763 265726585 274085083 279801197 285513783 291761227 295999527 301794128 309648285
1202.6 309648285 318336964 325062103 331911469 337244377 341631203 344647675 348412933 356509056
1210.3 356509056 360969238 365192566 370290031 373272896 376442986 379985924 383894043 385328598
1218 385328598 385079155 385922470 388351974 388063622 388337212 392802391 395617142 397517281 397597542
1226.7 397597542 396049538 396755295 399061928 398687706 398329926 401139908 402667770 404313965 405174637
1235.4D05174637n77278k959938m75121O581001L358040j33819n15099J349297J871833
1244.1D13673553n78346Q6937M00467L264618K635460N63431K18239o61850Q16230
1252.8D20418739L82004P30286R24568J691360K328148k96669k049560M01077L211937
1261.4D27741890J8959r4528K427063L181076K849006R93882P90405Q61626K606086
1270.1D41375465K043953j257629q18214K371444M885636L677177J046448K088089
1277.8D55412369N000725L493423M73824M61311M282684M097862P26853L033256K397194
1286.5D79379501J503601L018151L489799L709221J361923R06754J202850J127281
1294.2D95699081K894135M680977K415085J219139L848495K238274J878242J829262
$$ plain form
1235.4 405174637 404597359 401637421 401162300 407743301 411101341 410967522 410452423 411801720 413673553
1244.1 413673553 413095207 413182144 413582611 416847229 419482689 420046120 420264359 419602509 420418739
1252.8 420418739 420800743 421531029 422455597 424146957 426475105 426178436 424128876 424529953 427741890
1261.4 427741890 427760849 427666321 430093384 433274460 436123466 437117348 437907753 438769379 441375465
1270.1 441375465 443419418 442161789 441343575 443715019 448600655 452277832 453324280 455412369
1277.8 455412369 460413094 463906517 464380341 464841652 469124336 473222198 473949051 476982307 479379501
1286.5 479379501 480883102 483901253 487391052 491100273 492462196 493368950 494571800 495699081
1294.2 495699081 498593216 503274193 505689278 506908417 510756912 512995186 514873428 516702690
1301.9E16702690m30946Q10394J793137J287727J032524R16367K074241L005715N82504
1310.6E27774353q93593L97415K379952K065277p85141J09253J639824K122154k41508
1319.3E34567986j912384K740936L008346O85273m08974J353035L451423J932869J986962
1328E47405472j042137j847992J095237j01127K94723P53250O55175J052665l40194
1336.7E47925072q80699m55590j097297o79589J047783Q7280J225930J993713j219635
1345.3E47946968o55823k59018k018585p2594J416169m76189j568718j595802j712151
1354E41004257r02443q91494j93825J215172P76519j25389k2087l31650k021675l64189
1363.7E38143196J039314l18794q32291j847419j357422l96080j900597k423477l9368
$$ plain form
1301.9 516702690 516271744 517082138 518875275 520163002 521195526 522111893 524186134 527191849 527774353
1310.6 527774353 526880760 527278175 529658127 531723404 530938263 531047516 532687340 534809494 534567986
1319.3 534567986 532655602 535396538 538404884 539090157 538681183 540034218 543485641 545418510 547405472
1328 547405472 546363335 544515343 545610580 545509453 545804176 546557426 547212601 548265266 547925072
1336.7 547925072 547044373 546588783 545491486 544811897 545859680 545946960 547172890 549166603 547946968
1345.3 547946968 547291145 547032127 545013542 544940948 546357117 545880928 544312210 542716408 541004257
1354 541004257 540101814 539210320 539016495 540231667 541008186 540882797 540860710 540529060 538507385 538143196
1363.7 538143196 539182510 538863716 538031425 536184006 534826584 534430504 532529907 530106430 530067062
1372.3E30067062J629219j208763k989921N01327K421417m63714l472710l055839p58667
1381E22669411K154541M52079k689514r60083K329140R61266p96166Q76274m88662
1389.7E24508286Q34465L266487J952934J116142m58679l879623m309731j414795K775955
1398.4E24391441M50631j286889N1575k374954k218094K4376r24339l478432k387085
1407.1E12248230J175728K200203p2365j272049m3182Q36143o14929j615067n32684
1415.7E12310028n07049p47719L921013R38415m421997Q04062o52046j193085o9084
1424.4E10382538J947403L888550J602554J619568J997185k064057k341003P34634
1432.1E17767372K430802J488952J250534R28765k635460K182655L852844R11179r85565
$$ plain form
1372.3 530067062 531696281 530487518 527497597 527998924 530420341 529956627 526483917 523428078 522669411
1381 522669411 524823952 525276031 522586517 521626434 523955574 524916840 524120674 524996948 524508286
1389.7 524508286 525342751 528609238 530562172 531678314 531219635 527340012 523030281 521615486 524391441
1398.4 524391441 524842072 523555183 523606758 521231804 519013710 519038086 518113747 514635315 512248230
1407.1 512248230 513423958 515624161 515551796 514279747 514236565 515072708 514457779 512842712 512310028
1415.7 512310028 511802979 511055260 514976273 515914688 511492691 512296753 511644707 510451622 510382538
1424.4 510382538 512329941 516218491 517821045 519440613 521437798 519373741 517032738 517767372
1432.1 517767372 520198174 521687126 522937660 523866425 521230965 523413620 527266464 528177643 527192078
1440.8E27192078m7837K823944K740517J39847K844353K466545j887627k012672J028251
1449.5E35287399J132660K52304J813584K309837K345009K592316L798103K198906
1457.2E51730118k843056J053162o14319K062454K398300l09791M36248M21181L061752
1465.9E57396049J645852J192779J602059J253547J932526L99933L064041M487266
1473.6E72974052K349740K426109J356506L085442L451538J172905N43289K238960
1481.3E89598541K004242J341973O38160J313133K450867m126968j907692P204170
1489E98516426J587372k796364m36325j152611n16662N79795N48592k759628M71344
1497.7E94041939j205864m299545k113572j11045K42576l067703J502991N260849j0174561
$$ plain form
1440.8 527192078 527144241 529968185 532708702 532848549 535692902 538159447 536271820 534259148 535287399
1449.5 535287399 536420059 536672363 538485947 540795784 543140793 545733109 549531212 551730118
1457.2 551730118 548887062 549940224 549325905 551388359 553786659 553476868 553913116 554334297 557396049
1465.9 557396049 559041901 560234680 561836739 563090286 565022812 565422745 568486786 572974052
1473.6 572974052 575323792 577749901 579106407 582191849 585643387 586816292 587359581 589598541
1481.3 589598541 591602783 592944756 593582916 594896049 597346916 593219948 591312256 598516426
1489 598516426 600103798 597307434 596871109 595718498 595201836 595781631 596330223 593570595 594041939
1497.7 594041939 592836075 588536530 586422958 586311913 586554489 583486786 584989777 590250626 580076065
1506.4E80076065j2869911Q360329K235374q017578l840904k195168n28068J136932
1514.1E64357071o64253J166763J521187o553497k446366L214760L329353l245468
1521.8E60679550m945869j018143J499367k288437q24547k21443R04922j343269l386154
1530.5E49055977l528900m041062J646386j72272j743279k649154j045494L357772
1538.2E40879974j0009155k621231Q290482k89269p80487J543503J19781m865951j40724
1546.9E32126923Q35113K074814k037315j689644N331344J518212m47121N83534L571511
1555.6E41867371L029975M342423K870941p861786R561730q69675j148567L94478J26762
1564.2E52313652l019562p17125J861878M59594J509553j794663P6447O79664l73573
$$ plain form
1506.4 580076065 567206154 575566483 577801857 569784279 565943375 563748207 563220139 564357071
1514.1 564357071 563692818 564859581 566380768 559827271 557380905 560595665 563925018 560679550
1521.8 560679550 555733681 554715538 556214905 553926468 553101921 552880478 553785400 552442131 549055977
1530.5 549055977 545527077 541486015 543132401 542960129 541216850 538567696 537522202 540879974
1538.2 540879974 530870819 528249588 536540070 536250801 535470314 537013817 537133598 532267647 532126923
1546.9 532126923 532962036 535036850 532999535 531309891 536641235 538159447 537712326 538295860 541867371
1555.6 541867371 544897346 549239769 552110710 544248924 553810654 552940979 551792412 552186890 552313652
1564.2 552313652 549294090 548576965 550438843 550898437 552407990 550613327 550689774 551369438 550995865
1572.9E50995865k68250n06477J034241o548462J636581K18354k493248o78063l029327
1581.6E40361214k387047j639519k7733l199310m036560j192932k062454k189522m350357
1590.3E19275780k351799m492989l513718j392097k560120l019142n744552m21601
1598D95779762k102852m130935l594933m036102k744446l803406j396408l291435k241364
1606.7D68437881l740348k875939j896820n351639k829895n702896k050094m41704
1614.4D43548546j001740n032959q243255L859749k622223k211190k540054o00853
1622.1D25156021k571678m397850M28123m529266n69611j635360k550240j984863j756096
1630.8D05589180o26564k642937J507607P04155j335411m994088j009178n58357l30086
$$ plain form
1572.9 550995865 550727615 550221138 551255379 544706917 546343498 546561852 544068604 543390541 540361214
1581.6 540361214 537974167 536334648 536306915 533107605 529071045 527878113 525815659 523626137 519275780
1590.3 519275780 516923981 512430992 508917274 507525177 504965057 501945915 496201363 495779762
1598 495779762 493676910 489545975 485951042 481914940 479170494 475367088 473970680 470679245 468437881
1606.7 468437881 464697533 461821594 459924774 454573135 451743240 446040344 443990250 443548546
1614.4 443548546 442546806 437513847 429270592 433130341 430508118 428296928 425756874 425156021
1622.1 425156021 422584343 418186493 418614616 414085350 413515739 411880379 409330139 407345276 405589180
1630.8 405589180 404962616 402319679 403827286 404531441 403196030 398201942 397192764 396634407 396304321
1639.5C96304321J374283k154503J218529j539192K42424L374176J336479M331512
1647.2D04488029l907279j057892q46978L753014P392616j225357p550621R98726M329376
1655.9D06373634K390747L395806N53741J473923K194633Q82798O358566J686783J650657
1664.5D26961288L54729J003227L746453L889808N056649J072349N453377K045898
1672.3D49583778K234917K640648j049919M720344M741364L549766K342148N323944
1680D74086990L556176L111686M081841l33595J1477851j270256J842766K313042K224502
1688.6E01091003M828797L033943M525185M360237N591430O472588M631653L010444
1696.4E37545280M173737M295387L447686O3743N563698P498283O588173O864090K897759
$$ plain form
1639.5 396304321 397678604 395524101 396742630 395203438 395445862 398820038 400156517 404488029
1647.2 404488029 400580750 399522858 398675880 402428894 409821510 408596153 401045532 402044258 406373634
1655.9 406373634 408764381 412160187 412713928 414187851 416382484 417265282 423623848 425310631 426961288
1664.5 426961288 427316017 428319244 432065697 435955505 441012154 442084503 447537880 449583778
1672.3 449583778 451818695 454459343 453409424 458129768 462871132 466420898 468763046 474086990
1680 474086990 477643166 480754852 484836693 484503098 495980949 494710693 496553459 498866501 501091003
1688.6 501091003 505919800 508953743 513478928 517839165 523430595 529903183 534534836 537545280
1696.4 537545280 541719017 546014404 549462090 549525833 555089531 562587814 569175987 576040077 578937836
1705E78937836J19362L425941N807228N857887N015335Q54302J10359L880501L452072
1713.7F07460823L20816K509499M995231O310120k529335R09004L327179J165466L000298
1722.4F27469101M112892J32103q98132P93266J034470N36537J614685J809807J725998
1731.1F38330727K369575K001648J213913n548820N70831L470268M190903N494308
1738.8F52093353K15912l300781L288727K501068J010818K191315L595505K573166
1746.5F64169083J879425K207412J488724L844986L59039M22135M333114K712174K569656
1755.2F83985748K334366j104126N28031L488693K101135J953964j48697j710128K070388
1763.9F93499374J984177J105576O67266J889954J625443J110839J998444m72412q38394
$$ plain form
1705 578937836 579057198 582483139 588290367 594148254 599163589 600017891 600128250 604008751 607460823
1713.7 607460823 607781639 610291138 615286369 621596489 619067154 619976158 623303337 624468803 627469101
1722.4 627469101 631581993 631714096 630815964 631609230 632643700 633180237 634794922 636604729 638330727
1731.1 638330727 640700302 642701950 643915863 638367043 638937874 642408142 646599045 652093353
1738.8 652093353 652309265 649008484 652297211 654798279 655809097 658000412 661595917 664169083
1746.5 664169083 666048508 668255920 669744644 673589630 673948669 674370804 678703918 681416092 683985748
1755.2 683985748 686320114 685215988 685744019 689232712 691333847 693287811 693139114 691428986 693499374
1763.9 693499374 695483551 696589127 697256393 699146347 700771790 701882629 703881073 703408661 702570267
1772.5G02570267j85013J865387J051712P1716J544037K34757J458663J232529q51211
1781.2G08992844N18188J752319J619645k83890l08685Q73794J260986P54624J365738
1789.9G16545563P52182n8747o86264j211547K233657K098389Q38699L85514J143264
1798.6G22040710N35508j698456J528931J8081r86099J92718P00760J371460m80423
1807.3G23223190M13895J388245O60171j011276J95007J656418R59320L78723j519623
1815.9G26344070O91224N91507j069718Q69141K53753O06766P42264J556854J463013
1824.6G32048874k073517m56009J068878J507798k89383k353897J948471M26635r40857
1833.3G30886993J723099J832962J293106k48718n27039J408997j091614j367492L09066
$$ plain form
1772.5 702570267 702385254 704250641 705302353 705374069 706918106 707152863 708611526 709844055 708992844
1781.2 708992844 709511032 711263351 712882996 712599106 712290421 713164215 714425201 715179825 716545563
1789.9 716545563 717297745 717238998 716552734 715341187 717574844 719673233 720511932 720897446 722040710
1798.6 722040710 722576218 720877762 722406693 722424774 721438675 721631393 722332153 723703613 723223190
1807.3 723223190 723637085 725025330 725685501 724674225 724869232 726525650 727484970 727863693 726344070
1815.9 726344070 727035294 727626801 726557083 727426224 727679977 728286743 729029007 730585861 732048874
1824.6 732048874 729975357 729519348 730588226 732096024 731806641 729452744 731401215 731827850 730886993
1833.3 730886993 732610092 734443054 735736160 735487442 734960403 736369400 735277786 733910294 734219360
1842G34219360K193070J291656m897537J095429K403335J040268M46243k00195q77228
1850.7G36714401j056518O6528m69513m2877J80588J639709J317673j031189K83279
1859.3G37602081j34887Q23593Q04291q16269N58929J711426J143722j306381l00140
1868G40086365K85797j053620o27365K22245J548919L22876O27671R22546J06430J40076
1877.7G42581940p17087j421585p25708P15866R90372J153106k33154k48032R27811
1886.3G43023529k16751r92M73099Q64334J75400j356888k574081p69730J982803R03473
1896G42504196P82318J01776j041183n45960L69721J969833M23584j695327o88401
1904.7G42180557L93296n0354n0889p41043J1826J795578M24576k54441q72955l90549
$$ plain form
1842 734219360 736412430 737704086 732806549 733901978 736305313 737345581 737791824 737591629 736714401
1850.7 736714401 735657883 735724411 735254898 735212021 735392609 737032318 738349991 737318802 737602081
1859.3 737602081 737467194 738290787 739095078 738278809 738837738 740549164 741692886 740386505 740086365
1868 740086365 740372162 739318542 738691177 738913422 740462341 740785217 741412888 742335434 742441864 742581940
1877.7 742581940 741864853 740443268 739717560 740433426 741423798 742576904 742343750 742095718 743023529
1886.3 743023529 742806778 742805786 743278885 744143219 744318619 742961731 740387650 739617920 741600723 742504196
1896 742504196 743286514 743388290 742347107 741801147 742170868 744140701 744564285 742868958 742180557
1904.7 742180557 742573853 742523499 742472610 741731567 741743393 743538971 743963547 743709106 742836151 742445602
1914.3G42445602o49948P62558L137360j375580r08127J581650L44391j84555j241379
1923G43911972q08563r24988j46255O60324O38580K64664n43900Q1101L22570j983
1932.6G43453522j340027n15976J21689l85971N78155m11758L32641J034012P59125
1941.3G43625412J152267k107391j886902Q44879N22004o31104P00302J107407O8970
1950G43395844P4081p35779j268005Q6288P27997P73392J52511j252441j22528L86658
1959.6G42218018k92283Q84934K85416j320801m80576Q82645J3275R3460l04413r91211
1969.3G40988464M36173m61426k08664n38330n61829J268006r15909o256J046142j114196
1978.9G39932175q25196R55735K110366J28479j478271o63834l2425j390457j218719
$$ plain form
1914.3 742445602 741795654 742558212 745695572 744319992 743411865 744993515 745337906 745153351 743911972
1923 743911972 743103409 742178421 742032166 742692490 743331070 743595734 743051834 743132935 743455505 743453522
1932.6 743453522 742113495 741597519 741719208 741333237 741911392 741499634 741832275 742866287 743625412
1941.3 743625412 744777679 742670288 740783386 741628265 742150269 741519165 742219467 743326874 743395844
1950 743395844 743469925 742734146 741466141 741552429 742280426 743053818 743206329 741953888 741831360 742218018
1959.6 742218018 741925735 742810669 743096085 741775284 741294708 742177353 742190628 742284088 741979675 740988464
1969.3 740988464 741424637 740963211 740754547 740216217 739654388 740922394 740006485 740000229 741046371 739932175
1978.9 739932175 739106979 740062714 742173080 742301559 740823288 740159454 740127029 738736572 737517853
1987.6G37517853L09524p02667M39530N10025N5923J288528N5314J57699m95911p63168
1997.2G38372650L59497k85873R64508O79092j795578j473999J34659J282044j92948
2005.9G38044052q79440J314468P99561j063156j477433l7841J190338J20620J46409
2014.6G38157578L85818j045227j801224J46637P82242p48444j55487j38626o8893
2023.3G35514374J311111l9825j282273k09198L80097m92172j168900k74200L03497
2032G34042511p553P92160Q21991n95398j085739r59549q21076j65100N06363K21024
2041.6G32749634N78460J221j168594k36588L28751R39484M5776k73895J270980J50757
2051.2G34385986n34744j362839k364273j117782K16293L44772L54081O58874n9204
$$ plain form
1987.6 737517853 737827377 737124710 737564240 738074265 738130188 739418716 739474030 739631729 739135818 738372650
1997.2 738372650 738732147 738446274 739410782 740089874 738294296 736820297 736954956 738237000 738044052
2005.9 738044052 737164612 738479080 739278641 738215485 736738052 736700211 737890549 738011169 738157578
2014.6 738157578 738543396 737498169 735696945 735843582 736625824 735877380 735721893 735583267 735514374
2023.3 735514374 736825485 736785660 735503387 735294189 735674286 735182114 734013214 733739014 734042511
2032 734042511 734034958 734827118 735649109 735053711 733967972 733008423 732187347 732022247 732528610 732749634
2041.6 732749634 733328094 733329315 732160721 731924133 732252884 733192368 733238144 732964249 734235229 734385986
2051.2 734385986 733851242 732488403 730124130 729006348 729222641 729567413 729921494 730580368 730521164
2059.9G30521164P39899L91998j871414j502075K28729N28564j009598n73043m44336
2068.6G27009888K7160J114426r62982m24805j26037j536789l38746J38016m99725
2077.3G24400406n25971K94037n98983j925278j639252r19495J426239J708146n84641
2086G21635208j105270o88095P13348J501465L01590J71585P15790J57165j389389
2094.6G22013397j600799q54645L2349K170257J273117K11182J335220K30560j269760
2103.3G23540878j335373J80664P05948J106263J109771q29162P06787K004165j40991
2112G27048950j515808j281280k37732O30722J087341R20029l88794j040650P38983
2120.7G25961761N19639n70450n5542q21686l54538j87988q30155J99204O83975k1973
$$ plain form
2059.9 730521164 731261063 731653061 729781647 728279572 728508301 729036865 728027267 727454224 727009888
2068.6 727009888 727037048 728151474 727188492 726763687 726637650 725100861 724762115 724900131 724400406
2077.3 724400406 723874435 724168472 723569489 721644211 720004959 719085464 720511703 722219849 721635208
2086 721635208 720529938 719841843 720555191 722056656 722358246 722529831 723245621 723402786 722013397
2094.6 722013397 720412598 719557953 719590302 721760559 723033676 723244858 724580078 724810638 723540878
2103.3 723540878 722205505 722386169 723092117 724198380 725308151 724478989 725185776 727189941 727048950
2112 727048950 725533142 724251862 724014130 724644852 725732193 726652222 726263428 725222778 725961761
2120.7 725961761 726481400 725910950 725855408 725033722 724679184 724491196 723661041 723860245 724544220 724522247
2130.3G24522247n59311q64944n50232J043930J333389P49741l84827m95605M31213
2139G25225601k69394M24347k86712o78483J177292J919251J286621j080933n74722
2147.7G27142868n59387q45871K077942J418152k073670j870041J733322J422883q62198
2156.4G27584000n02854O70624O09360n77545l37906j09101J166687M20304r83200
2165G27940369L39126J38092K86560j487198j616821J056748J117477j09100j335373
2173.7G26329880J349182J556854j007614o86874r53446k53143j08185j86310L35999
2182.4G26376343K11944O04248K82059R48029J511612K16903j312561j710739L71475
2191.1G27499313R31244m11911J354828K290878N7297J4191J786346M51203k237168
$$ plain form
2130.3 724522247 723962936 723097992 722547760 723591690 724925079 725674820 725289993 724794388 725225601
2139 725225601 724956207 725380554 725093842 724415359 725592651 727511902 728798523 727717590 727142868
2147.7 727142868 726583481 725737610 727815552 729233704 727160034 725289993 727023315 728446198 727584000
2156.4 727584000 727081146 727751770 728361130 727783585 727445679 727336578 728503265 728923569 727940369
2165 727940369 728279495 728417587 728704147 727216949 725600128 726656876 727774353 727665253 726329880
2173.7 726329880 727679062 729235916 728228302 727541428 726587982 726334839 726226654 726040344 726376343
2182.4 726376343 726588287 727192535 727474594 728422623 729934235 730151138 728838577 727127838 727499313
2191.1 727499313 728430557 728018646 729373474 731664352 731721649 731735840 733522186 733973389 731736221
2199.8G31736221j479644O4621Q28475Q42972J028366J984177j49918p12661L15017
2208.4G34457626q51898j136627o94122K71377M04206Q35342J351547Q13904N67474
2217.1G36018829n12542r32923j77536J012879J18332r55811k68784l52172Q93325
2225.8G34843597J81275j083985K14158J01318k77481j295319p39898J512146O80770
2234.5G34136581M96445L84674m54101J425857K79617k232437j328048K67028R12018
2243.2G33887634q95004o90460P19681Q74252J320572K90603K83967j27183j116638
2251.8G34547424l53470N11628J03759m18853L05862o74209l46833O4469l81546J279983
2261.5G34638214J297j753006n93109J901321K203751l34396j92643R88846j099167
$$ plain form
2199.8 731736221 730256577 730321198 731149673 731992645 733021011 735005188 734855270 734142609 734457626
2208.4 734457626 733605728 732469101 731774979 732046356 732450562 733285904 734637451 735451355 736018829
2217.1 736018829 735506287 734573364 734395828 735408707 735527039 734571228 734302444 733950272 734843597
2225.8 734843597 735024872 733940887 734155045 734256363 733978882 732683563 731943665 733455811 734136581
2234.5 734136581 734633026 735017700 734563599 735989456 736269073 734036636 732708588 732975616 733887634
2243.2 733887634 732992630 732302170 733021851 733896103 735216675 735507278 735791245 735664062 734547424
2251.8 734547424 734193954 734705582 734809341 734390488 734696350 734022141 733675308 733739777 733358231 734638214
2261.5 734638214 734639511 732886505 732293396 734194717 736398468 736064072 735871429 736860275 735761108
2270.2G35761108j168747J698914m43573j406708K6932q24890o33392o36445J039124
2278.8G33412323R06906l10745l78189j254654L55301R61685Q12988J68839J78833
2287.5G34853287L01285r10340Q63190P17468J77078J46256q76770p34711q39691L71017
2297.2G34068069k76565j155930J42975J014862Q50144L58658K25677l75290N17349
2305.8G35369949O69709K12860K23617l55987j47248p51800J41830K50473q38546N8136
2315.5G34832993k07520j147156M35791K554169J68076j288987j277160r77784R84879
2324.2G34077301j181107j733779q48313j004486O29349K266540L253174n19714l460694
2332.8G31478271j00631K20947p6904L650818K160644o73828p69577j971664j614304
$$ plain form
2270.2 735761108 734592361 736291275 735847702 734440994 734467926 733643036 733009644 732373199 733412323
2278.8 733412323 734319229 734008484 733630295 732375641 732730942 733692627 734505615 734674454 734853287
2287.5 734853287 735154572 734244232 735107422 735824890 736001968 736148224 735271454 734536743 733697052 734068069
2297.2 734068069 733791504 732635574 732778549 733793411 734643555 735002213 735227890 734852600 735369949
2305.8 735369949 736039658 736252518 736476135 736120148 735972900 735221100 735362930 735613403 734774857 734832993
2315.5 734832993 734625473 733478317 733914108 736468277 736636353 735347366 734070206 733092422 734077301
2324.2 734077301 732896194 731162415 730314102 729309616 729938965 732205505 735458679 734938965 731478271
2332.8 731478271 731377640 731598587 731521683 735172501 737333145 736659317 735889740 733918076 732303772
2341.5G32303772O52161P18078k516174m76761L095474K659226K342300O39496o42166
2350.2G38775406q2703j15432j518708J559372L289261J915436M503937l825989q453522
2358.9G36047058k761307j825714p8735Q2245J1139j874390J655731M925385L00216
2367.6G36481628J781464J23138j641922J935578J288223N46036l13568k294235j229554
2376.2G36676788Q63571R27582L7155M77143P17850M01382J170883N98297j48849Q77228
2385.9G42599030M16107n21698o54297j335907m46777J530685O06689q51440K6627
2394.6G41369019L00521m77523m32663K14615k01722n22842Q59680J557236m27323
2403.2G42238998j830749j43280J64490J00860J263581O72302r11942j889953j42441
$$ plain form
2341.5 732303772 732955933 733674011 731157837 730681076 733776550 736435776 738778076 739417572 738775406
2350.2 738775406 738692703 738577271 737058563 738617935 741907196 743822632 748326569 744500580 736047058
2358.9 736047058 733285751 731460037 731381302 731463547 731474686 729600296 731256027 736181412 736481628
2367.6 736481628 738263092 738386230 736744308 738679886 739968109 740514145 740200577 737906342 736676788
2376.2 736676788 737540359 738467941 738505096 738982239 739700089 740101471 741272354 741870651 741721802 742599030
2385.9 742599030 743015137 742493439 741839142 740503235 740056458 741587143 742193832 741342392 741369019
2394.6 741369019 741669540 741192017 740759354 740973969 740772247 740249405 741109085 742666321 742238998
2403.2 742238998 740408249 740264969 740429459 740530319 741793900 742466202 741554260 739664307 739521866
2411.9G39521866N13153k3346R96170M01077k69165r66263r77172q8654L3035Q54798
2421.6G39995499M5166k031937L08228K842865q55561j514282O91834j10779J75705
2430.2G39546738p59583p29828N32303N20401J03302k012024j147995J281433J156159
2438.9G38490906M73175J32980n32379q14362K60926M86908l357n78156j030121l99780
2448.6G36486740K80686n36957m16413J637803P80487m57917j43127j22681L25623
2457.2G37834244l18222m26636n16739j874390j354293M69360L16086n29785K89688
2465.9G33889313P43561l05939q79135K74810N07279j27640k94494l11203L41873r4147
2475.6G33744278m80270q03223l2349J202088m78745r34295l45688O62002Q57620j114730
$$ plain form
2411.9 739521866 740035019 740011673 741007843 741408920 741139755 740173492 739196320 739107666 739140701 739995499
2421.6 739995499 740040665 738008728 738316956 741159821 740304260 738789978 739481812 739371033 739546738
2430.2 739546738 738787155 738057327 738589630 739110031 739213333 737201309 736053314 737334747 738490906
2438.9 738490906 738964081 739097061 738564682 737750320 738011246 738498154 738494797 737916641 736886520 736486740
2448.6 736486740 736767426 736230469 735814056 737451859 738232346 737774429 737631302 737508621 737834244
2457.2 737834244 737516022 737089386 736572647 734698257 733343964 733813324 734129410 733599625 733889313
2465.9 733889313 734632874 734326935 733447800 733722610 734229889 734102249 733807755 733496552 733838425 733744278
2475.6 733744278 733264008 732460785 732428436 733630524 733151779 732217484 731871796 732533798 733391418 732276688
2485.2G32276688m95835Q67462O37970j114959k517853n53436J115188j2207n07736
2493.9G29695282Q58459J457367m4174k008056j468430P26089J870652L44162q83789
2502.6G30547562J6098r51157r01108l0594n01098n73502K12555K344895R70153k84652
2512.2G30849152P72094m21981n23453n54428q97904p32193r83734k44675M80881N3635
2521.9G27797394j88370l47290j894073j181870K55737J09024R66187N42068M9820
2530.5G26108627o89544j403199M6082M04434P89490J536255N35202j257553j283951
2539.2G24785843L09677M96140J17263j48620O50711J16043k306595l55148R03778
2547.9G24569092J27106O21414r93729m84695M17404q43277l2654N52750k23847j417236
$$ plain form
2485.2 732276688 731780853 732648315 733286285 732171326 729653473 729100037 730215225 730203018 729695282
2493.9 729695282 730553741 732011108 731966934 729958878 728490448 729216537 731087189 731431351 730547562
2502.6 730547562 730563660 729612503 728711395 728680801 728179703 727606201 727818756 730163651 731133804 730849152
2512.2 730849152 731621246 731199265 730675812 730121384 729223480 728491287 727507553 727262878 727743759 727797394
2521.9 727797394 727609024 727261734 725367661 724185791 724441528 724550552 725516739 726058807 726108627
2530.5 726108627 725419083 724015884 724061966 724466400 725255890 726792145 727327347 726069794 724785843
2539.2 724785843 725095520 725591660 725708923 725560303 726211014 726327057 724020462 723665314 724569092
2547.9 724569092 724696198 725317612 724323883 723839188 724256592 723413315 723380661 723933411 723709564 722292328
2557.5G22292328j360779M13361Q68072q76541j010284J029205J211624M02298l99475
2566.2G22569809m9591j14365p09152J298370O84052j146393j030655o90002l69797
2574.9G20442276j224594j004639P20520K641144N62973k773437l97339O15463j489639
2583.6G18092728r12018O13937M5929J63498Q82797j87149K16217J39237j394119o57959
2593.2G17003098O59713l54614j168671M93622P99256N50231P03507p74384j922149
2601.9G15989609j925965l87878J111526J015778K20337q61053p65610m4785L87345
2610.6G14739304m8981j673889q94776O68335n17730r13926K92359P98187n90744q48846
2620.2G11009293O98623l08914J92261J051254j129761j203384o59561p32422m1046
$$ plain form
2557.5 722292328 720931549 721344910 722212982 721336441 720326157 721355362 722566986 722969284 722569809
2566.2 722569809 722520218 722405853 721696701 722995071 723679123 722532730 721502075 720812073 720442276
2574.9 720442276 719217682 718213043 718933563 721574707 722137680 719364243 718966904 719582367 718092728
2583.6 718092728 717180710 717794647 717840576 718004074 718886871 718699722 718915939 719055176 717661057 717003098
2593.2 717003098 717662811 717308197 716139526 716633148 717432404 717982635 718686142 717911758 715989609
2601.9 715989609 714063644 713675766 714787292 715803070 716023407 715162354 714396744 714351959 714739304
2610.6 714739304 714690323 713016434 712121658 712789993 712272263 711358337 711650696 712448883 711858139 711009293
2620.2 711009293 711707916 711399002 711591263 712642517 711512756 710309372 709649811 708917389 708876343
2628.9G08876343L00903l46298m52347P90024M6768j313400q75015k76032o60171q56553
2638.5G05234222M42276K73743p11746J04751K34986q84247o72989O31790k6397o33164
2648.2G03993225M39606o32706j788559n93262N90973N71137m52271l98101o48270
2656.9G01081772j321793k28805J76773J95999N73120O61011n570r83810p7591K45666
2666.5G00316772m06036M1657J88598n04455j366806r42612j83640j782989j464920
2675.2F93895569J825790N26276j493836L96882J393508P10221r36890j036453o27976
2683.9F94653091j059341M3030P11212N01480l69644n68161j0071m30374j99127q1711
2693.5F93190384M0207Q35876J5412j282807o58493l44696q32672j081772r49707J54419
$$ plain form
2628.9 708876343 709177246 708830948 708378601 709168625 709215393 707901993 707026978 706750946 706090775 705234222
2638.5 705234222 705676498 705950241 705238495 705343246 705578232 704693985 704020996 704652786 704626389 703993225
2648.2 703993225 704432831 703800125 702011566 701418304 702009277 702580414 702128143 701730042 701081772
2656.9 701081772 699759979 699531174 699707947 699903946 700477066 701138077 701132507 700148697 700071106 700316772
2666.5 700316772 699910736 699952393 700140991 699636536 698269730 697327118 697143478 695360489 693895569
2675.2 693895569 695721359 696247635 694753799 695150681 696544189 697254410 696317520 695281067 694653091
2683.9 694653091 693593750 693636780 694347992 694849472 694479828 693911667 693901596 693471222 693272095 693190384
2693.5 693190384 693230591 694066467 694081879 692799072 692140579 691795883 690963211 689881439 688931732 689086151
2703.1F89086151J29395l205l16162j093368l34931L34473L77273p94982l83530O62842
2712.8F87663956o74439j20010P79724l37219j019287n85328r20410j073608J96686
2721.5F83910065J216201R88541j124191o43768J95922j905441q83560J356430J075745
2730.2F84185944j64338p08847j385879j521988o20117p83005l48358o06995k55584
2738.8F77790833J374053m59136j860276r6054J262894M74777j96686N14832q60062
2747.5F77945175j829147K12555P6446r44061K41928J49994k79846M08096l58047j202698
2757.2F74420395R613L14789q10776n23605l04718n79529k29035n40466q18710P65228
2766.8F71703186J230927j133194k193299j405258K48489J218110L99856j037598k148818
$$ plain form
2703.1 689086151 689215546 689212341 688896179 687802811 687467880 687802353 688179626 687384644 687001114 687663956
2712.8 687663956 686989517 686869507 687649231 687312012 686292725 685707397 684786987 683713379 683910065
2721.5 683910065 685126266 686114807 684990616 684346848 684542770 682637329 681753769 683110199 684185944
2730.2 684185944 684021606 683312759 681926880 680404892 679784775 679001770 678653412 678046417 677790833
2738.8 677790833 679164886 678705750 676845474 676749420 678012314 678487091 678290405 678805237 677945175
2747.5 677945175 676116028 676328583 676405029 675460968 675702896 675852890 675573044 675981140 675623093 674420395
2757.2 674420395 674430008 674744797 673934021 673410416 673105698 672526169 672297134 671756668 670937958 671703186
2766.8 671703186 672934113 671800919 669607620 668202362 668450851 669668961 670068817 669031219 666882401
2775.5F66882401p97730j21078j78223O35223j73797o93665o20804m73938o73217n03312
2785.1F63281860j22757r47723k26517J73035j008835p38144N94711L50419j099930
2793.8F60256119j239319n01099k7542P7591n1880j663589k275696o84586J06430K26975
2803.4F54223404j471253j212234R09195l35617o47965q38394k126541r37347o16913
2812.1F46946335O8588K000122p08694k536698o74743r05381j187133r18198k57950
2820.8F41826248O38580M79432m19159j435776q22144q55255j253853j265678r69353
2829.5F35923042p2708m39415K44942o5918k116165k788849j695709J92794m39376
2838.2F28742638r49746p22427j832313k644577k986451k169532j013794q08182k485047
$$ plain form
2775.5 666882401 666084671 665963593 665785370 666420593 666246796 665553131 664932327 664458389 663785172 663281860
2785.1 663281860 663159103 662211380 661984863 662157898 661149063 660410919 661005630 661356049 660256119
2793.8 660256119 659016800 658515701 658488159 658565750 658513870 656850281 654574585 653889999 653996429 654223404
2803.4 654223404 652752151 651539917 652449112 652113495 651465530 650627136 648500595 647563248 646946335
2812.1 646946335 647014923 649015045 648306351 645769653 645094910 644189529 643002396 642084198 641826248
2820.8 641826248 642464828 642944260 642525101 641089325 640267181 639411926 638158073 636892395 635923042
2829.5 635923042 635850334 635410919 635655861 635589943 633473778 630684929 628989220 629182014 628742638
2838.2 628742638 627792892 627070465 625238152 622593575 619607124 617437592 616423798 615615616 613130569
2846.8F13130569m086723k264938q26111j953621j635132o55327j050110o52580k47917
2855.5E99758110k86713j24778j13373P3395P9460J25999j791076l170739p03010M91333
2865.2E94338608m8104q4075o48804j656685k229691j054420m87671j788406j213913
2873.8E85126839j0529j301346j548729R13697Q19969j079407k73399K68478m63371
2882.5E82452202r30634q09478q63076j935844q49037J13983q61740j529846k096405
2891.2E72690125o92139J47934j201744j428337q23517j011353j276016p51152o85196
2899.9E64968605n45692j00899j1139j124878k506599p39251J013985o54259j617660
2908.6E58682213K67219K90108j119575r36928j271324j792336j815414m53492p60574
$$ plain form
2846.8 613130569 609043846 606778908 605952797 603999176 602364044 601708717 600658607 600006027 599758110
2855.5 599758110 599471397 599346619 599233246 599306641 599386101 599512100 597721024 594550285 593847275 594338608
2865.2 594338608 594290504 594206429 593557625 591900940 589671249 588616829 588129158 586340752 585126839
2873.8 585126839 585116310 583814964 582266235 583179932 583999901 582920494 582647095 582915573 582452202
2882.5 582452202 581521568 580712090 579849014 577913170 577064133 577178116 576316376 574786530 572690125
2891.2 572690125 571997986 572145920 570944176 569515839 568692322 567680969 566404953 565653801 564968605
2899.9 564968605 564422913 564322014 564310875 563185997 560679398 559940147 560954132 560299873 558682213
2908.6 558682213 558949432 559239540 558119965 557183037 555911713 554119377 552303963 551850471 551089897
2917.2E51089897k851486j283493Q7509n54008j018067p82547l60222K556L33939j201515
2926.9E43462563j048966R75990Q30918j107521j324578O98929J038704R7733l05367
2935.6E43318405P3090J411P77588J708107L79143P66182P75490M99992O90117r73931
2945.2E48015594M07448J399613n26505j375732j469918j66015R31396L45841q14858
2953.9E46746864j778488q30993M87976l71209p49740Q18367O74629n36880R34944
2962.6E45395470O97937j495056K88810K309761J956406K03896j152268O75545K258262
2971.2E51138763K473679J886864M61158n64155L75099K162438Q37631j6022J77345
2979.9E58932800k39486J515121K414856J082001k40784L8872J440773J798210J221428
$$ plain form
2917.2 551089897 548238411 546954918 547042427 546488419 545470352 544687805 544327583 544330139 544664078 543462563
2926.9 543462563 542413597 543389587 544220505 543112984 541788406 542487335 543526039 543623772 543318405
2935.6 543318405 543391495 543392906 544170494 545878601 546257744 547023926 547799416 548299408 548989525 548015594
2945.2 548015594 548423042 549822655 549296150 547920418 546450500 546284485 547215881 547561722 546746864
2953.9 546746864 544968376 544137383 544625359 544254150 543504410 544322777 544997406 544460526 545395470
2962.6 545395470 546093407 544598351 544887161 547196922 549153328 549357224 548204956 548880501 551138763
2971.2 551138763 553612442 555499306 555960464 555396309 555771408 557933846 558771477 558755455 558932800
2979.9 558932800 558693314 560208435 562623291 563705292 563464508 563503380 564944153 566742363 567963791
2988.6E67963791L26958M91523J357842M60167J52778R70116p2403M18434Q87490p70226
2998.2E72186470M20990K060318L71971k012825o27823N87654m87899O09665N78002
3006.9E73686523N7755o50406j280479N47065P44706L21235m20646j020546j021653
3015.6E70963554j669044j095162p23724L94974Q06923j50910L97759o06690j300811
3024.3E67016869n58777p70569L36227K17629j765633j169967O70356O85044j762963
3033E62898216k166137p7782l71971p39365r38644k6703J110534k025032k074661l53126
3042.6E55235329j307297o9199j90o51131r3880q71010k18963N12352o18058j315460
3052.2E50602493j475753j411400q36640K95944j15051j727485j481057P8926J004677
$$ plain form
2988.6 567963791 568290749 568782272 570140114 570600281 570753059 571723175 571650772 572069206 572956696 572186470
2998.2 572186470 572607460 574667778 575039749 573026924 572399101 572986755 572498856 573108521 573686523
3006.9 573686523 573744278 573093872 571813393 572360458 573105164 573426399 573005753 571985207 570963554
3015.6 570963554 569294510 568199348 567475624 567870598 568677521 568526611 568924370 568317680 567016869
3024.3 567016869 566458092 565687523 566023750 566241379 564475746 563305779 563976135 564661179 562898216
3033 562898216 560732079 560654297 560282326 559542961 558604317 558577614 559688148 557663116 555588455 555235329
3042.6 555235329 553928032 553858833 553858643 553207512 553113632 552242622 552023659 552536011 551917953 550602493
3052.2 550602493 549126740 547715340 546878700 547174644 547059593 545332108 543851051 543929977 544934654
3060.9E44934654k08969j606750k040100j530381R2621j47514l10555k55813r09729
3069.6E38017464j13793l166j96800p72591j261673k95257J04141P43103j52893j634789
3079.2E34433746j107940j218872n23186J03264m91753j93176j550560k952080j024780
3087.9E25474663N56450J07841M07219L5935k005845j575203m29992n41268O99082
3096.6E22728882J074219r77860k043762j50986k6703j923637j632576p84569n06554
3105.3E15756454j136016q38089r0027J18713P68395j684800k795372K26784Q10967
3114E11137009j090165j268768l38135k86331n00335j556283j258544j282235j945381
3122.6E01610832M52004P26394j295204k731018j440315R54094m997j248246j878776
$$ plain form
3060.9 544934654 544725685 543118935 541078835 539548454 539641075 539493561 539183006 538927193 538017464
3069.6 538017464 537903671 537900505 537703705 536931114 535669441 535374184 535478325 536221428 536068535 534433746
3079.2 534433746 533325806 532106934 531583748 531687012 531195259 531002083 529451523 526499443 525474663
3087.9 525474663 526031113 526138954 526546173 526582108 524576263 523001060 522571068 522029800 522728882
3096.6 522728882 523803101 522825241 520781479 520630493 520603790 518680153 517047577 516263008 515756454
3105.3 515756454 514620438 513782349 513692322 513811035 514579430 512894630 510099258 510326042 511137009
3114 511137009 510046844 508778076 508439941 508153610 507653275 506096992 504838448 503556213 501610832
3122.6 501610832 502062836 502789230 501494026 498763008 497322693 498276787 498271790 497023544 495144768
3131.3D95144768j020928p92884j563035k46925k13203l98941j134911k269974j583633
3140D85920334j081886r19075j159783n85632K62260j145134j724662K13928m30184
3148.7D79350166k013740n95741r4414j034394j503601j099701j006126n52902k00005
3157.4D71249542j377258r47685j346588j403923j057282j660347J88217j630401k948876
3166D59065399M63448M33845j915741k136383o7520q2512j683349k023430j408005
3174.7D50645752M88777k35405j590652r40476j638222j510238m25759r36012m38309
3183.4D43419456M83666j559296k411575o76880p52296j280518r11407q09060j046028
3192.1D34456062j473655r13544o53343j304550n53551o75316j989555o91681O05278
$$ plain form
3131.3 495144768 494123840 493330956 491767921 491520996 491307793 490908852 489773941 487503967 485920334
3140 485920334 484838448 483919373 482759590 482173958 482436218 481291084 479566422 479780350 479350166
3148.7 479350166 477336426 476740685 476646271 475611877 474108276 473008575 472002449 471449547 471249542
3157.4 471249542 469872284 468924599 467578011 466174088 465116806 463456459 463644676 462014275 459065399
3166 459065399 459528847 459962692 458046951 455910568 455843048 455760536 454077187 452053757 450645752
3174.7 450645752 451134529 450899124 449308472 448367996 446729774 445219536 444793777 443857765 443419456
3183.4 443419456 443903122 442343826 439932251 439255371 438503075 437222557 436311150 435502090 434456062
3192.1 434456062 432982407 432068863 431415520 430110970 429557419 428882103 426892548 426200867 426806145
3200.8D26806145q34313j336174o30798j618805j414948l98712j237182o90651P65457
3209.4D19410019j82686k090454q15353N95779j620064k540512j900864r47227M30870
3218.1D10339508j89285j389733j303329o92825j335984o38466O71463m10690m16794
3226.8D04633865q61244j720047j296730j140900j46522j07079j177559j366767k22931
3235.5C96594086M90265p78466j457061j282387o02761k32391r64622j155129o65207
3244.2C89946327q99315j721382p32841m81873j246757q04062j242218m09813R01336
3252.8C83309402L86773k69509j401329j526718l28979J95427n79339j943626j709137
3261.5C76132965l36151p99103j225014l95164m37164K29568Q75282M27704q75511
$$ plain form
3200.8 426806145 425971832 424635658 424004860 422386055 420971107 420572395 419335213 418644562 419410019
3209.4 419410019 419227333 417136879 416321526 416917305 415297241 412756729 410855865 409908638 410339508
3218.1 410339508 410150223 408760490 407457161 406764336 405428352 404789886 405461349 405050659 404633865
3226.8 404633865 403772621 402052574 400755844 399614944 399468422 399361343 398183784 396817017 396594086
3235.5 396594086 397084351 396305885 394848824 393566437 392963676 392731285 391766663 390611534 389946327
3244.2 389946327 389047012 387325630 386592789 386110916 384864159 384060097 382817879 382408066 383309402
3252.8 383309402 383696175 383426666 382025337 380498619 380169640 380365067 379785728 377842102 376132965
3261.5 376132965 375796814 374997711 373772697 373377533 372940369 373169937 374045219 374472923 373597412
3270.2C73597412j685600o88896j354714j246109O2218L81966K00653j877709k061271
3278.9C65327950j004487K96593Q29621o18859l60184m17709K060n09224j826401j73111
3288.5C61546249l22303p18422o25077j229400j31531k88048j845131j543731N59730
3297.2C55402336R43337k40937o34041n90286l56903p60956j021270j64872Q6518p59697
3306.8C51903229J56288K75001k025756j577073m99191K73895L20282j260719j376610
3315.5C46189346k017593j219673K47459m91218L64189N60608j249733k144089p76291
3324.2C39463005R88045K29378j735268k290917o36482k14462q45337r18541j409378
3332.9C32630043p87277n28069r3956r1858r97276n03883j148339n87043j31646j672401
$$ plain form
3270.2 373597412 371911812 371222916 369868202 368622093 368684311 369066277 369266930 367389221 365327950
3278.9 365327950 364323463 364620056 365449677 364830818 364470634 364052925 364054985 363545761 361719360 361546249
3288.5 361546249 361223946 360505524 359880447 358651047 358519516 358231468 356386337 354842606 355402336
3297.2 355402336 356345673 356104736 355470695 354880409 354523506 353762550 352741280 352576408 352662926 351903229
3306.8 351903229 352059517 352334518 350308762 348731689 348232498 348506393 348826675 347565956 346189346
3315.5 346189346 344171753 342952080 343199539 342708321 343072510 343633118 342383385 340239296 339463005
3324.2 339463005 340451050 340680428 338945160 336654243 336017761 335803299 334957962 334039421 332630043
3332.9 332630043 331842766 331314697 331220741 331128883 330131607 329627724 328479385 327892342 327760696 326088295
3342.5C26088295q04176r54056k206764j059838J17760M94003K75727j115418j030083
3351.2C19805450o72016k067547j324119m54598m81910p9193p68567q13331j83869
3359.9C12960300l7097j259175j953869j185970m2057n84507l097801n79109J002826
3368.6C05223541j220340l97339q5450n08194j305522j075936M9896n65910m47922
3377.2B99666824r25045r74064m23011o63300r67579j246204O6109M1561j231442K12078
3386.9B93555927J212597n24235p82356m27208j192074l77407m66079q99525q25520
3395.6B89274120k93121J419888O39019n55687j304017j443481n48115r17740n12657
3404.2B85758209k58083R3613N60531n71899k91786j37692k88391P20291M33045M8656
$$ plain form
3342.5 326088295 325284119 324330063 322123299 321063461 321181221 321675224 321950951 320835533 319805450
3351.2 319805450 319133434 317065887 315741768 315287170 314805260 314726067 313957500 313144169 312960300
3359.9 312960300 312923203 311664028 309710159 308524189 308482132 307897625 304799824 304220715 305223541
3368.6 305223541 304003201 303605862 303520412 303012218 301706696 300630760 300680656 300114746 299666824
3377.2 299666824 298741779 297767715 297344704 296681404 295713825 294467621 294533730 294575291 293343849 293555927
3386.9 293555927 294768524 294244289 293461933 293034725 291842651 291465244 290999165 290099640 289274120
3395.6 289274120 288980999 290400887 291039906 290484219 289180202 287736721 287188606 286270866 285758209
3404.2 285758209 285500126 285593739 286154270 285582371 285290585 285152893 284864502 285584793 286017838 286066494
3413.9B86066494n43232j024914K41490J73778j100445r58671L76491L09449m29364
3422.6B83111076M1085m46282O4945M22287m04129J07899K90241Q74329K07252n04379
3432.2B83764324M09241J29108M20285J07288j86176Q64277J184825M47083m19712
3440.9B86720543n25665k73114J734696J317253j445465m45614J383991J067314K64511
3449.6B89798450K39926J052894J195012k77176o28720J096573O65798J51272N85213
3458.2B93879242K86732M59404L52821J044903J026668m26750l37467M47273J873131
3466.9B98605957K858620M08172j793308p22790J172409K266941J181298O16626J032200
3475.6C05626125l89232J00784J104012M47711J169568J694431J10130l76072O40793
$$ plain form
3413.9 286066494 285523262 284498348 284739838 284913616 283813171 282854500 283230991 283540440 283111076
3422.6 283111076 283152161 282705879 282770824 283193111 282788982 282896881 283187122 284061451 284268703 283764324
3432.2 283764324 284173565 284302673 284722958 284830246 284644070 285508347 286693172 287140255 286720543
3440.9 286720543 286194878 285921764 287656460 288973713 287528248 287082634 288466625 289533939 289798450
3449.6 289798450 290038376 291091270 292286282 292009106 291380386 292476959 293142757 293294029 293879242
3458.2 293879242 294165974 294625378 294978199 296023102 297049770 296623020 296285553 296732826 298605957
3466.9 298605957 301464577 301872749 300079441 299356651 300529060 302796001 303977299 304593925 305626125
3475.6 305626125 305236893 305337677 306441689 306889400 308058968 309753399 309863529 309487457 310128250
3484.3C10128250O65302J346207J824722J247082J275234Q07152N80120Q38986Q32100
3493C19545155J392841M54063r92965Q25119J875076J348457O11229n56984O52275
3501.6C25154266J079712J441536J562348L52440Q96415K37503R57527J174660K58103
3510.3C33114510J150817J42327J714134K920876N65261p75528M89388K873497K036362
3519C44231644N14564Q17795Q87032q5106K23426P21665O06766K302932J525269M23508
3528.6C52169495P41233N88303Q57811K286682K835465J39808J257172J339149o97288
3537.3C61517830J923866J786804Q96988P62673J221122J622010K131309J779061j342392
3546C72299271L86009J359138J763573K088661K451782L571930l03192K77252O13022
$$ plain form
3484.3 310128250 310793552 312139759 313964481 315211563 316486797 317293949 317874069 318713055 319545155
3493 319545155 320937996 321392059 320399094 321224213 323099289 324447746 325058975 324501991 325154266
3501.6 325154266 326233978 327675514 329237862 329590302 330486717 330724220 331681747 332856407 333114510
3510.3 333114510 334265327 334407654 336121788 339042664 339607925 338832397 339321785 342195282 344231644
3519 344231644 344746208 345564003 346451035 346365929 346589355 347311020 347917786 350220718 351745987 352169495
3528.6 352169495 352910728 353499031 354356842 356643524 359478989 359618797 360875969 362215118 361517830
3537.3 361517830 363441696 365228500 366125488 366888161 368109283 369731293 371862602 373641663 372299271
3546 372299271 372685280 374044418 375807991 377896652 380348434 383920364 383617172 383894424 384507446
3554.7C84507446P23038K401085M04014J908150J647186O43578J571732J740570J557350
3563.4C97104149J576462N035247K702065j379967j20659J93901L122445K370262J895485
3572D12499390P42454m82445K194825L455772K345009J039162J479148R54819J930733
3580.7D26158867L617973K101631M67835J002235M448929L607674R89227K771835o12602
3589.4D44553604P46575K588882L501205L078576O05239J275673N02358L059120M272499
3598.1D64183731K120476K757759J620598J102295J805954J764564K437782L821488
3605.8D81614647L365478Q66929M451904r04503j883392P446861L632011p54509K986527
3614.5E00821953Q6860K387619L271714K277260L240432K002793K236480K686844K209664
$$ plain form
3554.7 384507446 385230484 387631569 388035583 389943733 391590919 392234497 393806229 395546799 397104149
3563.4 397104149 398680611 403715858 406417923 405037956 404917297 405111198 408233643 410603905 412499390
3572 412499390 413241844 412759399 414954224 418409996 420755005 421794167 423273315 424228134 426158867
3580.7 426158867 429776840 431878471 432346306 433348541 437797470 441405144 442394371 445166206 444553604
3589.4 444553604 445300179 447889061 451390266 454468842 455074081 456349754 456852112 459911232 464183731
3598.1 464183731 466304207 469061966 470682564 471784859 473590813 475355377 477793159 481614647
3605.8 481614647 484980125 485847054 490298958 489394455 487511063 494957924 498589935 497835426 500821953
3614.5 500821953 500908813 503296432 506568146 508845406 512085838 514088631 516325111 519011955 521221619
3623.1E21221619K249794L330001L632966L915863N758056J378632q862076K148285
3630.9E34773140P033119O100083L431587J793518K581253M042206K860031L93181
3638.6E63008118J057892K463569L960571K525673P89490J608505L375206P974739
3646.3E86763763N242615k309952K636338L556060j018371l749352M205170M751091
3654F00077362L706322O226311m302521q72917M249954K833557K860718O77070J867180
3662.7F17323036J405182J67694J762505K969513N530700K601357k46277L392830n755730
3671.4F29150810k54020Q504295R558372l166885j3360214O361923N921936L053741
3679.1F45769958j236953J31073K403335P63932J326294J180343M71115M308243O516953
$$ plain form
3623.1 521221619 523471413 526801414 530434380 534350243 540108299 541486931 532624855 534773140
3630.9 534773140 541806259 547906342 551337929 553131447 555712700 559754906 562614937 563008118
3638.6 563008118 564066010 566529579 570490150 573015823 573805313 575413818 578789024 586763763
3646.3 586763763 592006378 589696426 592332764 595888824 594870453 591121101 595326271 600077362
3654 600077362 603783684 610009995 605707474 604834557 609084511 611918068 614778786 615455856 617323036
3662.7 617323036 618728218 618895912 620658417 623627930 629158630 631759987 631513710 634906540 629150810
3671.4 629150810 628896790 637401085 646959457 643792572 630432358 636794281 642716217 645769958
3679.1 645769958 644533005 644664078 647067413 647831345 649157639 650337982 650809097 655117340 661634293
3687.8F61634293o425400m280396P004547j702728j159668K552948p73392P67365J402512
3696.4F59020081J29089o58417J36337L563843L628083m532319j843109M516297Q77990
3705.1F64837875N10712R62677K757034M643631m956512M687958Q092651j1690979
3712.8F69845047n95398L588104J000061Q38852J607895J506424j581116p39822N871735
3721.5F81341782N93872n902100L809662K275619q70895m009247j258011L355637J914597
3730.2F81250916N708618l51334m781799N785293J779785n404205m521560J46408J623916
3738.9F81236038K375488J165009l776779J428070R580154m1656j5291672O412048
3746.6F83086700L619461N440293J957474r982300R401855l986969q970566N466614
$$ plain form
3687.8 661634293 655208893 650928497 657933044 656230316 655070648 657623596 656850204 657617569 659020081
3696.4 659020081 659149170 658490753 658627090 662190933 665819016 661286697 659443588 663959885 664837875
3705.1 664837875 665348587 666311264 669068298 673711929 668755417 673443375 681536026 669845047
3712.8 669845047 669249649 672837753 673837814 674676666 676284561 677790985 676209869 675470047 681341782
3721.5 681341782 681935654 676033554 679843216 682118835 681247940 677238693 675980682 679336319 681250916
3730.2 681250916 686959534 686608200 681826401 687611694 689391479 683987274 679465714 679612122 681236038
3738.9 681236038 683611526 684776535 680999756 682427826 692007980 691966324 676674652 683086700
3746.6 683086700 686706161 692146454 694103928 684121628 693523483 689536514 680565948 686032562
3754.3F86032562L290940K442779m426193L22876O391449l766937n046540J901322
3762F87142258J288376K07901K149887k200928j446838L205871L592072j6175p624054
3770.7F86298370J248017K129059M7531P57065j401597M38691J459274L783798K525406
3779.4F97285614o905289K3880J588669J70746J369171k951660j335144K104721K478638
3788F93829346J446304j131058j170959j178513L04871J68228O37512L281937k857132
3796.7F93330536m793625J532288M804687O442795l036347j1145553J51901L950882
3804.4F91237564O489639P626801p207031p838669J872330M25949N96542N57632n30624
3813.1F93230133Q98056M218063o60858r452209M755554O611176O356353K961502j6381073
$$ plain form
3754.3 686032562 689323502 691766281 687340088 687662964 694054413 690287476 685240936 687142258
3762 687142258 688430634 688638535 690788422 688587494 687140656 690346527 693938599 693922424 686298370
3770.7 686298370 687546387 689675446 689722977 690480042 689078445 689517136 690976410 694760208 697285614
3779.4 697285614 690380325 690404205 691992874 692163620 693532791 690581131 689245987 691350708 693829346
3788 693829346 695275650 694144592 692973633 691795120 692099991 692268219 692905731 696187668 693330536
3796.7 693330536 688536911 690069199 694873886 701316681 698280334 687134781 687286682 691237564
3804.4 691237564 697727203 705354004 698146973 690308304 692180634 692606583 693203125 693760757 693230133
3813.1 693230133 694128189 698346252 697685394 688233185 692988739 699599915 705956268 708917770 692536697
3821.8F92536697l244247L047028K383651K593994Q11539m985580j775132K613144
3829.5F93981094K779084J907425n881653R84649P509003m094849l609314O463623
3837.2G00039062n539398l394012Q129272m436111j535721Q267288r87701o582947
3844.9F93959732R74121n51071r44290L276901P49283K472000M842529M06494N575791
3853.6G10761490k2546158k557220R681396Q5373k375412J558380K911530K877273
3861.3G00396652n310211k658005P655411j11618n699692J315842J878738O577225
3869.1G04044342k717133j1913375J077346N825577L728790q681182J119995L823395
3876.8F96307755r66645J242981M738465k137070p141647M337387J445388J276474
$$ plain form
3821.8 692536697 689292450 692339478 694723129 697317123 698128662 693143082 691367950 693981094
3829.5 693981094 696760178 698667603 692785950 693770599 701279602 697184753 693575439 700039062
3837.2 700039062 694499664 691105652 699234924 694798813 693263092 701530380 700542679 693959732
3844.9 693959732 694933853 694382782 693438492 696715393 697464676 699936676 704779205 705185699 710761490
3853.6 710761490 688215332 685658112 695339508 695424881 693049469 694607849 697519379 700396652
3861.3 700396652 695086441 692428436 700083847 699972229 694272537 695588379 697467117 704044342
3869.1 704044342 701327209 689413834 690491180 696316757 700045547 691364365 692484360 696307755
3876.8 696307755 695341110 696584091 701322556 699185486 692043839 696381226 697826614 699103088
3884.5F99103088L802948j1896438j084366K696152R67254M542237R14230o727982
3892.2F92317123J999970L802490k633819j218720J76010M008255K786331p790832
3899.9F93446808N266113K693710o623840K145844r86176k280731J81351Q43200Q49839
3908.6F95536118k76108M24423r8572l34701O54907q36105K72598L530807k759857
3917.3F96113510l216934M864731Q0337m891433P24716L037643K229386l022538l581695
3926F92337723J788559J554336q75320k932358O04858L524247n64652j55258n9128
3934.6F95223007j761627j13754N70602N88684L71781n60913J63345P4539k770309
3943.3F91785355M94918J166001l71094J556015j948547o59867J941986l51486K169342
$$ plain form
3884.5 699103088 702906036 691009598 689925232 692621384 693588638 698130875 699045105 692317123
3892.2 692317123 694317093 698119583 695485764 694267044 694443054 698451309 701237640 693446808
3899.9 693446808 698712921 701406631 694782791 696928635 695942459 693661728 693843079 694686279 695536118
3908.6 695536118 695260010 695684433 695585861 695251160 695906067 695069962 695342560 698873367 696113510
3917.3 696113510 692896576 697761307 697841644 692950211 693674927 696712570 698941956 695919418 692337723
3926 692337723 694126282 695680618 694805298 691872940 692477798 696002045 695437393 695282135 695223007
3934.6 695223007 693461380 693347626 693918228 694506912 694878693 694317780 694481125 694555664 691785355
3943.3 691785355 692280273 693446274 693075180 694631195 692682648 692022781 693964767 693613281 695782623
3952F95782623N86396j432190K57568n86319q08792L22876n08728j706619J73263M75998
3961.6F92556076n36957N50003N54505l00293K33764M96979q7204K21100L09830Q68759
3971.3F94866562r5291j175003r28040j107864K493667K032242j963653p13883M91333
3980F93900070R75876J51138j962356m82254N27572j96838J213303M32129n92576L84217
3989.6F94350281m52500L56293K92893k54212O11344j210022j629639k28348m0588
3998.3F91795502J18637N77850
4000.2F92491989
$$ plain form
3952 695782623 696369019 694936829 695194397 694608078 693799286 694122162 693613434 691906815 692080078 692556076
3961.6 692556076 692019119 692569122 693123627 692823334 693057098 693554077 693466873 693687973 693997803 694866562
3971.3 694866562 694771271 693596268 692668228 691560364 694054031 696086273 694122620 693408737 693900070
3980 693900070 694875946 695027084 693064728 692582474 693110046 692913208 694126511 694558640 693966064 694350281
3989.6 694350281 693897781 694254074 694546967 694292755 694904099 693694077 692064438 691836090 691795502
3998.3 691795502 691914139 692491989
4000.2 692491989
##END=$$ End of the data block
