##TITLE=$$ Begin of the data block
##JCAMP-DX=5.00 $$ ACD/SpecManager v 10.08
##SPECTROMETER/DATA SYSTEM=Varian
##DATE=07 Jan 2013 17:14:20
##DATA TYPE=INFRARED SPECTRUM
##DATA CLASS=XYDATA
##ORIGIN=
##OWNER=
##NPOINTS=3735
##FIRSTX=399.26403809
##LASTX=4000.35498047
##MAXX=4000.35498047
##MINX=399.26403809
##MAXY=79.66053772
##MINY=18.47091484
##XFACTOR=1.0000000000
##YFACTOR=0.000000100000000
##FIRSTY=62.34391785
##DELTAX=0.96440572
##XUNITS=1/CM
##YUNITS=TRANSMITTANCE
##XYDATA=(X++(Y..Y))
$$ plain form
399.3 623439178 629325218 624569321 615197945 612026367 613899155 619849396 622748947 624777107
407 624777107 628065834 621082420 615094109 611709671 614873085 619734650 612598877 614132538 622902527
415.7 622902527 630260658 633802452 621951523 617103958 620159607 619893417 616059570 607915039
423.4 607915039 602436180 604290352 615436859 620567207 619234390 619451141 615941963 605606194
431.1 605606194 601964378 602189980 601309586 604069977 605994301 608454514 612585907 617992134 620551071
439.8 620551071 614654884 605031395 605058060 607479897 602568588 604943733 611959076 615612183 614374695
448.4 614374695 610627937 609233665 608531876 607497025 599718246 595330887 597727737 601454620 608651352
457.1 608651352 606737137 603294449 603393593 603424339 604913864 601353760 595796471 593425102 594745598
$$ packed form
399.3F23439178N886040m755897r371376l171578J872788N950241K899551K028160
407F24777107L288727o983414n988311l384438L163414M861565p135773J533661Q769989
415.7F22902527P358131L541794j1850929m847565L055649k66190l833847q144531
423.4F07915039n478859J854172J1146507N130348j332817K16751l509178j0335769
431.1F05606194l641816K25602q80394K760391J924324K460213M131393N406227K558937
439.8F20551071n896187r623489K6665K421837m911309K375145P015343L653107j237488
448.4F14374695l746758j394272p01789j034851p778779m387359K396850L726883P196732
457.1F08651352j914215l442688R9144L0746J489525l560104n557289k371369J320496
$$ plain form
465.8 594745598 595459709 597717476 604113541 610205078 610411415 604164963 597168770 598776512 602383499
474.5 602383499 598188934 591600571 592030602 596551819 601446495 606695175 609582481 606821747 606624298
483.2 606624298 607268600 604346581 600369911 595914879 596255493 598247681 601742058 605442657 609498215
491.8 609498215 609545250 606394997 607309494 602014999 594265022 594529114 600002785 605260544 606096954
500.5 606096954 604902534 604317780 603568726 599770966 596745911 596130295 594998894 592366333 590993423
509.2 590993423 595012436 594825668 592263947 593101616 593846550 593315735 591349030 587151871 580532532
517.9 580532532 579697914 579942703 578816910 579805641 582024002 585590782 585910645 583466606 579158897
526.6 579158897 578814812 579805412 577545624 577092133 576896439 577168007 577220001 578828278 580882568
$$ packed form
465.8E94745598P14111K257767O396065O091537K06337o246452o996193J607742L606987
474.5F02383499m194565o588363M30031M521217M894676N248680K887306k760734j97449
483.2F06624298O44302k922019l976670m455032L40614J992188L494377L700599M055558
491.8F09498215M7035l150253R14497n294495p749977K64092N473671N257759Q36410
500.5F06096954j194420n84754p49054l797760l025055o15616j131401k632561j372910
509.2E90993423M019013j86768k561721Q37669P44934n30815j966705m197159o619339
517.9E80532532q34618K44789j125793R88731K218361L566780L19863k444039m307709
526.6E79158897l44085R90600k259788m53491j95694K71568N1994J608277K054290
$$ plain form
535.2 580882568 580322495 579744034 576843529 574831657 574606934 575414085 577027435 578947220 582360039
543.9 582360039 584883957 586826515 585854263 583930054 582986984 581129990 580530701 580065956 580564880
552.6 580564880 581033401 581615944 584236298 586380157 586265678 584964905 584201012 582619934 580879211
561.3 580879211 579776955 580797920 583163261 584705162 586111259 586223030 586801872 587282944 586073380
570 586073380 584580650 581882973 579006424 578249741 579469528 579527206 580878258 582933655 583141327
578.6 583141327 583446121 582252541 579331970 577188110 577208176 576967125 575839157 577280312 579450150
587.3 579450150 580353165 581721649 583325195 582317467 580785980 579746017 577834206 577954102 579336700
596 579336700 579423103 578664284 578578148 577767181 575904579 573685150 569981041 566393166 562425728 557826271
$$ packed form
535.2E80882568n60073n78461k900505k011872k24723Q07151J613350J919785L412819
543.9E82360039K523918J942558r72252j924209r43070j856994n99289m64745M98924
552.6E80564880M68521N82543K620354K143859j14479j300773p63893j581078j740723
561.3E80879211j102256J020965K365341J541901J406097J11771N78842M81072j209564
570E86073380j492730k697677k876549p56683J219787N7678J351052K055397K07672
578.6E83141327L04794j193580k920571k143860K0066k41051j127968J441155K169838
587.3E79450150R03015J368484J603546j007728j531487j039963j911811J19896J382598
596E79336700Q6403p58819q6136q10967j862602k219429l704109l587875l967438m599457
$$ plain form
605.6 557826271 552326202 546401901 539755020 531132088 521527023 508518257 495078850 482402649
613.4 482402649 472950134 467854042 465167007 467012787 468472023 466418877 460826607 453545151
621.1 453545151 443843575 432834206 424875298 421940842 428471413 442085571 460182076 476368332
628.8 476368332 490988846 503809357 511332321 514999886 513764572 508845634 499447861 489133759
636.5 489133759 481545715 476504211 474797592 477033768 487044182 501625786 520076218 539132423
644.2 539132423 556196671 569447479 578364601 584994888 589854469 593983765 596860199 598545609
651.9 598545609 600908928 605015717 609180908 611222382 611859360 611576614 610605049 610085068 609712143
660.6 609712143 609052849 609102783 612021484 616416245 619426308 621774101 623029366 616566505 617049446
$$ packed form
605.6E57826271n500069n924301o646881q622932r605065j3008766j3439407j2676201
613.4D82402649r452515n096092k687035J845780J459236k053146n592270p281456
621.1D53545151r701576j1009369p958908k934456O530571J3614158J8096505J6186256
628.8D76368332J4620514J2820511P522964L667565j235314m918938r397773j0314102
636.5D89133759p588044n041504j706619K236176J0010414J4581604J8450432J9056205
644.2E39132423J7064248J3250808Q917122O630287M859581M129296K876434J685410
651.9E98545609K363319M106789M165191K041474O36978k82746r71565n19981l72925
660.6F09712143o59294M9934K918701M394761L010063K347793J255265o462861M82941
$$ plain form
669.3 617049446 617851524 617150345 616917152 617658768 619301147 621206970 623857956 626435623 627781448
678 627781448 627628326 627733765 628098907 626611366 625037689 624560242 625317574 625924225 625601349 625872002
687.6 625872002 626496201 627290382 625917320 622945251 620596161 617891350 615367813 613860893 614219322
696.3 614219322 614604263 614874001 615927544 615314560 613947258 612512627 612097168 611625748 609361534
705 609361534 608974686 610744667 613456383 616764488 619728622 621541939 623315201 625812302 626150589
713.7 626150589 625326118 625479126 625541992 626883087 630316811 633642883 636561508 639598846 641698837
722.3 641698837 642192230 641543579 640690079 639316063 637716179 636862373 636320877 636945114 638437157
731 638437157 639833069 640912018 640558548 639422607 636867371 633874016 632170982 630546837 631111145
$$ packed form
669.3F17049446Q02078p01179k33193P41616J642379J905823K650986K577667J345825
678F27781448j53122J05439L65142j487541j573677m77447P57332O06651l22876K70653
687.6F25872002O24199P94181j373062k972069k349090k704811k523537j506920L58429
696.3F14219322L84941K69738J053543o12984j367302j434631m15459m71420k264214
705F09361534l86848J769981K711716L308105K964134J813317J773262K497101L38287
713.7F26150589q24471J53008O2866J341095L433724L326072K918625L037338K099991
722.3F41698837M93393o48651q53500j374016j599884q53806n41496O24237J492043
731F38437157J395912J078949l53470j135941k555236k993355j703034j624145N64308
$$ plain form
739.7 631111145 633493500 635121155 636822319 639142418 641574173 642415237 641639786 641356506 642403183
748.4 642403183 643949814 645637589 648115463 651482620 657104568 663039093 666385345 668180847
756.1 668180847 667624817 667195816 668019791 667453690 667107010 668782272 671890793 674963455 677761230
764.8 677761230 679906235 679830856 677733841 674541321 670969315 668132019 666876526 667874908 669876709
773.5 669876709 672055359 675460663 679410706 682401276 683592300 684029999 684301453 683359222 682741318
782.1 682741318 682795334 684058762 687644730 692709427 698004227 701436234 702142715 700464706 698528671
790.8 698528671 696160583 692989197 691688919 692763824 695308533 698519669 702293777 704192505
798.5 704192505 704491272 704706345 701912766 697851105 695215225 693892670 693315125 694749374 697922287
$$ packed form
739.7F31111145K382355J627655J701164K320099K431755Q41064p75451k83280J046677
748.4F42403183J546631J687775K477874L367157N621948N934525L346252J795502
756.1F68180847n56030m29001Q23975n66101l46680J675262L108521L072662K797775
764.8F77761230K145005p5379k097015l192520l572006k837296j255493R98382K001801
773.5F69876709K178650L405304L950043K990570J191024M37699K71454r42231o17904
782.1F82741318N4016J263428L585968N064697N294800L432007P06481j678009j936035
790.8F98528671k368088l171386j300278J074905K544709L211136L774108J898728
798.5G04192505K98767K15073k793579m061661k635880j322555n77545J434249L172913
$$ plain form
807.2 697922287 701768112 706243362 708075562 707155838 704792480 702031174 698617706 695394592 695252380
815.9 695252380 696733093 700271225 704289246 706963654 709073639 709223557 707924118 704743500 700382462
824.6 700382462 697098389 695396271 693083878 691779633 694617844 697131882 696633759 694662323 691521225
833.3 691521225 686669846 680435562 673848267 668414688 664751053 662675095 662556610 662783813 662051544
841.9 662051544 661304932 660133286 657013092 652631836 648506546 645312271 644190216 645574265 649389343
850.6 649389343 654565964 659841461 665244064 669362488 671286011 671281509 669341965 667898407 668868637
859.3 668868637 671656570 676421280 682342453 686901779 690726700 693322678 693588028 692914200 689824753
868 689824753 685866699 683746567 683804474 686277313 690479736 695585098 700320206 703004608 702888565
$$ packed form
807.2F97922287L845825M475250J832200r19724k363358k761306l413468l223114j42212
815.9F95252380J480713L538132M018021K674408K109985J49918j299439l180618m361038
824.6G00382462l284073j702118k312393j304245K838211K514038m98123j971436l141098
833.3F91521225m851379o234284o587295n433579l663635k075958j18485K27203p32269
841.9F62051544p46612j171646l120194m381256m125290l194275j122055J384049L815078
850.6F49389343N176621N275497N402603M118424J923523m502j939544j443558R70230
859.3F68868637K787933M764710N921173M559326L824921K595978K65350o73828l089447
868F89824753l958054k120132N7907K472839M202423N105362M735108K684402j16043
$$ plain form
876.7 702888565 701637039 698717575 693768616 689004974 685014954 682966766 683728790 685845337 688197861
885.3 688197861 690342102 689965286 687036972 683486938 679004135 674532700 671841965 671739349 673744507
894 673744507 677753906 681915741 684581604 686954422 687640457 685663834 682289200 678589706 675071030
902.7 675071030 673486633 673997269 674832382 677196655 679395981 679552612 677666931 673108292 667192307
911.4 667192307 660428543 654537201 650869446 649025497 648356171 647973404 648329086 648906937 647076874
920 647076874 643346252 638865585 632387695 626123619 622046127 619815178 619700661 620928116 623027153
928.7 623027153 625962791 627608490 627201920 625774536 623540001 620983429 619734955 621021729 624149132
937.4 624149132 629218369 635940361 642689590 648394394 652703781 656120224 657307816 656004791
$$ packed form
876.7G02888565j251526k919464m948959m763642l990020k048188P62024K116547K352524
885.3F88197861K144241l76816k928314l550034m482803m471435k690735j02616K005158
894F73744507M009399M161835K665863K372818O86035j976623l374634l699494l518676
902.7F75071030j584397N10636Q35113K364273K199326J56631j885681m558639n915985
911.4F67192307o763764n891342l667755j843949o69326l82767L55682N77851j830063
920F47076874l730622m480667o477890o264076m077492k230949j14517J227455K099037
928.7F23027153K935638J645699m06570j427384k234535k556572j248474J286774L127403
937.4F24149132N069237O721992O749229N704804M309387L416443J187592j303025
$$ plain form
945.1 656004791 654717102 655718231 658660049 662287979 667432098 672501984 675923157 678483810
952.8 678483810 678626099 675615158 670973511 666250687 662525711 659939575 659245911 660051193 661269760
961.5 661269760 661492462 660528030 657511292 651768570 645688782 639614067 634564629 631563034 631046028
970.2 631046028 632372971 634077377 636151466 636875992 636002922 633910866 630206223 626019096 622193108
978.9 622193108 619115257 617366676 617604446 618580093 619420280 619949608 619229126 615945625 610315781
987.6 610315781 604065552 597973175 592408562 587229614 582930260 577021675 566938210 552207718
995.3 552207718 538453751 538061333 549188156 560374031 565402718 566575432 566916618 566850891 567873535
1004 567873535 569297791 570903282 571901436 571659164 570201759 566993446 563465538 559159393 554650383
$$ packed form
945.1F56004791j287689J001129K941818L627930N144119N069886L421173K560653
952.8F78483810J42289l010941m641647m722824l724976k586136o93664Q05282J218567
961.5F61269760K22702r64432l016738n742722o079788o074715n049438l001595n17006
970.2F31046028J326943J704406K074089P24526q73070k092056l704643m187127l825988
978.9F22193108l077851j748581K37770R75647Q40187N29328p20482l283501n629844
987.6F10315781o250229o092377n564613n178948m299354n908585j0083465j4730492
995.3E52207718j3753967l92418J1126823J1185875N028687J172714L41186o5727J022644
1004E67873535J424256J605491R98154k42272j457405l208313l527908m306145m509010
$$ plain form
1012.6 554650383 551834145 550929108 551197128 551734657 551364517 550085564 548221512 544289627 538644333
1021.3 538644333 533106461 529297676 526301346 524503708 524301643 524096680 524356079 523389206 521928062
1030 521928062 518952522 514618454 510927010 506574249 503435898 501483765 501273575 501596413 501998825
1038.7 501998825 503080139 503566093 503277092 500961266 498129387 494816895 493239555 493547440 494192467
1047.4 494192467 496927986 500405350 503974037 505295639 505005379 504073486 502406006 500653000 500674019
1056 500674019 502439117 501652718 502427139 504545174 505881157 506949043 506680679 505539169 502605400
1064.7 502605400 500434647 497675285 495753517 495443230 495099220 496650772 497680931 498791313 498814125
1073.4 498814125 497800140 494857903 490854568 488444099 485508537 484257088 483665810 484868851
$$ packed form
1012.6E54650383k816238r05037K68020N37529l70140j278953j864052l931885n645294
1021.3E38644333n537872l808785k996330j797638k02065k04963K59399r66873j461144
1030E21928062k975540m334068l691444m352761l138351j952133k10190L22838M02412
1038.7E01998825J081314M85954k89001k315826k831879l312492j577340L07885O45027
1047.4D94192467K735519L477364L568687J321602k90260r31893j667480j753006K1019
1056E00674019J765098p86399P74421K118035J335983J067886k68364j141510k933769
1064.7E02605400k170753k759362j921768l10287l44010J551552J030159J110382K2812
1073.4D98814125j013985k942237m003335k410469k935562j251449n91278J203041
$$ plain form
1081.1 484868851 487172623 488968964 489353714 487515335 486303101 482653503 478168831 473491135
1088.8 473491135 469415512 466121178 461334534 457466431 452585144 447320175 438207169 426484604
1096.5 426484604 415169868 403045349 391980247 380550156 371225891 360723419 351066093 341577530
1104.2 341577530 330975838 321380730 309198265 298470535 287798767 278783398 269201622 261075821
1112 261075821 254557800 247792645 245545750 241731339 240832806 239407501 238497868 239083328 238924904
1120.6 238924904 241418953 242070179 245469170 247500191 250187531 253032894 254050770 255711002
1128.4 255711002 255258121 256904488 255865707 254053078 250434361 246851158 244146729 239188175
1136.1 239188175 237400856 233466034 231209126 227663021 223710976 220787430 215677032 212069359
$$ packed form
1081.1D84868851K303772J796341L84750j838379j212234l649598m484672m677696
1088.8D73491135m075623l294334m786644l868103m881287n264969r113006j1722565
1096.5D26484604j1314736j2124519j1065102j1430091r324265j0502472r657326r488563
1104.2C41577530j0601692r595108j2182465j0727730j0671768r015369r581776q125801
1112B61075821o518021o765155k246895l814411q98533j425305r09633N85460j58424
1120.6B38924904K494049O51226L398991K031021K687340K845363J017876J660232
1128.4B55711002m52881J646367j038781j812629l618717l583203k704429m958554
1136.1B39188175j787319l934822k256908l546105l952045k923546n110398l607673
$$ plain form
1143.8 212069359 206245689 203168964 198413048 194303017 191245861 188126774 188080940 185469437 185829163
1152.5 185829163 184709148 185165844 185934544 186610546 189257870 189573002 193594780 195802498 200005379
1161.1 200005379 203640232 206317120 210777569 214014130 219832153 223937664 230215340 235703373
1168.9 235703373 242337627 250268135 257083988 266362514 274538994 284424725 292189274 300994167
1176.6 300994167 309848881 317665100 327048187 334988823 344877510 353242531 362890129 372662468
1184.3 372662468 380977135 388738365 394219055 400082703 404696693 410306282 415060616 420369110
1192 420369110 426952324 432969704 439947205 445884743 452479553 457483482 462123299 466500511 470248756
1200.7 470248756 474997673 479530563 485894241 491935196 498301010 504053154 508531227 511977310
$$ packed form
1143.8B12069359n823670l076725m755916m110031l057156l119087m5834k611503L59726
1152.5A85829163j120015M56696P68700O76002K647324L15132M021778K207718M202881
1161.1B00005379L634853K676888M460449L236561N818023M105511O277676N488033
1168.9B35703373O634254P930508O815853R278526Q176480R885731P764549Q804893
1176.6C00994167Q854714P816219R383087P940636R888687Q365021R647598R772339
1184.3C72662468Q314667P761230N480690N863648M613990N609589M754334N308494
1192D20369110O583214O017380O977501N937538O594810N003929M639817M377212L748245
1200.7D70248756M748917M532890O363678O040955O365814N752144M478073L446083
$$ plain form
1208.4 511977310 513759384 515701981 516111908 517899857 520921440 523975525 527827263 531647377
1216.1 531647377 535532532 537452545 538673859 539025841 538477898 536939774 535294113 535704269 536431084
1224.8 536431084 538558731 541145630 543888779 546065636 546682625 546435699 545062675 543983574 542663689
1233.5 542663689 542314072 543026924 544880791 547761345 550138779 552476654 553516998 554099350 553688545
1242.2 553688545 552411690 550892906 549789009 550443687 551524200 553973351 556218758 558199234
1249.9 558199234 559783249 560127144 559840012 558387260 557244949 555726166 555218391 556020737 557661972
1258.5 557661972 560363274 562848206 565320969 566024361 566252174 565897141 564882317 563944778 563084259
1267.2 563084259 564378281 566253433 569017792 572133636 575375290 578144455 579420280 580217896
$$ packed form
1208.4E11977310J782074J942597M09927J787949L021583L054085L851738L820114
1216.1E31647377L885155J920013J221314L51982n47943j538124j645661M10156P26815
1224.8E36431084K127647K586899K743149K176857O16989k46926j373024j079101j319885
1233.5E42663689l49617P12852J853867K880554K377434K337875J040344N82352m10805
1242.2E53688545j276855j518784j103897O54678J080513K449151K245407J980476
1249.9E58199234J584015L43895k87132j452752j142311j518783n07775Q02346J641235
1258.5E57661972K701302K484932K472763P03392K27813l55033j014824r37539q60519
1267.2E63084259J294022J875152K764359L115844L241654K769165J275825P97616
$$ plain form
1274.9 580217896 579956512 580009041 580175896 581427383 583996010 586994781 591126060 594661942 597742805
1283.6 597742805 600022964 601369858 601767731 601286850 601412010 602483177 604688339 607483749 611217499
1292.3 611217499 615102959 618411789 620938683 622044334 622189217 621639519 620880470 620520058 621315804
1301 621315804 623172569 625780411 628964424 631650658 633685112 634542313 634142075 632774086 631619110
1309.7 631619110 631642036 631372986 631283531 632617950 635052681 637668991 639577332 640691299 640890884
1318.3 640890884 639972878 638688431 638073616 638003006 638549347 639944229 641976318 644736938 647421951
1327 647421951 648878403 649054337 648327103 647060699 645417099 644050369 643372803 643971939 645149918
1335.7 645149918 646373444 647720871 648155212 647851334 647331009 647210693 646602173 644879227 644178619
$$ packed form
1274.9E80217896k61384N2529J66855J251487K568627K998771M131279L535882L080863
1283.6E97742805K280159J346894L97873m80881J25160J071167K205162K795410L733750
1292.3F11217499L885460L308830K526894J105651J44883n49698p59049l60412P95746
1301F21315804J856765K607842L184013K686234K034454Q57201m00238j367989j154976
1309.7F31619110K2926k69050q9455J334419K434731K616310J908341J113967J99585
1318.3F40890884r18006j284447o14815p0610N46341J394882K032089K760620K685013
1327F47421951J456452J75934p27234j266404j643600j366730o77566N99136J177979
1335.7F45149918J223526J347427M34341l03878n20325j20316o08520j722946p00608
$$ plain form
1344.4 644178619 644252243 644805679 646515427 648432541 649554214 649979858 649882126 648391953 646468506
1353.1 646468506 644454346 642368393 641422043 641671753 642617645 644089508 645935822 646166763 644840622
1361.7 644840622 642775879 640154266 640120621 639191628 637506065 636545067 636073608 637187386 638153419
1370.4 638153419 638300591 637709999 636073914 632849159 630079994 629640083 629487152 628357658 628324814
1379.1 628324814 629639244 630691414 631681328 632062035 631547241 630695457 629832039 628861275 627479210
1387.8 627479210 628294449 629588966 630450668 631565285 632632446 633199615 631182365 628942184 629571381
1396.4 629571381 628858261 626825562 624136047 623812294 625065765 625364304 625436096 625364189 624136925
1405.1 624136925 623941116 623771286 622476273 621055908 619709892 618699951 618146858 618648682 619854050
$$ packed form
1344.4F44178619P3624N53436J709748J917114J121673M25644r7732j490173j923447
1353.1F46468506k014160k085953r46350K49710R45892J471863J846314K30941j326141
1361.7F44840622k064743k621613l3645r28993j685563r60998m71459J113778R66033
1370.4F38153419J47172n90592j636085l224755k769165m39911j52931j129494l2844
1379.1F28324814J314430J052170R89914L80707n14794q51784q63418r70764j382065
1387.8F27479210Q15239J294517Q61702J114617J067161N67169k017250k240181O29197
1396.4F29571381p13120k032699k689515l23753J253471K98539P1792p1907j227264
1405.1F24136925j95809j69830j295013j420365j346016j009941n53093N01824J205368
$$ plain form
1413.8 619854050 620778275 621098061 620441399 619819527 619356155 614503746 614714317 617171288 617674484
1422.5 617674484 617256393 617668190 620561905 623050194 623375092 623605499 623188934 621889763 622282486
1431.2 622282486 623047829 623284264 624291611 626166382 626562653 625554123 628654518 631854401 633251228
1439.8 633251228 633283920 632857437 632438622 632949066 633359222 634418221 635604134 635788460 636341591
1448.5 636341591 638477554 639941711 639287109 638654404 638931503 639328423 638589592 637664452 634855728
1457.2 634855728 634341087 641200485 645790863 649216995 650773087 650827255 651824646 648648148 648925629
1465.9 648925629 651991806 654375305 656258545 657753525 659425964 657914505 656074677 658990173
1473.6 658990173 663964233 667847977 668135834 670240021 673351135 675595856 677131195 678049698 680344772
$$ packed form
1413.8F19854050R24225L19786o56662o21872m63372m852409K10571K456971N03196
1422.5F17674484m18091M11797K893715K488289L24898K30407m16565j299171L92723
1431.2F22282486P65343K36435J007347J874771L96271j008530L100395L199883J396827
1439.8F33251228L2692m26483m18815N10444M10156J058999J185913J84326N53131
1448.5F36341591K135963J464157o54602o32705K77099L96920p38831r25140k808724
1457.2F34855728n14641O859398M590378L426132J556092N4168R97391l176498K77481
1465.9F48925629L066177K383499J883240J494980J672439j511459j839828K915496
1473.6F58990173M974060L883744K87857K104187L111114K244721J535339R18503K295074
$$ plain form
1482.3 680344772 682456055 683294830 683362503 683078384 681242752 679549789 680213242 677866974 678557892
1491 678557892 682332535 684335632 684312973 683459778 681476517 674654694 676287308 676373520 674585800
1499.6 674585800 675899200 675246506 674740372 674296417 674203110 671607056 657638474 651716614 655107956
1508.3 655107956 658900757 659488602 660719376 658942108 656573257 657018127 655363159 653568420 648414154
1517 648414154 646442871 649707184 650710754 645178833 640052338 642349930 644584732 645771637 642989883
1525.7 642989883 643366623 643807755 642134628 642398071 642638168 641576920 639449120 636846161 633886604
1534.3 633886604 635845871 636789627 636673698 637291031 628940544 620400352 624310150 626185608 626074791
1543 626074791 628145485 629418335 629220047 632060890 633123970 633650932 632144470 630954285 633554687
$$ packed form
1482.3F80344772K111283Q38775O7673k84119j835632j692963O63453k346268O90918
1491F78557892L774643K003097k2659q53195j983261o821823J632614Q6212j787720
1499.6F74585800J313400o52694n06134m43955r3307k596054j3968582n921860L391342
1508.3F55107956L792801N87845J230774j777268k368851M44870j654968j794739n154266
1517F48414154j971283L264313J003570n531921n126495K297592K234802J186905k781754
1525.7F42989883L76740M41132j673127K63443K40097j061248k127800k602959k959557
1534.3F33886604J959267R43756j15929O17333q350487q540192L909798J875458j10817
1543F26074791K070694J272850j98288K840843J063080N26962j506462j190185K600402
$$ plain form
1551.7 633554687 634110641 634216843 632335167 634038811 637421761 638211479 628993797 615565872 629673500
1560.4 629673500 637941895 642145386 644321060 644805527 643872452 644881821 646982498 647175369 645437698
1569.1 645437698 640992126 644904251 647897797 647820892 647616196 647450638 646480255 638427811 640898132
1577.7 640898132 643102188 642545395 641972961 640587845 639977150 638406715 637512207 636003075 634029884
1586.4 634029884 632554779 630062523 628647690 625915565 623741760 621101379 619103775 617155190
1594.1 617155190 614342651 613127403 610890007 609316254 606194496 604012032 601417046 598053474
1601.9 598053474 595801697 592556038 591692162 589296303 587179756 584674492 582827873 580606041
1609.6 580606041 576590118 575497131 572724686 571064453 568009377 566092796 563617477 554696350
$$ packed form
1551.7F33554687N55954J06202j881676J703644L382950P89718r217682j3427925J4107628
1560.4F29673500Q268395M203491K175674M84467r33075J009369K100677J92871j737671
1569.1F45437698m445572L912125K993546p6905k04696j65558r70383q052444K470321
1577.7F40898132K204056n56793n72434j385116o10695j570435q94508j509132j973191
1586.4F34029884j475105k492256j414833k732125k173805k640381j997604j948585
1594.1F17155190k812539j215248k237396j573753l121758k182464k594986l363572
1601.9E98053474k251777l245659q63876k395859k116547k505264j846619k221832
1609.6E80606041m015923j092987k772445j660233l055076j916581k475319q921127
$$ plain form
1617.3 554696350 557475166 557326775 556591797 554116402 552512856 548909149 543836746 545342712 544302788
1626 544302788 543702316 539639359 538887177 539213448 538016968 537193184 534717903 534398918 532322044
1634.6 532322044 525803032 523999786 526150436 527503777 527720604 529003296 528050385 528822899 527889977
1643.3 527889977 528377075 528602715 524053268 523015251 522010536 527526054 529804840 532733345 535443001
1652 535443001 529003067 524128342 528541756 534893417 536820526 538992043 540593605 542227554 544073067
1660.7 544073067 545581894 547678070 548109627 552284584 554692116 556715622 558135338 557882690 557718735
1669.4 557718735 559558563 564246254 566354828 570770607 574575844 575425568 577168770 580352974
1677.1 580352974 583904190 585404129 587062531 588100052 592119446 595219421 590616760 592297134
$$ packed form
1617.3E54696350K778816j48391p34978k475395j603546l603707n072403J505966j039924
1626E44302788o00472m062957p52182L26271j196480q23784k475281l18985k076874
1634.6E32322044o519012j803246K150650J353341K16827J282692r52911P72514r32922
1643.3E27889977M87098K25640m549447j038017j004715N515518K278786K928505K709656
1652E35443001o439934m874725M413414O351661J927109K171517J601562J633949J845513
1660.7E44073067J508827K096176M31557M174957K407532K023506J419716k52648j63955
1669.4E57718735J839828M687691K108574M415779L805237Q49724J743202L184204
1677.1E80352974L551216J499939J658402J037521M019394L099975m602661J680374
$$ plain form
1684.8 592297134 599361305 606732216 609730530 611820412 615207100 617881737 622222366 625221519
1692.5 625221519 628791313 632701607 635162010 632080078 638342705 645779724 650803986 652731476
1700.2 652731476 649027328 657681274 663401642 665967102 668672943 671996460 675974503 680497513
1707.9 680497513 685126572 686970978 688257446 690779877 692265701 693157501 691698990 693253326
1715.6 693253326 697723312 698729248 695391541 701180344 706550903 708978195 709947662 709539108 710133514
1724.3 710133514 711963196 713031082 714301300 716057281 717685776 716189728 716444550 719575729
1732 719575729 720415039 714876404 710270996 717251511 721761322 723448486 725529785 724397507 724469147
1740.7 724469147 728940659 731045837 730062027 731031799 733396530 734109497 734469757 734481354 736137848
$$ packed form
1684.8E92297134P064171P370911K998314K089882L386688K674637M340629K999153
1692.5F25221519L569794L910294K460403l081932O262627P437019N024262J927490
1700.2F52731476l704148Q653946N720368K565460K705841L323517L978043M523010
1707.9F80497513M629059J844406J286468K522431J485824Q91800j458511J554336
1715.6F93253326M469986J005936l337707N788803N370559K427292R69467m08554N94406
1724.3G10133514J829682J067886J270218J755981J628495j496048K54822L131179
1732G19575729Q39310n538635m605408O980515M509811J687164K081299j132278P1640
1740.7G24469147M471512K105178r83810R69772K364731P12967L60260J1597J656494
$$ plain form
1749.4 736137848 741149063 742296829 743859634 749139099 751569061 752433548 752743530 750578613 751982574
1758.1 751982574 754166336 756427231 758877106 756264420 757565613 761784439 763010330 763420715
1765.8 763420715 764183731 763918839 761205978 762924728 765111465 762989044 759855499 761517181 766837463
1774.5 766837463 768565674 767665558 769189606 769309158 769619064 768663025 767142487 769665756 772945480
1783.2 772945480 774416428 773164520 773337936 775218506 775502396 774702301 774415817 773114395 771974945
1791.8 771974945 769870148 771627960 776218796 777191544 777045288 778667603 779529266 777959671 775787048
1800.5 775787048 776719818 776447525 777548752 779867554 780836792 781812515 782148514 782015915 782318344
1809.2 782318344 782122955 780189743 780179291 781018219 781411133 782696075 783419495 784259338 784647751
$$ packed form
1749.4G36137848N011215J147766J562805N279465K429962Q64487L09982k164917J403961
1758.1G51982574K183762K260895K449875k612686J301193M218826J225891M10385
1765.8G63420715P63016k64892k712861J718750K186737k122421l133545J661682N320282
1774.5G66837463J728211r00116J524048J19552L09906r56039j520538K523269L279724
1783.2G72945480J470948j251908J73416J880570K83890q00095k86484j301422j139450
1791.8G71974945k104797J757812M590836R72748j46256J622315Q61663j569595k172623
1800.5G75787048R32770k72293J101227K318802R69238R75723L35999j32599L02429
1809.2G82318344j95389j933212j0452Q38928L92914J284942P23420Q39843L88413
$$ plain form
1817.9 784647751 785228958 785941315 785447083 784996567 783882751 784271927 784188309 781429672 783365631
1826.5 783365631 786423569 787581787 785919876 782658539 784905243 787363129 787071915 786794510 786934662
1835.2 786934662 787065811 786653976 787057877 789171677 790056686 790637741 790127182 789787369 788101044
1843.9 788101044 782510452 785348206 787804794 787752914 788584061 790377045 791706390 791983643 792300262
1852.6 792300262 792083206 791921310 791153946 790188065 789837494 789609985 790500031 791685257 792829132
1861.3 792829132 793166046 793806610 793994446 793062668 792204056 790222626 789297638 787775650 787676773
1869.9 787676773 790893784 793382187 794322052 794373779 794696426 794359818 793625107 792721329 792155228
1878.6 792155228 792007675 791967316 793006058 793701096 794524765 794749985 794747086 795189743 794549103 794323349
$$ packed form
1817.9G84647751N81207P12357m94232m50516j113816L89176q3618k758637J935959
1826.5G83365631L057938J158218j661911l261337K246704K457886k91214k77405J40152
1835.2G86934662J31149m11835M03901K113800Q85009N81055n10559l39813j686325
1843.9G88101044n590592K837754K456588n1880Q31147J792984J329345K77253L16619
1852.6G92300262k17056j61896p67364r65881l50571k27509Q90046J185226J143875
1861.3G92829132L36914O40564J87836r31778q58612j981430r24988j521988r8877
1869.9G87676773L217011K488403R39865N1727L22647l36608p34711r03778n66101
1878.6G92155228j47553m0359J038742O95038Q23669K25220k899M42657o40640k25754
$$ plain form
1888.3 794323349 792543640 790302734 791700287 793480377 794551163 795190811 794684753 794438171 795659714
1896.9 795659714 795589981 794703445 794009171 793669662 793537292 793366089 794258270 795042114 795930634 796414719
1906.6 796414719 795978317 795476685 794814911 793931656 793219681 793612137 793904648 794316788 794641647 795481262
1916.2 795481262 796605377 794239578 793872223 795440903 795432205 794217300 791741257 791672363 793303757
1924.9 793303757 794321594 794986191 795961456 796397781 796070557 795677338 795166321 794386978 793245850
1933.6 793245850 792949066 793009415 793752136 795023880 795528488 795778885 795904083 796372299 794450607
1942.3 794450607 791486969 792348022 792883606 792397156 792831802 793832779 794630051 795324478 795383224
1951 795383224 795258713 795240097 794643478 793677826 792707977 792685699 792856598 793300400 794220581 794951477
$$ packed form
1888.3G94323349j779709k240906J397553J780090J070786O39648n06058k46582J221543
1896.9G95659714o9733q86536o94274l39509j32370j71203Q92181P83844Q88520M84085
1906.6G96414719m36402n01632o61774q83255p11975L92456K92511M12140L24859Q39615
1916.2G95481262J124115k365799l67355J568680q698j214905k476043o8894J631394
1924.9G93303757J017837O64597R75265M36325l27224l93219n11017p79343j141128
1933.6G93245850k96784O0349P42721J271744N04608K50397J25198M68216j921692
1942.3G94450607k963638Q61053N35584m86450M34646J000977P97272O94427N8746
1951G95383224j24511j8616n96619r65652r69849k2278J70899M43802R20181P30896
$$ plain form
1960.6 794951477 795644531 795412827 795007401 794335556 793360291 792377777 791093140 791298447 792365036
1969.3 792365036 793320312 794103928 794612885 794920654 795149994 794714584 793691635 792968140 792183990
1978 792183990 791845016 791932831 792366104 792867126 793217926 793713531 793451691 793203278 792824097 791751022
1987.6 791751022 790422745 789894333 790598831 790496597 790140991 791515961 793047104 793205109 792757492
1996.3 792757492 792097015 791360931 791011124 790303345 790199127 790474625 790635452 791047363 791627350 792180176
2005.9 792180176 791756973 791290207 790846710 790286789 789737015 789154587 789301529 789502106 789938812 790669250
2015.6 790669250 790753174 790061188 789959641 789962540 789297256 788991394 788406448 787860336 787559738 787793274
2025.2 787793274 788675385 789103088 789572754 789740601 789326706 788428726 787529602 786918182 786582184 786783829
$$ packed form
1960.6G94951477O93054k31704m05426o71845r75265r82514j284637K05307J066589
1969.3G92365036R55276P83616N08957L07769K29340m35410j022949p23495p84150
1978G92183990l38974Q7815M33273N01022L50800M95605k61840k48413l79181j073075
1987.6G91751022j328277n28412P04498j02234l55606J374970J531143J58005m47617
1996.3G92757492o60477p36084l49807p07779j04218K75498J60827M11911N79987N52826
2005.9G92180176m23203m66766m43497n59921n49774n82428J46942K00577M36706P30438
2015.6G90669250Q3924o91986j01547K899o65284l05862n84946n46112l00598K33536
2025.2G87793274Q82111M27703M69666J67847m13895q97980q99124o11420l35998K01645
$$ plain form
2034.9 786783829 786933670 787308426 787762680 788179550 788305511 787985840 787475433 786914291 786493683 785560913
2044.5 785560913 785354996 785866547 786284332 786664658 786683655 786887131 786956558 786937866 786388702 785570450
2054.1 785570450 785136414 784571762 784354324 784594269 785004120 785145111 785533524 785802460 785419998 784857635
2063.8 784857635 783810425 782865372 782548218 782937469 782920074 782848358 783420715 783605728 783694153 783146744
2073.4 783146744 782085266 781103439 780567627 780108032 779310074 779071045 779088745 779447403 779724426 779894409
2083.1 779894409 780028915 779702759 779428635 778922729 778368378 778017578 778089905 778245316 778624725 779236374
2092.7 779236374 779488602 779767227 779508591 779481583 779555359 779259262 779330750 779261856 779258804 779651718 780204773
2103.3 780204773 780344696 780958633 781501541 781115646 781023331 780804520 780665512 780465088 780481720 781026993
$$ packed form
2034.9G86783829J49841L74756M54254M16870J25961l19671n10407n61142m20608r32770
2044.5G85560913k05917N11551M17785L80326J8997K03476O9427j8692n49164q18252
2054.1G85570450m34036n64652k17438K39945M09851J40991L88413K68936l82462n62363
2063.8G84857635j047210r45053l17154L89251j7395p1716N72357J85013Q8425n47409
2073.4G83146744j061478r81827n35812m59595p97958k39029J7700L58658K77023J69983
2083.1G79894409J34506l26156k74124n05906n54351l50800P2327J55411L79409O11649
2092.7G79236374K52228K78625k58636k7008P3776k96097P1488o8894l052L92914N53055
2103.3G80204773J39923O13937N42908l85895r2315k18811j39008k00424J6632N45273
$$ plain form
2113 781026993 781429825 781797638 782004395 782386932 782438965 782073822 781515350 781220245 781023712 780509567
2122.6 780509567 780711060 781029434 781260452 781182861 781126022 781239166 780866699 780842133 780617294 780016022
2132.3 780016022 779478455 779652100 780129395 780321884 780748291 781090546 781635284 781547928 781217117 781202087
2141.9 781202087 780975113 780827866 780661469 780989304 781337433 781926270 782586975 782754517 782934952 782857361
2151.5 782857361 782635956 782303848 782118683 781749039 781960907 782635345 782624817 783094711 783791351 784007187
2161.2 784007187 783522415 783198700 783387756 783255920 782676849 782085953 782424240 782723846 783003693 783294296
2170.8 783294296 783421860 783624420 783138199 782933273 782561646 782106857 782080841 781622314 781191177 781192169
2180.5 781192169 781552277 781811066 782057037 782216415 782279587 782325745 782304382 782416306 782585220 782784424
$$ packed form
2113G81026993M02832L67813K06757L82537N2033l65143n58472k95105j96533n14145
2122.6G80509567K01493L18374K31018p7591n6839J13144l72467k4566k24839o01272
2132.3G80016022n37567J73645M77295J92489M26407L42255N44738q7356l30811j5030
2141.9G81202087k26974j47247j66397L27835L48129N88837O60705J67542J80435p7591
2151.5G82857361k21405l32108j85165l69644K11868O74438j0528M69894O96640K15836
2161.2G84007187m84772l23715J89056j31836n79071n90896L38287K99606K79847K90603
2170.8G83294296J27564K02560m86221k04926l71627m54789k6016m58527m31137R92
2180.5G81192169L60108K58789K45971J59378O3172M6158k1363J11924J68914J99204
$$ plain form
2190.1 782784424 782897034 783512802 783711166 783719406 784557648 785139694 785343704 785058136 784745789 784306564
2199.8 784306564 784189911 784647598 785095901 786028061 786378937 786491013 786680832 786812592 786785660 786161270
2209.4 786161270 785819855 785667648 785859299 786059341 786581650 787223282 787239456 787459030 787711411 787754211
2219 787754211 787103348 786427994 785917892 785903625 786438751 786423035 786963120 787196045 787049637 787310257
2228.7 787310257 787462540 787367020 786732025 786547470 786441269 786042252 785851822 786149979 786544647 786716156
2238.3 786716156 787240829 787604218 787573318 786985474 786642303 786630325 786320496 786033707 785879898 786191864
2248 786191864 786168900 786417694 787098083 787275543 786988525 786556244 786332092 785655365 785597076 785967789
2257.6 785967789 786219482 786787186 787036133 787108841 787222061 787801285 787575455 786806564 786560669 786198807
$$ packed form
2190.1G82784424J12610O15768J98364Q240Q38242N82046K04010k85568l12347m39225
2199.8G84306564j16653M57687M48303R32160L50876J12076J89819J31760k6932o24390
2209.4G86161270l41415j52207J91651K00042N22309O41632J6174K19574K52381M2800
2219G87754211o50863o75354n10102j4267N35126j5716N40085K32925j46408K60620
2228.7G87310257J52283r5520o34995j84555j06201l99017j90430K98157L94668J71509
2238.3G86716156N24673L63389l0900n87844l43171j1978l09829k86789j53809L11966
2248G86191864k2964K48794O80389J77460k87018m32281k24152o76727n8289L70713
2257.6G85967789K51693N67704K48947P2708J13220N79224k25830p68891k45895l61862
$$ plain form
2267.3 786198807 785977402 786065674 786683960 786962280 787179031 787320328 787331238 787454605 786731796 786500549
2276.9 786500549 786516190 786389694 786464996 786621246 786825256 787063141 787641983 787502289 787500687 787376785
2286.5 787376785 786795502 786621094 786356277 786318970 786034317 786181107 786710205 787544098 788093643 787431030
2296.2 787431030 787034988 786710281 786602020 786066055 785735092 786085358 786064911 786651306 787045135 787307892
2305.8 787307892 787296371 787105408 787035446 786587067 786277008 785757599 785699234 785262299 785269241 785981522
2315.5 785981522 786058655 786298676 786226578 786048431 785482178 785287552 785194321 784633408 784134064 783510284
2325.1 783510284 783943481 784256363 785220642 785574417 785018997 784722672 783578262 783650894 783679810 784381714
2334.8 784381714 784843979 784060669 784363632 784785919 784827576 784560776 785484848 785579987 785251923 784721146
$$ packed form
2267.3G86198807k21405Q8272O18286K78320K16751J41297J0910J23367p22809k31247
2276.9G86500549J5641j26496P5302J56250K04010K37885N78842j39694j602j23902
2286.5G87376785n81283j74408k64817l7307k84653J46790N29098Q33893N49545o62613
2296.2G87431030l96042l24707j08261n35965l30963L50266k0447N86395L93829K62757
2305.8G87307892j1521j90963o9962m48379l10059n19409n8365m36935O942P12281
2315.5G85981522P7133K40021p2098j78147n66253j94626r3231n60913m99344o23780
2325.1G83510284M33197L12882R64279L53775n55420k96325j144410P2632K8916P01904
2334.8G84381714M62265p83310L02963M22287M1657k66800R24072R5139l28064n30777
$$ plain form
2344.4 784721146 782617187 783022461 784343567 785798798 787829895 789497452 790302200 789611053 788633575
2353.1 788633575 787661819 785415344 783095932 782421494 783569107 784024658 784839096 786794968 785611420
2361.8 785611420 784768066 786310806 786525345 786260681 785320435 784172211 783918839 784839859 785219345
2370.4 785219345 785620041 787367096 788035660 788720245 788661346 787780762 787884445 787966537 788020630 788020020
2380.1 788020020 788481369 789085617 789506226 790154266 790696945 791011200 790760651 790379715 789929581 789699249
2389.7 789699249 789691238 789577789 789793854 790156097 790745010 790943832 790909653 790575104 789880600 789465942
2399.4 789465942 788912888 788977356 789022369 788908081 789623032 790484390 790912018 790677261 790335159 790119476
2409 790119476 789894714 789179077 788261490 787884293 788084793 788748398 789206696 789646378 789834900 789743958
$$ packed form
2344.4G84721146k103959M05274J321106J455231K031097J667557Q04748o91147r77478
2353.1G88633575r71756k246475k319412o74438J147613M55551Q14438J955872j183548
2361.8G85611420q43354J542740K14539k64664r40246j148224k53372R21020L79486
2370.4G85219345M00696J747055O68564O84585n8899q80584J03683Q2092N4093o10
2380.1G88020020M61349O04248M20609O48040N42679L14255k50549l80936m50134k30332
2389.7G89699249q011j13449K16065L62243N88913J98822l4179l34549o94504m14658
2399.4G89465942n53054O4468M5013j14288P14951Q61358M27628k34757l42102k15683
2409G90119476k24762p15637r17587l77197K00500O63605M58298M39682J88522r0942
$$ plain form
2418.7 789743958 789463043 788965759 788506927 787776947 787583771 787593842 787476578 787552643 788003082 788665466
2428.3 788665466 788561096 788460617 788507614 788244400 787254944 786168213 786226883 786590195 786890564 787222900
2438 787222900 787751770 788121109 788064346 787445755 786505432 785998154 785301285 785104446 785452423 785830307
2447.6 785830307 786480637 786883163 787091522 787031555 786767883 786266785 785551453 784663391 784213333 784302063
2457.2 784302063 784483490 785214996 785548706 785703278 786016693 786095505 785706100 784648514 784181900 783784943
2466.9 783784943 783305588 783066483 782989120 783539658 784046249 784449005 784565659 784228668 783524551 782454300
2476.5 782454300 781519852 781347122 781604004 781742935 782292099 782650833 783021317 783567276 783490982 783121109
2486.2 783121109 782315826 781371460 780622635 779949188 779779968 780446625 781004715 781161041 781653671 782015152
$$ packed form
2418.7G89743958k80915m97284m58832p29980j93176J0071j17264P6065M50439O62384
2428.3G88665466j04370j00479M6997k63214r89456j086731N8670L63312L00369L32336
2438G87222900N28870L69339n6763o18591r40323n07278o96869j96839L47977L77884
2447.6G85830307O50330M02526K08359n9967k63672n01098p15332q88062m50058Q8730
2457.2G84302063J81427P31506L33710J54572L13415P8812l89405j057586m66614l96957
2466.9G83784943m79355k39105p7363N50538N06591M02756J16654l36991p04117j070251
2476.5G82454300r34448j72730K56882J38931N49164L58734L70484N45959p6294l69873
2486.2G83121109q05283r44366p48825o73447j69220O66657N58090J56326M92630L61481
$$ plain form
2495.8 782015152 781783371 780821762 780022202 779439468 778710556 778419342 778434067 778993683 779598312 780053558
2505.5 780053558 780357285 780366058 780149765 779420166 778474731 777349548 776907959 776891937 777136993 778164520
2515.1 778164520 778919296 779326248 779375153 779081345 778472519 777690887 776515961 775411758 775513077
2523.8 775513077 776050339 777040939 777777176 777988968 778295135 778273239 777919846 776974869 776100311 775402374
2533.4 775402374 775039215 775175018 775529404 776108780 776458511 777225571 777562408 776908035 776091461 775232849
2543.1 775232849 774572296 774131012 774173737 774500122 775067368 775646362 776235886 776836929 776782913 776212158
2552.7 776212158 775140915 774156342 773394012 772897644 773040619 773536758 774082870 774324493 774608612
2561.4 774608612 774885941 775093155 774653168 773317795 772128220 771476288 771677246 772186508 772494736
$$ packed form
2495.8G82015152k31781r61609p99560n82734p28912k91214J4725N59616O04629M55246
2505.5G80053558L03727Q773k16293p29599r45435j125183m41589j6022K45056J027527
2515.1G78164520P54776M06952M8905k93808o08826p81632j174926j104203J01319
2523.8G75513077N37262R90600P36237K11792L06167k1896l53393r44977q74558o97937
2533.4G75402374l63159J35803L54386N79376L49731P67060L36837o54373q16574q58612
2543.1G75232849o60553m41284M2725L26385N67246N78994N89524O01043n4016n70755
2552.7G76212158j071243r84573p62330m96368J42975M96139N46112K41623K84119
2561.4G74608612K77329K07214m39987j335373j189575o51932K00958N09262L08228
$$ plain form
2570.1 772494736 772740784 773288727 773927612 774041519 773708115 772668457 771663818 771074677 770771027
2578.7 770771027 770983658 771530762 772082443 772311707 772637253 772588654 772063904 771518326 770968399 770435333
2588.4 770435333 769787903 769605484 769674759 769765930 769953384 770407944 770926132 770789642 770440674 769811325
2598 769811325 768843307 768037872 767789230 767730637 767843933 768386078 768621750 769022064 769345627 769023209
2607.7 769023209 768232422 767333984 766673584 765868835 765639496 766017227 766466293 766917038 767261276 767389145
2617.3 767389145 767152176 766569366 765478287 764753647 764363174 763939438 763600006 763590698 764345245 764964142
2627 764964142 765442810 765234985 764311371 763731842 763094635 762236023 761469040 761402817 761608582 761815033
2636.6 761815033 762144165 762695694 763207016 762874985 762468567 761497421 760131302 759380188 759035263
$$ packed form
2570.1G72494736K46048N47943O38885J13907l33404j039658j004639n89141l03650
2578.7G70771027K12631N47104N51681K29264L25546m8599n24750n45578n49927n33066
2588.4G70435333o47430j82419O9275R1171J87454M54560N18188j36490l48968o29349
2598G69811325r68018q05435k48642n8593J13296N42145K35672M00314L23563l22418
2607.7G69023209p90787q98438o60400q04749k29339L77731M49066M50745L44238J27869
2617.3G67389145k36969n82810j091079p24640l90473m23736l39432r308P54547O18897
2627G64964142M78668k07825r23614n79529o37207q58612p66983o6223K05765K06451
2636.6G61815033L29132N51529N11322l32031m06418r71146j366119p51114l44925
$$ plain form
2645.3 759035263 759400101 759850845 760093918 760615997 761239014 761016617 760168915 759161758 757907944
2654 757907944 757036972 756508942 756808701 757319794 757586746 758427811 758999786 758758621 757874069 756930847
2663.6 756930847 756249084 755701523 755052261 754697723 755037918 755628433 756433792 756463318 756213379 756320724
2673.3 756320724 755920792 755299759 754411469 753602676 753026886 752761917 753093185 753569641 753861313 753942261
2682.9 753942261 754081955 753832779 753211365 752478790 751855240 751498642 751043549 751049576 751585236 752231598
2692.5 752231598 752436142 752091064 751800079 751548691 751240768 750420074 749484558 749012833 748662796 748743820
2702.2 748743820 749153061 749591827 749945450 749837570 749597244 749008942 747886353 747083435 746726990
2710.9 746726990 746696777 746791534 747057037 747449951 747680893 747859650 747417526 746635437 745818558 745208588
$$ packed form
2645.3G59035263L64838M50744K43073N22079O23017k22397q47702j007157j253814
2654G57907944q70972n28030K99759N11093K66952Q41065N71975k41165q84552r43222
2663.6G56930847o81763n47561o49262l54538L40195N90515Q05359K9526k49939J07345
2673.3G56320724l99932o21033q88290q08793n75790k64969L31268M76456K91672Q0948
2682.9G53942261J39694k49176o21414p32575o23550l56598m55093O027N35660O46362
2692.5G52231598K04544l45078k90985k51388l07923q20694r35516m71725l50037Q1024
2702.2G48743820M09241M38766L53623j07880k40326n88302j122589q02918l56445
2710.9G46726990l0213R4757K65503L92914K30942J78757m42124p82089q16879o09970
$$ plain form
2720.5 745208588 744865189 744237976 744421158 744811859 744691315 744996185 745217133 744882278 744440842 743884659
2730.2 743884659 742708130 741755676 741553955 741755219 741976929 742230835 742650604 742511749 742561722 742497559
2739.8 742497559 741858063 741170578 740192184 739764328 739694595 739781799 740032349 740230637 740398788 740315628
2749.4 740315628 740349655 739983368 739263535 738415756 737733688 737412567 737149811 737329865 737412262 737625122
2759.1 737625122 737939377 737828827 737441483 736689758 735904846 734962158 734329529 734254456 734370270 734653397
2768.7 734653397 734583054 734288940 734438171 734446487 733871078 733559875 732996674 732076111 731534653 731214294
2778.4 731214294 731224823 731323090 731494827 731621017 731436386 730950470 730289764 729614487 729045944 728558121
2788 728558121 727751160 727526093 727677231 727468033 727322845 727320251 727362900 726683426 726076965 725713577
$$ packed form
2720.5G45208588l43399o27213J83182L90701j20544L04870K20948l34855m41436n56183
2730.2G43884659j176529r52454k01721K01264K21710K53906M19769j38855M9973o4163
2739.8G42497559o39496o87485r78394m27856o9733Q7204K50550J98288J68151q3160
2749.4G40315628L4027l66287p19833q47779o82068l21121k62756J80054Q2397K12860
2759.1G37625122L14255j10550l87344p51725p84912r42688o32629p5073J15814K83127
2768.7G34653397p0343k94114J49231Q316n75409l11203n63201r20563n41458l20359
2778.4G31214294J0529R8267J71737J26190j84631m85916o60706o75277n68543m87823
2788G28558121q06961k25067J51138k09198j45188k594M2649o79474o06461l63388
$$ plain form
2797.7 725713577 724652710 723636932 723295975 723587952 724027710 724109650 723377228 722887268 722694473
2806.3 722694473 721772232 720690842 719704285 719347000 718877716 718289032 718285904 717996292 717502289 717015991
2816 717015991 716801071 716310883 715543060 714906235 714362335 714134674 713334503 712359238 711622925 711605988
2825.6 711605988 712372437 712247391 711367569 710260468 709230194 708331757 707098618 706106033 705871506
2834.3 705871506 705678558 705276413 705240784 704751892 703425980 701941223 700220795 698355865 696627731
2843 696627731 694953461 693657227 692516556 691034698 689456329 687361069 685242462 683693848 682519608
2851.7 682519608 681742859 680987701 680432205 679927826 679694519 679750290 680310898 681197739 680693207 680004883
2861.3 680004883 679841309 679185028 678081131 677106857 676613235 675821686 674892044 674325333 674014587
$$ packed form
2797.7G25713577j060867j015778l40957K91977M39758Q1940p32422m89960j92795
2806.3G22694473r22241j081390r86557l57285m69284n88684l128k89612m94003m86298
2816G17015991k14920m90188p67823o36825n43900k27661q00171r75265p36313j6937
2825.6G11605988P66449j25046q79822j107101j030274q98437j233139r92585k34527
2834.3G05871506j92948m02145l5629m88892j325912j484757j720428j864930j728134
2843F96627731j674270j296234j140671j481858j578369k095260k118607j548614j174240
2851.7F82519608p76749p55158n55496n04379k33307N5771N60608Q86841n04532o88324
2861.3F80004883j63574o56281j103897r74274m93622p91549r29642n66711l10746
$$ plain form
2870 674014587 673228912 672791595 673031464 671649628 669692764 668841171 668539047 668025360 667469940 667442169
2879.6 667442169 667545471 667588272 667168045 666538467 665685425 664688187 663880005 662857208 661887131 660897827
2889.3 660897827 660399780 660290985 660010223 659500809 658746796 658019791 656916275 655945206 654983368
2897.9 654983368 654134140 653771515 653393326 652828445 651896973 651647873 651499481 651143646 650655365 649537430
2907.6 649537430 649038773 648387070 647502136 646717758 645788345 645109253 644009171 642994766 642217712
2916.3 642217712 641371994 640358810 638951645 637410469 636199951 635862236 635629349 635173531 635042801
2925 635042801 635472679 635998878 636200409 636090279 635447693 635062294 634967232 634894905 635233269 635708160
2934.6 635708160 636423912 637357063 638184853 638713646 638957138 639439964 639990501 640116348 640183258 640356369
$$ packed form
2870F74014587p85675m37317K39869j381836j956864q51593l02124n13687n55420k7771
2879.6F67442169J03302M2801m20227o29578q53042r97238q08182j022797r70077r89304
2889.3F60897827m98047j08795k80762n09414p54013p27005j103516r71069r61838
2897.9F54983368q49228l62625l78189n64881r31472k49100j48392l55835m88281j117935
2907.6F49537430m98657o51703q84934p84378r29413o79092j100082j014405p77054
2916.3F42217712q45718j013184j407165j541176j210518l37715k32887m55818j30730
2925F35042801M29878N26199K01531j10130o42586l85399r5062p2327L38364M74891
2934.6F35708160P15752R33151Q27790N28793K43492M82826N50537J25847O6910J73111
$$ plain form
2944.2 640356369 640858383 641432343 641563568 641636658 641484756 641560364 641633377 640930862 640368729 639957581
2953.9 639957581 639571838 639562912 639573784 639239540 638920403 639090538 639520988 639724731 639929428 640592957
2963.5 640592957 640668640 640290527 640623474 641771317 643073502 643704834 644727631 646091614 646700363
2972.2 646700363 647016449 647719650 648492432 648898087 649795914 650950546 652000961 652996140 654053879
2980.9 654053879 655152893 655625000 656467209 657135239 657062912 657611008 658611069 659383850 659924545
2989.6 659924545 660655670 661528854 662471008 662758789 662580719 663060837 663559570 663914413 663672256 663080215
2999.2 663080215 663330460 663798904 664016953 663947906 663707962 663710403 663534470 663184052 663527679 664039841
3008.8 664039841 663918839 663605423 663214264 662788925 662891769 662956924 662438583 662141113 661690292 661185150
$$ packed form
2944.2F40356369N02014N73960J31225P3090j51902P5608P3013p02515n62133m11148
2953.9F39957581l85743q926J0872l34244l19137J70135M30450K03743K04697O63529
2963.5F40592957P5683l78113L32947J147843J302185O31332J022797J363983O08749
2972.2F46700363L16086P03201P72782M05655Q97827J154632J050415R95179J057739
2980.9F54053879J099014M72107Q42209O68030p2327N48096J000061P72781N40695
2989.6F59924545P31125Q73184R42154K87781j78070M80118M98733L54843k42157n92041
2999.2F63080215K50245M68444K18049o9047k39944K441j75933l50418L43627N12162
3008.8F64039841j21002l13416l91159m25339J02844O5155n18341k97470m50821n05142
$$ plain form
3018.5 661185150 660854034 659946442 659314880 659235611 659416199 659543839 659390945 659022293 658665237 658492966
3028.1 658492966 657463989 656342316 655840454 655651627 655754700 655591812 655063324 654164352 653966064
3036.8 653966064 654061050 653563461 653138885 652490997 651526031 650823669 650388184 649627228 649255676 648856964
3046.5 648856964 648305817 648259125 647668839 647176514 646281052 645366211 645079346 644654922 644565048 643570328
3056.1 643570328 642639771 642531662 642168732 641726379 641042023 640795135 640847931 640154343 638654366 638049431
3065.7 638049431 638046188 637473907 637083282 636607590 636452789 636292992 635665092 635084648 634507751 634142685
3075.4 634142685 633651085 633137169 632797241 632606125 632596207 632586746 631991653 631137695 630588989 629637566
3085 629637566 629147911 628900909 628209267 627757912 627295494 626729240 626460495 626712608 626524467 625834045
$$ packed form
3018.5F61185150l31116r07592o31562p9269J80588J27640j52894l68652l57056j72271
3028.1F58492966j028977j121673n01862j88827J03073j62888n28488q98972j98288
3036.8F53966064R4986m97589m24576o47888r64966p02362m35485p60956l71552l98712
3046.5F48856964n51147m6692n90286m92325q95462r14841k86865m24424q9874r94720
3056.1F43570328r30557j08109l62930m42353o84356k46888N2796o93588j499977o04935
3065.7F38049431l243n72281l90625m75692j54801j59797o27900n80444n76897l65066
3075.4F34142685m91600n13916l39928j91116r918r461n95093q53958n48706r51423
3085F29637566m89655k47002o91642m51355m62418n66254k68745K52113j88141o90422
$$ plain form
3094.7 625834045 624605522 623246841 623080215 622867317 622196579 621478310 620959282 620671921 620344810
3103.4 620344810 619902878 619298134 619054222 618367424 617582741 617142830 616479034 615942802 615551643 615470238
3113 615470238 615252914 614840431 613775902 612575340 612019768 611008263 610175858 609365158 608498383
3121.7 608498383 607920952 607494926 607463493 606596375 605444031 604829216 604247589 603639145 602633553
3130.4 602633553 601507263 600660477 600102959 599664803 599202347 598741074 598302765 597864075 597152138
3139 597152138 596095390 595186310 594573135 593750343 592589188 591394157 590581398 589861298 589295578
3147.7 589295578 589190102 588769302 587867737 586685410 585555878 584606438 583681412 582920151 582263451
3156.4 582263451 581680222 581001015 580231819 579344711 578508453 577560730 576431541 575460320 574368477
$$ packed form
3094.7F25834045j228523j358681j66626k12898o70738p18269n19028k87361l27111
3103.4F20344810m41932o04744k43912o86798p84683m39911o63796n36232l91159q1405
3113F15470238k17324m12483j064529j200562n55572j011505q32405q10700q66775
3121.7F08498383n77431m26026l1433q67118j152344o14815n81627o08444j005592
3130.4F02633553j126290q46786n57518m38156m62456m61273m38309m38690p11937
3139E97152138j056748r09080o13175q22792j161155j195031q12759p20100n65720
3147.7E89295578j05476m20800r01565j182327j129532r49440r25026p61261o56700
3156.4E82263451n83229o79207p69196q87108q36258r47723j129189r71221j091843
$$ plain form
3165.1 574368477 573573494 572974319 572401962 571875839 571146851 570464249 569493294 568370018 567230721
3173.8 567230721 566326790 565766563 564992485 563930779 563114510 562799072 562034111 561256943 560471992
3182.4 560471992 559316559 558641243 557836037 556665382 555601692 555020905 554420547 553559380 553018341
3191.1 553018341 552193298 551233292 550567665 549852028 548677711 547650490 546966743 545961647 545131149
3199.8 545131149 544610443 544347458 543697929 542632904 542033005 541460953 540645981 539747467 538813896
3208.5 538813896 537802849 537093925 536458931 535665932 535199203 534565353 533684044 532987137 532424965
3217.2 532424965 531651382 530543175 529117813 528351593 528327103 527202187 525935898 525713768 525870552
3225.8 525870552 525828857 525196342 524194450 522769432 521606750 521320572 521273651 520531502 519627724
$$ packed form
3165.1E74368477p94983n99175n72357n26123p28988o82602r70955j123276j139297
3173.8E67230721r03931n60227p74078j061706q16269l15438p64961p77168p84951
3182.4E60471992j155433o75316q05206j170655j063690n80787o00358q61167n41039
3191.1E53018341q25043r60006o65627p15637j174317j027221o83747j005096q30498
3199.8E45131149n20706k62985o49529j065025n99899n72052q14972q98514r33571
3208.5E38813896j011047p08924o34994p92999m66729o33850q81309o96907n62172
3217.2E32424965p73583j108207j425362p66220k4490j124916j266289k22130J56784
3225.8E25870552m1695o32515j001892j425018j162682k86178m6921p42149r03778
$$ plain form
3234.5 519627724 519212685 518658028 517964096 517112656 516584473 515940590 514971352 513990669 512612648
3243.2 512612648 512101440 512105331 511774139 511263695 510555878 509679146 508675995 508175812 507442856 506701622
3252.8 506701622 506247978 505551376 505124092 504560013 503623772 502887688 502540665 501941528 501209984 500463715
3262.5 500463715 499793892 499381409 498773155 498285904 497298355 497008476 497965927 497895851 496903687 495863686
3272.1 495863686 494823418 493783150 493482628 492901878 491651764 491094933 490744057 490789413 490832748 490475693
3281.8 490475693 489656754 488784447 488376770 487642784 487067986 486512489 486054649 485545082 485191727 485485077
3291.4 485485077 485113373 484470634 483613472 483246078 483487167 482887001 482074623 481177635 480478325 480132713
3301 480132713 479796906 479549942 479233017 479080009 478744049 477815132 477083893 476444054 475168304 474523621
$$ packed form
3234.5E19627724m15039n54657o93932q51440n28183o43883r69238r80683j378021
3243.2E12612648n11208L891l31192n10444p07817q76732j003151n00183p32956p41234
3252.8E06701622m53644o96602m27284n64079r36241p36084l47023n99137p31544p46269
3262.5E00463715o69823m12483o08254m87251r87549k89879R57451p0076r92164j040001
3272.1D95863686j040268Tl00522n80750j250114n56831l50876M5356M3335l57055
3281.8D90475693q18939q72307m07677p33986n74798n55497m57840n09567l53355K93350
3291.4D85485077l71704o42739q57162l67394K41089o00166q12378q96988o99310l45612
3301D80132713l35807k46964l16925j53008l35960r28917p31239o39839j275750o44683
$$ plain form
3310.7 474523621 474435844 473967628 473746834 473858452 473613510 472863846 472407074 471446915 470003548 468794785
3320.3 468794785 467921066 467941246 467319183 466928024 467081909 465862617 464735718 464368286 463766975
3329 463766975 462610474 461888771 461674728 461241951 460869141 460403214 459960976 459322586 458837395 458419456
3338.7 458419456 457238579 456040230 455183830 454495850 453917923 453373718 452587242 451755219 451263123
3347.3 451263123 450560226 449748726 449095192 448393860 447419510 446307755 445816879 445354538 444270210
3356 444270210 443767281 443668442 443186340 442543449 441541214 440549889 439673500 439052887 438646049 437810860
3365.7 437810860 437053223 436659012 436578178 436056862 435181236 434674225 433458405 431899719 431337128
3374.3 431337128 431392555 431027565 430142784 429338722 429008293 428680000 428035622 427730484 427176247 426008797
$$ packed form
3310.7D74523621q7777m68216k20794J11618k44942p49664m56772r60159j443367j208763
3320.3D68794785q73719K0180o22063l91159J53885j219292j126899l67432o01311
3329D63766975j156501p21703k14043m32777l72810m65927m42238o38390m85191m17939
3338.7D58419456j180877j198349q56400o87980n77927n44205p86476q32023m92096
3347.3D51263123p02897q11500o53534p01332r74350j111755m90876m62341j084328
3356D44270210n02929r8839m82102o42891j002235r91325q76389o20613m06838q35189
3365.7D37810860p57637l94211q0834n21316q75626n07011j215820j558686n62591
3374.3D31337128N5427l64990q84781q04062l30429l28293o44378l05138n54237j167450
$$ plain form
3384 426008797 424804687 424377747 424716949 424625130 424411163 424043541 423535500 423189430 422717628 422472343
3393.6 422472343 422202911 421712456 420827789 419802704 419414864 419489059 419412727 418900795 418498802 418526230
3403.3 418526230 418663406 418485527 417872314 417081909 416896896 416984825 416249466 415441895 415373421 415425034
3412.9 415425034 415050201 415097809 415264931 414913940 414404106 414045982 414685020 414502220 413510780 413566208
3422.6 413566208 414028435 414835968 414952469 414873390 414765358 414083099 414096069 414171219 414169464 414567719
3432.2 414567719 414806938 414803696 414856720 414832420 415219383 415785789 415517921 415592651 416119423 416317215
3441.8 416317215 416133652 416212502 416526184 416625519 417086487 417080536 417620316 418624229 418903198 419199944
3451.5 419199944 419156265 419198570 419659157 420499992 421289139 421622734 422023582 422496147 423316078 423909569
$$ packed form
3384D26008797j204110m26940L39202r1819k13967l67622n08041l46070m71802k45285
3393.6D22472343k69432m90455q84667j025085l87840P4195p6332n11932m01993K7428
3403.3D18526230J37176j77879o13213p90405j85013Q7929p35359q07571o8474N1613
3412.9D15425034l74833M7608J67122l50991n09834l58124O39038j82800r91440N5428
3422.6D13566208M62227Q07533J16501p9079j08032o82259J2970P5150j755L98255
3432.2D14567719K39219l242N3024k4300L86963N66406k67868P4730N26772J97792
3441.8D16317215j83563P8850L13682R9335M60968n951N39780J003913K78969K96746
3451.5D19199944m3679M2305M60587Q40835P89147L33595M00848M72565Q19931N93491
$$ plain form
3461.1 423909569 424264183 424260406 423942108 424601288 426011162 426915245 427011528 427497063 428204308 428784828
3470.8 428784828 429475021 430356178 430867996 430586624 431350098 432471046 432780342 433235741 434265823
3479.5 434265823 435214577 435408401 435842094 436554070 437410698 437885857 437956772 438657684 439248810 439525604
3489.1 439525604 440410233 442139587 443414078 444239120 444750290 445017700 446043892 446512032 446780548
3497.8 446780548 447356567 448026924 449251175 450541954 451374702 451453094 452002525 452791595 453574753
3506.5 453574753 454456062 455138969 455463257 455733604 457359238 458650208 459076958 459852600 460812035
3515.1 460812035 461840935 462795219 463626862 463910789 464277954 464837189 465911598 467072563 467496605
3523.8 467496605 469168129 470813332 471237679 471815300 473139763 473667259 473838158 474920959 476233253
$$ packed form
3461.1D23909569L54614l777l18298O59180J409874R04083R6283M85535P07245N80520
3470.8D28784828O90193Q81157N11818k81372P63474J120948L09296M55399J030082
3479.5D34265823R48754J93824M33693P11976Q56628M75159P0915P00912N91126K76794
3489.1D39525604Q84629J729354J274491Q25042N11170K67410J026192M68140K68516
3497.8D46780548N76019O70357J224251J290779Q32748P8392N49431P89070P83158
3506.5D53574753Q81309O82907L24288K70347J625634J290970M26750P75642R59435
3515.1D60812035J028900R54284Q31643K83927L67165N59235J074409J160965M24042
3523.8D67496605J671524J645203M24347N77621J324463N27496J70899J082801J312294
$$ plain form
3532.5 476233253 477429199 477832947 479045563 480237503 480873985 482800674 483960419 484605446 485231056
3541.2 485231056 486267586 486871529 486977844 487983017 489134102 490752678 491023445 492952766 495450592
3549.9 495450592 496456909 497321510 496315804 497475739 499362793 501147690 502632904 502917633 505040817
3558.5 505040817 506768532 508272781 509221497 510347328 510849724 510825844 513952942 513598289 513313904
3567.2 513313904 514327431 515144501 519200325 521425591 523052673 524379654 525712090 527157822
3574.9 527157822 528256111 529620590 530242882 533017578 534642448 535424881 537822800 539441833 540114746
3583.6 540114746 540712585 544090271 544033279 542347565 545664330 546595383 549862213 552867203 555318718
3592.3 555318718 556829834 557462883 559815216 558624306 560763092 564327965 565658684 568146935
$$ packed form
3532.5D76233253J195946M03748J212616J191940O36482J926689J159745O45027O25610
3541.2D85231056J036530O03943J06315J005173J151085J618576K70767J929321K497826
3549.9D95450592J006317Q64601j005706J159935J887054J784897J485214K84729K123184
3558.5E05040817J727715J504249R48716J125831N02396k3880L127098l54653k84385
3567.2E13313904J013527Q17070M055824K225266J627082J326981J332436J445732
3574.9E27157822J098289J364479O22292K774696J624870P82433K397919J619033O72913
3583.6E40114746N97839L377686n6992j685714L316765R31053L266830L004990K451515
3592.3E55318718J511116O33049K352333j190910K138786L564873J330719K488251
$$ plain form
3600 568146935 568569107 570363617 573419228 575263214 577105751 579511681 581278419 580409241 583176079
3608.7 583176079 582147560 582378120 590063820 591417160 590131264 593690567 593165169 597094231 601076736
3617.4 601076736 600375938 601046371 600200691 602479820 607007828 610681076 614130173 617001572 618854828
3626 618854828 621157951 625572624 620432014 611086769 618757019 626501770 632348251 633489189 632775993
3634.7 632775993 636199608 640407944 642885513 643331146 645000153 647266998 649328766 650613632
3642.4 650613632 652096939 654508057 657059631 661721954 659630737 656585388 662005920 661109009
3650.1 661109009 658707962 660289536 666722794 671212921 674725647 678187180 671695786 675188217
3657.9 675188217 680921097 682648010 684082108 684632874 686728668 687453384 688683701 690499191 691392059
$$ packed form
3600E68146935M22172J794510L055611J843986J842537K405930J766738q69178K766838
3608.7E83176079j028519K30560P685700J353340j285896L559303n25398L929062L982505
3617.4F01076736p00798O70433q45680K279129M528008L673248L449097K871399J853256
3626F18854828K303123M414673n140610r345245P670250P744751N846481J140938p13196
3634.7F32775993L423615M208336K477569M45633J669007K266845K061768J284866
3642.4F50613632J483307K411118K551574M662323k091217l045349N420532q96911
3650.1F61109009k401047J581574O433258M490127L512726L461533o491394L492431
3657.9F75188217N732880J726913J434098N50766K095794P24716J230317J815490Q92868
$$ plain form
3666.5 691392059 695680237 696635361 693385391 692648392 687969437 692558441 700726166 706007690 700301590
3675.2 700301590 683695221 689960632 699892044 705135880 704693069 706392975 709512711 710418167
3682.9 710418167 710667725 711030273 711536560 714856110 718763046 708141785 705321884 713490219 710096893
3691.6 710096893 710233994 714803543 715414505 716404190 715404739 714674683 716019669 716690674 719369049
3700.3 719369049 721318588 716163788 715680008 721145782 722471161 722443619 723268967 725214157 727414627
3709 727414627 719406967 723049850 726657028 715245514 722017822 727985916 728168259 728177490 729883270
3717.7 729883270 730567703 726710663 727372742 731894989 727479019 725116425 731717606 732278976 730119934
3726.3 730119934 727622375 728347473 731662216 732101593 736680756 731655579 724025726 732274857 731157455
$$ packed form
3666.5F91392059M288178R55124l249970p36999m678955M589004Q167725N281524n706100
3675.2G00301590j6606369O265411R931412N243836m42811J699906L119736R05456
3682.9G10418167K49558L62548N06287L319550L906936j0621261k819901Q168335l393326
3691.6G10096893J37101M569549O10962R89685r99451p30056J344986O71005K678375
3700.3G19369049J949539n154800m83780N465774J325379k7542Q25348J945190K200470
3709G27414627q007660L642883L607178j1411514O772308N968094J82343R231J705780
3717.7G29883270O84433l857040O62079M522247m415970k362594O601181N61370k159042
3726.3G30119934k497559P25098L314743M39377M579163n025177p629853Q249131j117402
$$ plain form
3735 731157455 722008514 723960648 728697968 730506592 732916718 734641113 730828323 734699020 744959335
3743.7 744959335 729741669 715566177 728496094 735590363 740643921 734997711 723653717 732997971
3751.4 732997971 726483383 722857590 731112595 736405640 738764420 734233551 737539139 741565475
3759.1 741565475 733239136 733060684 737795944 738721313 738320618 741137009 738578644 735069962 737914734
3767.8 737914734 741242065 740278473 732584305 735948715 740297852 740816040 741141968 740707779 741491394
3776.5 741491394 741747513 743850861 742395554 735917664 738947067 740409622 740902786 742337341 739591599
3785.2 739591599 739234924 740200500 740627823 741074524 741243134 742505493 742916412 743267899 742808380
3793.8 742808380 742849045 744812393 739875031 736124802 738954697 742001495 745124054 735617752 727848740
$$ packed form
3735G31157455r148941J952134M737320J808624K410126J724395l812790L870697J0260315
3743.7G44959335j5217666j4175492J2929917P094269N053558n646210j1343994R344254
3751.4G32997971o514588l625793Q255005N293045K358780m530869L305588M026336
3759.1G41565475q326339j78452M735260R25369m00695K816391k558365l508682K844772
3767.8G37914734L327331r63592p694168L364410M349137N18188L25928m34189P83615
3776.5G41491394K56119K103348j455307o477890L029403J462555M93164J434555k745742
3785.2G39591599l56675R65576M27323M46701J68610J262359M10919L51487m59519
3793.8G42808380M0665J963348m937362l750229K829895L046798L122559r506302p769012
$$ plain form
3802.5 727848740 734839630 738828354 742747269 746756439 737560883 734801559 739886703 741467896
3810.2 741467896 741665878 742885590 743203125 743261032 746814957 742573776 731096115 738433228 743695602
3818.9 743695602 745789719 743276062 727515411 732063217 738171463 741570969 744651566 744159698
3826.6 744159698 740095520 740594330 743254700 745716248 744787598 736308441 739704971 745417938 738312454
3835.3 738312454 739613800 747535629 737421951 733263016 739590073 735361176 737274857 743261185
3843 743261185 740447617 738037872 741138306 743006210 742896118 743799744 742279892 744288406 748882675
3851.7 748882675 740119553 740356445 726282806 729696121 741121216 741369629 740948105 742066040
3859.4 742066040 743301086 745299530 739726868 740293427 744467316 737137909 735557556 740910416
$$ packed form
3802.5G27848740O990890L988724L918915M009170r195556k759324N085144J581193
3810.2G41467896J97982J219712L17535N7907L553925m241181j1477661P337113N262374
3818.9G43695602K094117k513657j5760651M547806O108246L399506L080597m91868
3826.6G44159698m064178M98810K660370K461548r28650q479157L396530N712967p105484
3835.3G38312454J301346P921829j0113678m158935O327057m228897J913681N986328
3843G43261185k813568k409745L100434J867904j10092R03626j519852K008514M594269
3851.7G48882675q763122K36892j4073639L413315J1425095K48413m21524J117935
3859.4G42066040J235046J998444n572662N66559M173889p329407j580353N352860
$$ plain form
3867.1 740910416 745312881 749457779 739884720 731699677 737197266 743110657 744195175 734894943
3874.8 734894943 737225723 741925583 742284622 744052658 745645142 738864899 735632248 742732162
3882.6 742732162 744223251 744938736 746838531 734115448 738024750 743427429 743552551 746451492
3890.3 746451492 743642578 735523148 738601990 742303162 741353912 742969284 743409729 744264069 744535370
3898.9 744535370 736039352 740415268 740517197 736063385 741122055 737926331 736190491 738633728
3906.7 738633728 741593857 743293076 742528381 743005066 743265457 743552933 743036346 742351837 743190079
3915.3 743190079 744244995 741215363 738617401 742677536 742304077 739519348 742006607 742548447 741952438
3924 741952438 739426804 738262939 741429062 743087311 742719879 740915527 740981369 742298508 740075302
$$ packed form
3867.1G40910416M402465M144898r573059q185043N497589N913391J084518r300232
3874.8G34894943K330780M699860L59039J768036J592484o780243l232651P099914
3882.6G42732162J491089P15485J899795j2723083L909302N402679J25122K898941
3890.3G46451492k808914q119430L078842L701172r49250J615372M40445Q54340K71301
3898.9G44535370q496018M375916J01929m453812N058670l195724j735840K443237
3906.7G38633728K960129J699219p64695M76685K60391K87476n16587o84509Q38242
3915.3G43190079J054916l029632k597962M060135l73459k784729K487259N41840n96009
3924G41952438k525634j163865L166123J658249l67432j804352O5842J317139k223206
$$ plain form
3932.7 740075302 739784775 741554413 741728668 741858597 742443848 742551651 741988983 741481094 742677307
3941.4 742677307 742553787 738432083 738529892 740272980 741309433 742383347 740324402 740592194 740522614
3950.1 740522614 738810120 741200104 742369461 742013474 741727142 741077499 740892258 740699463 740866470
3958.7 740866470 740684128 741552429 741907959 741024399 741594696 741714554 741232529 741713562 742426758 741885605
3968.4 741885605 740884857 740834274 741697235 742025986 741289978 741580200 742061691 741645432 741162949 741427078
3978 741427078 741518478 740747910 741090851 741951981 741859512 741291428 741002426 740840683 741135712 741940765
3987.7 741940765 742116623 741992340 741159973 740366364 740870895 741721649 742019348 741657028 741422272 741662979
3997.3 741662979 742122269 741724930 740997009
$$ packed form
3932.7G40075302k90527J769638J74255J29929N85251J07803n62668n07889J196213
3941.4G42677307j23520m121704R7809J743088J036453J073914k058945K67792o9580
3950.1G40522614j712494K389984J169357l55987k86332o49643j85241j92795J67007
3958.7G40866470j82342Q68301L55530q83560N70297J19858m82025M81033P13196n41153
3968.4G41885605j000748n0583Q62961L28751p36008K90222M81491m16259m82483K64129
3978G41427078R1400p70568L42941Q61130r2469n68084k89002j61743K95029Q05053
3987.7G41940765J75858j24283q32367p93609N04531Q50754K97699l62320k34756K40707
3997.3G41662979M59290l97339p27921
$$ plain form
4000.2 740997009
$$ packed form
4000.2G40997009
##END=$$ End of the data block
