##TITLE=$$ Begin of the data block
##JCAMP-DX=5.00 $$ ACD/SpecManager v 10.08
##SPECTROMETER/DATA SYSTEM=Varian
##DATE=07 Jan 2013 17:14:14
##DATA TYPE=INFRARED SPECTRUM
##DATA CLASS=XYDATA
##ORIGIN=
##OWNER=
##NPOINTS=3735
##FIRSTX=399.26403809
##LASTX=4000.35498047
##MAXX=4000.35498047
##MINX=399.26403809
##MAXY=79.75819397
##MINY=18.42807007
##XFACTOR=1.0000000000
##YFACTOR=0.000000100000000
##FIRSTY=60.91902924
##DELTAX=0.96440572
##XUNITS=1/CM
##YUNITS=TRANSMITTANCE
##XYDATA=(X++(Y..Y))
399.3F09190292N12505M018288m249192j999397N616722R667015n305443l751144M701538
407.9F18401184J999588m885445j1449852o20498N103798L415069O075630M772034
415.7F22811508J050377m047623m760780r481392j026192N807610j064491J014900
423.4F10303917K204208k255287L133278L063316r60426J767044j265907o323891l797836
432.1F05868416m415398k000313J417962K495651N858764O367035N417862m169235
439.8F16840744p176552l004188j603470p03621j704064M671021K723312j549911K172737
448.4F10666008j551857j659355j461220l800201k992554j301727O18896o77872k126693
457.1E95713425P895126O612625j790047q29124N41840k810555p003174m185753L256340
$$ plain form
399.3 609190292 609702797 613721085 609471893 607472496 613089218 622756233 617450790 613699646 618401184
407.9 618401184 620400772 615515327 604065475 603444977 608548775 611963844 618039474 622811508
415.7 622811508 623861885 619814262 615053482 605572090 604545898 610353508 609289017 610303917
423.4 610303917 612508125 610252838 613386116 616449432 615489006 617256050 615990143 609666252 605868416
432.1 605868416 601453018 599452705 600870667 603366318 609225082 615592117 621009979 616840744
439.8 616840744 609664192 606660004 605056534 604352913 602648849 607319870 610043182 608493271 610666008
448.4 610666008 609114151 607454796 605993576 602193375 599200821 597899094 598517990 597840118 595713425
457.1 595713425 603608551 610221176 608431129 607602005 608143845 605333290 598330116 594144363 597400703
465.8E97400703N52712k68021M6273Q34312K085609n665969o776543K729301K952843
474.5E93891220J606445o63681k715416r95941L326340N933304O748085L868408l060608
483.2F07938156l831978k866134p116776k070007L462410L551979N656166K467918
490.9F07191734R84841j134873j032753l93295n943413m102211L81508L613396L767853
499.6F03332787m74167j689797J442108L642846k469407o377601l756752r10759n08461
508.2E92230797l89443J323281o21872Q46252J489144n67856j410408l878479l819542
516.9E85201874j574593j646423l489990q57811M43992M82254K832260K384873R15871
525.6E84692307k718964k892494k933998j886368m0093m27208L246575L187523K636871
$$ plain form
465.8 597400703 597953415 597685394 597731667 598565979 600651588 594985619 588209076 590938377 593891220
474.5 593891220 595497665 594833984 592118568 591122627 594448967 600382271 607130356 610998764 607938156
483.2 607938156 604106178 601240044 594123268 592053261 595515671 599067650 604723816 607191734
490.9 607191734 608176575 607041702 606008949 605615654 599672241 595570030 595951538 599564934 603332787
499.6 603332787 602858620 601168823 602610931 606253777 603784370 597406769 593650017 592739258 592230797
508.2 592230797 591841354 593164635 592542763 593389015 594878159 594310303 592899895 589021416 585201874
516.9 585201874 583627281 581980858 578490868 577633057 578077049 578559303 581391563 583776436 584692307
525.6 584692307 581973343 579080849 576146851 574260483 574220390 573793182 577039757 580227280 582864151
534.3E82864151R76143k621842j934242l327064k013054J623192J411667P62176K465210
543E80206337K341690P26166L99971N63850J81885k487221j281280k73247j818962
551.6E78559189q354P64579J416169J867218K368469Q87642l55988Q0376k385101j716652
561.3E81477547l93601L47367J027298n35622j93939J881141K526245L28637j583748
570E84881325k112923j168632j899567k831764J242752K261505M52270K12975J185684
578.6E82223625J051331j559983k212905k21596k4643k958031k502365Q35915K700538
587.3E77331886K067719J382904K090111o69289j829910j909867j344070Q63991m4251
596E77939224N6114j92222m32854j058464j915626j253472l395538m946709m072494
$$ plain form
534.3 582864151 583840294 581218452 579284210 575957146 573944092 575567284 576978951 577741127 580206337
543 580206337 582548027 583274193 583674164 584238014 584419899 581932678 580651398 580378151 578559189
551.6 578559189 578550835 579315414 580731583 582598801 584967270 585854912 585498924 585579300 583194199 581477547
561.3 581477547 581083946 581431313 582458611 581922989 581729050 583610191 586136436 586465073 584881325
570 584881325 582768402 581599770 579700203 576868439 578111191 580372696 580824966 581037941 582223625
578.6 582223625 583274956 581714973 579502068 579280472 579255829 576297798 573795433 574631348 577331886
587.3 577331886 579399605 580782509 582872620 582203331 580373421 578463554 577119484 577983475 577939224
596 577939224 577995338 577803116 577370262 576311798 574396172 573142700 569747162 564800453 560727959
604.7E60727959l548241o057663o460571n431786q427849j1672897j3444862j1626358
612.4D94057732j2248650j0475807n001412r02290J169815J81770M93088m270210q560066
621.1D54443970j0589257j2036132q818589j707077P913971J2557335J7624588J7428169
628.8D76816978J5220528J1921501O543045L434410j570510m905358q093109q777618
636.5D90589867q414231o734543j717643K957420J0953293J4816894J7978287J8921089
644.2E39350433J6925850J2901039R518128P388038L925324L228264K111931J485977
651.9E96834984L118858L310433L570861K685662Q20389K72026N569p60879q33245
660.6F09024658k70424O99349L038673L434906K119980J532745P1564m128227L283958
$$ plain form
604.7 560727959 557179718 551122055 544661484 539229698 530801849 519128952 505684090 494057732
612.4 494057732 481809082 471333275 466331863 465429573 466599388 466781158 467274246 463004036 454443970
621.1 454443970 443854713 431818581 422999992 421292915 429206886 441764221 459388809 476816978
628.8 476816978 492037506 503959007 510502052 513936462 512365952 507460594 499367485 490589867
636.5 490589867 482175636 475441093 473723450 476680870 487634163 502451057 520429344 539350433
644.2 539350433 556276283 569177322 578695450 586083488 590008812 593237076 595349007 596834984
651.9 596834984 599953842 603264275 606835136 609520798 610341187 610613213 610618782 609857903 609024658
660.6 609024658 608754234 609453583 612492256 615927162 618047142 619579887 619651451 615523224 618807182
669.3F18807182J391182j123237m58680J28365N12848J290855K809716M264106K416954
678F30039291k82440j745872q09212P16248j178093k909089r08508J672554J507073
686.7F26101952R30519O00052J97181r40170l224602k658996k238846l827591k702026
695.3F12237473j7624J313285J149064N36346K33650n00068j706696j578178j169396
704F10497856m03442J75285L05367K783279L717651L221741K736626J170082P54623
712.7F24959068L41454k11868L5018P55654K051811K741623K378616L281327L994598
721.4F40327301J855621j40228r93957j162377k241516k299843P81975J274185N55420
730.1F37956581J47858N57480J696281n37033j090851j559181l002091k209396j836548
$$ plain form
669.3 618807182 620198364 619075127 618616447 618744812 619257660 620548515 623358231 627622337 630039291
678 630039291 629756851 628010979 627201767 627918015 626739922 623830833 622922325 624594879 626101952
686.7 626101952 627032471 627632523 627829704 626889534 623664932 621005936 618767090 614939499 612237473
695.3 612237473 612219849 613533134 614682198 615218544 615452194 614952126 613245430 611667252 610497856
704 610497856 610094414 610269699 610575066 613358345 617075996 620297737 623034363 624204445 624959068
712.7 624959068 625300522 625088654 625123672 625879326 627931137 630672760 633051376 636332703 640327301
721.4 640327301 642182922 642042694 641048737 639886360 637644844 635345001 636126976 637401161 637956581
730.1 637956581 638104439 638661919 640358200 639821167 638730316 637171135 634169044 631959648 630123100
738.7F30123100L62625K118035K071800K000694J744576K093544J495209N81665L07540
747.4F42898788L2349l31650J752091M641876L692169M027634N562134M226989J980820
756.1F68483200m61807M16107J144028j393280q27332J836090K589112L220748L363953
764.8F78370819J760178l97339k152786k940369l395996k832413j435242M85688K076339
773.5F69538879L004151M171753L849106K979126J434783j93328o87714j476212j72576
782.1F82447968Q28247J794509M153214M263153L029480K276535J602326k06147j590347
790.8F98598938k750092k743454j420593L28064K745361K855759L390122L259430J583938
799.5G05847473j98364l186493l118057k575531k092591j99585J038742K243348M114990
$$ plain form
738.7 630123100 630485725 632603760 634675560 636676254 638420830 640514374 642009583 642591248 642898788
747.4 642898788 642931137 642599487 644351578 648993454 652685623 656713257 662275391 666502380 668483200
756.1 668483200 668021393 668437500 669581528 668188248 667360916 669197006 671786118 675006866 678370819
764.8 678370819 680130997 679733658 677580872 674640503 671244507 668412094 666976852 667462540 669538879
773.5 669538879 672543030 676714783 680563889 683543015 684977798 684784470 684096756 682620544 682447968
782.1 682447968 683276215 685070724 689223938 693487091 696516571 698793106 700395432 700189285 698598938
790.8 698598938 695848846 693105392 691684799 692012863 694758224 697613983 701004105 704263535 705847473
799.5 705847473 705649109 702462616 699344559 696769028 694676437 694476852 695515594 697758942 701873932
808.2G01873932M250717J494598m60205j912460k847748l428192k731552n68771R20486
816.9F96590805L251267M204406L597183K315903K98538k646942m337311k650604k938766
825.5F97684479k478028p71102K63290J292114J287232P35321j599274l706512n619431
834.2F87088089o672058n977097m905014l966751k570572k40326M65317r3536r91364
842.9F62136688k002258l708115m872131m242020l615493j008225K534485M856872
850.6F50079803N526963N444412M682617K633286K524566Q49839j588364r12628j5793
859.3F69224701K143555M588012O530991O096115L647766K087937n28031k291870k783508
868F88715668k417832j465912k75421J672745M216919N683517M713059K567902j53351
$$ plain form
808.2 701873932 706124649 707619247 707159042 705246582 702398834 698970642 696239090 695670319 696590805
816.9 696590805 699842072 704046478 707643661 709959564 710258102 707611160 703273849 700623245 697684479
825.5 697684479 695206451 694435349 694698639 695990753 697277985 698013306 696414032 692707520 687088089
834.2 687088089 680416031 674438934 669533920 665567169 662996597 662756271 663221588 663128052 662136688
842.9 662136688 660134430 656426315 651554184 647312164 643696671 642688446 645222931 650079803
850.6 650079803 655606766 661051178 665733795 668367081 670891647 671741486 670153122 669240494 669224701
859.3 669224701 671368256 675956268 682487259 688583374 692231140 694319077 693791046 691499176 688715668
868 688715668 686297836 684831924 684556503 686229248 690446167 696129684 700842743 703410645 703257294
876.7G03257294j942673l432236m045334l954925m128571k199630N34286K072754K390900
885.3F88551865J704559p17163l342590m427262l928604l054810k684326j68533K049942
894F73983078L757553M493408K616730J672287L11737k056656l299713k868729k842025
902.7F75767670k359085l78418J313629L259125K487411k20337k962494n071335n697097
911.4F66139069o227341n258103m263534k477722n27344K61230J140748L28598j746827
920F47368774l624496n298271o368370n797539l892517k011643o99348J411934K635498
928.7F23724022J833076J044999l49160j572723j931534k375870j426735J490174L908729
937.4F24344978N337868O868210O798324N719605M567795K589798P28378r64966j013107
$$ plain form
876.7 703257294 701314621 697882385 693837051 689882126 685753555 683553925 684088211 686160965 688551865
885.3 688551865 690256424 689539261 686196671 681769409 677840805 674785995 672101669 671933136 673983078
894 673983078 677740631 682234039 684850769 686523056 686834793 684778137 681478424 678609695 675767670
902.7 675767670 673408585 673030167 674343796 677602921 680090332 679869995 676907501 671836166 666139069
911.4 666139069 659911728 654653625 650390091 647912369 647385025 647646255 648787003 649115601 647368774
920 647368774 643744278 638446007 632077637 626280098 622387581 620375938 619676590 621088524 623724022
928.7 623724022 625557098 626602097 626252937 624680214 622748680 620372810 618946075 620436249 624344978
937.4 624344978 629682846 636551056 643349380 649068985 653636780 656226578 656954956 655989990 654976883
946.1F54976883N80902K332153M490509N391617N294571L971634J553116m06876k397155
954.8F75787354m403992n328446l907318k647781j122666N43747Q22373O06689l51944
963.4F59998016k580642n313645o550903o575241m767723k528649p07206J376915K273445
972.1F34624367J688499J42746j099129k740249l755913l700371l478927j947136j287079
980.8F18446808m8256J199379L58086k23427j378899l597565m807739n119667o375885
989.5E98452835o709900n058822m023629n994949j0123901j4679451j3265953m82483
997.2E38113747J0956039J1553497N446930O64978m57077K00653J269036J573868J449966
1005.9E70771637J076126M32434j747970l822060l918076m123153m084664k775039
$$ plain form
946.1 654976883 655557785 657889938 662380447 667772064 673066635 677038269 678591385 678184509 675787354
954.8 675787354 671383362 666054916 662147598 659499817 658377151 658920898 659743271 660349960 659998016
963.4 659998016 657417374 652103729 645552826 638977585 634209862 631681213 630974007 632350922 634624367
972.1 634624367 636312866 636455612 635356483 632616234 628860321 625159950 621681023 619733887 618446808
980.8 618446808 618398552 619597931 619956017 619732590 618353691 614756126 609948387 604828720 598452835
989.5 598452835 591742935 586684113 582660484 576665535 566541634 551862183 538596230 538113747
997.2 538113747 549069786 560623283 566070213 566735191 566278114 566478767 567747803 569321671 570771637
1005.9 570771637 571847763 572280197 570532227 566710167 562792091 558668938 554584274 551809235
1013.6E51809235p30782j67236M12407k2927j644783j889038l434753m687424n159721
1022.3E34484978m793816l605804k000618J53045M53415J41258j314468j871719k461891
1031E19184380l844338m583130n087929l362693j341248Q91686O10389J89667Q27904
1039.6E03484688q9493p48940k309074k339668k058449j521072k21596Q65211J979714
1048.3D97041321K559738K976913J977387J376037j113777l144226k450256O61774
1056D99884911J708488r88998J738205K153816J542587J239395j474952r47304k109871
1064.7E02746277l061447k921524j343727j060067j009941J481858J479263K378731
1072.4D98689423j09787k413063k336274k992096l071250k975655o96678j67771J420555
$$ plain form
1013.6 551809235 551078453 550911217 551323624 551300697 549655914 547766876 544332123 539644699 534484978
1022.3 534484978 529691162 526085358 524084740 524237785 524691200 524832458 523517990 521646271 519184380
1031 519184380 515340042 510756912 505668983 502306290 500965042 501856728 502467117 502656784 503484688
1039.6 503484688 503395195 502646255 500337181 497997513 495939064 494417992 494196396 495061607 497041321
1048.3 497041321 499601059 502577972 504555359 505931396 504817619 501673393 499223137 499884911
1056 499884911 501593399 500604401 502342606 504496422 506039009 507278404 505803452 504856148 502746277
1064.7 502746277 499684830 496763306 495419579 494359512 493349571 494831429 496310692 498689423
1072.4 498689423 498579636 496166573 493830299 490838203 487766953 484791298 484094620 483926849 485347404
1081.1D85347404J804123J200104L49579j884384j953850l659706m301186m731521
1088.8D72170563l759804l092651l358536l172646n889091o031075r352875j0955696
1096.5D26558189j0825882j2405052j1495933j1862717r785385j0692558q981553q905220
1104.2C41603889j0557327j0649185j2372036r553165j1471100r815693r240132q008289
1112B59936962n703468o223602l092061m554920n95321o77376j00975M01764q73471
1120.6B38517532K406235P82890L783684K167072K794228L081932J347904J868172
1128.4B56749649j557636P78465j057606j690693l471927m260140k867355m419365
1136.1B38203392j441765l099365j911316m026012l920365k795143n248508l638668
$$ plain form
1081.1 485347404 487151527 488351631 488701210 486816826 484862976 481203270 476902084 472170563
1088.8 472170563 468410759 465318108 461959572 458786926 452897835 446866760 437513885 426558189
1096.5 426558189 415732307 403327255 391831322 379968605 370183220 359490662 350509109 341603889
1104.2 341603889 331046562 320397377 308025341 298472176 287001076 277185383 267945251 259936962
1112 259936962 254233494 248009892 244917831 240362911 239767590 239090214 238989239 239391003 238517532
1120.6 238517532 240923767 241706657 245490341 247657413 250451641 253533573 254881477 256749649
1128.4 256749649 255192013 255970478 254912872 253222179 249750252 245490112 242622757 238203392
1136.1 238203392 236761627 233662262 231750946 227724934 223804569 221009426 215760918 212122250
1143.8B12122250o269932l168907m309254m011231k844772l553638n32074k058621
1151.5A85373821L34187j427307N78212O46668N21183L122539R50604L984222K516346
1160.2A96600475M081955K588845L022251N466785L369331N137997L496494O617260
1167.9B30381393N884152O570701P421647P072429J0173111P752533R391461P752056
1175.6B92399483Q596954Q797970P554665R089717P864533J0492401R559250R869461
1183.3C64224434Q853340P995148Q412628N955582N901489M083633N055390M828224
1191D15309868N427437O821556O594467P112274M989891N974808N283775M688797M491883
1199.7D66694756L814697M763183M693146O333618O246262O814613N627365L488121
$$ plain form
1143.8 212122250 205852318 202683411 198374157 194362926 191518154 187964516 187432442 185373821
1151.5 185373821 185708008 184280701 184858913 185505581 186026764 189149303 190099907 194084129 196600475
1160.2 196600475 200682430 203271275 206293526 211760311 215129642 220267639 223764133 230381393
1167.9 230381393 236265545 242836246 250257893 257330322 267503433 275255966 284647427 292399483
1175.6 292399483 300996437 309794407 317349072 326438789 334303322 344795723 354354973 364224434
1183.3 364224434 373077774 381072922 389485550 395441132 401342621 405426254 410481644 415309868
1191 415309868 420737305 427558861 434153328 441265602 446255493 452230301 457514076 462202873 466694756
1199.7 466694756 470509453 475272636 479965782 486299400 492545662 499360275 504987640 508475761
1207.4E08475761L045159K168312K164497Q16269J913986K489243K656555M300156
1215.1E28029938M335937L804665K132683J273079r2164p08084j358528j674766j1139
1223.8E35731621Q59451K772980K792816K537117J725235K09694m12254j341858r60045
1232.5E43914757j458206j35918J263580J772003K719994K684822K866974J207314
1240.2E54835320l2807j167564j409645j047936j103592L29819J042862K448158K442551
1248.9E56337166J896515J232414K19345k46773j444282j314888j423569j1215J353912
1257.6E56598625J636658K337532K331390K503472J115303K94533q60634j429367q80547
1266.3E63646965l42712J558685J852722K843781L317871K938881K269058J480560
$$ plain form
1207.4 508475761 511520920 513689232 515853729 516669998 518583984 521073227 523729782 528029938
1215.1 528029938 532365875 536170540 538303223 539576302 539484138 538776054 537417526 535742760 535731621
1223.8 535731621 536591072 539364052 542156868 544693985 546419220 546628914 546216660 544874802 543914757
1232.5 543914757 542456551 542320633 543584213 545356216 548076210 550761032 553628006 554835320
1240.2 554835320 554802513 553634949 552225304 551177368 550073776 550403595 551446457 553894615 556337166
1248.9 556337166 558233681 559466095 559685440 559438667 557994385 556679497 555255928 555244713 556598625
1257.6 556598625 558235283 560572815 562904205 565407677 566522980 566817513 565956879 564527512 563646965
1266.3 563646965 563304253 564862938 566715660 569559441 572877312 575816193 578085251 579565811
1274E79565811J031189l97301j22909Q8196R63821K469101L346939M235420L797112
1282.7E94977379L284721K222176J243324j04675p10221K10305R69772K159767K945938
1291.3F07198486L973923L990402L425370K576255R72138J99470l05557n97839l88947
1300F21043701O12755J887665K739486L160897K755585K144355R96247o08826j571388
1308.7F33160477r12323k95334n18036K21329J357536K530556K817306J774674P10678
1317.4F40846863j14517p69768q20694n62859l30658N26238J464882K206192K836837
1326F45282516K559052J518631K17743q51669j404953j637192j170654m62113P50198
1334.7F44801559J177521R62753J366578R26513k87475r22852l46298n91354j605988
$$ plain form
1274 579565811 580597000 580199699 580076790 580164986 581128807 583597908 586944847 591180267 594977379
1282.7 594977379 598262100 600484276 601727600 601622925 600912704 601123009 602092781 604252548 607198486
1291.3 607198486 611172409 615162811 618588181 621164436 622136574 622336044 622030487 621432648 621043701
1300 621043701 621656456 623544121 626283607 629444504 632200089 634344444 635340691 634731865 633160477
1308.7 633160477 632248154 631952820 631434784 631656113 633013649 635544205 638361511 640136185 640846863
1317.4 640846863 640732346 639962578 639141884 638579025 638248367 638774605 640239487 642445679 645282516
1326 645282516 647841568 649360199 649577942 648726273 647321320 645684128 644513474 644051361 644801559
1334.7 644801559 645979080 646941833 648308411 649234924 648947449 648024597 647678299 647086945 645480957
1343.4F45480957q91800K00195O17142J259995J813125R74961L73916J19019j575241
1352.1F48372269k045288j836853j341782m65927J68075R45206R96933J213608J25351
1360.8F46131592j232758j897049k325973k05384j029548j314087q37288o87141Q27713
1369.4F37430077O87370K10419l27263j558953l411369k478027k23007n43519j157264
1378.1F28628464K72903J382714J148796J038055K39410n03540m63714p57485j460533
1386.8F29525070j977424J113472J964874J028061O59256O43501N02129k048722k517509
1395.5F28892708N13649p83272j968956k299881j91498J128197J97868J99318K44789
1404.2F25932922j161956p5570J07651j451416j709213j608086q21533r9144K02942
$$ plain form
1343.4 645480957 644589157 644789352 645406494 646666489 648479614 649454575 649828491 649947510 648372269
1352.1 648372269 646326981 644490128 643148346 642682419 642850494 643795700 644792633 646006241 646131592
1360.8 646131592 644898834 643001785 640675812 640470428 639440880 638126793 637289505 636602364 637430077
1369.4 637430077 638117447 638327866 638000603 636441650 633030281 630552254 630329247 629785728 628628464
1378.1 628628464 628901367 630284081 631432877 632470932 632710342 632206802 631743088 630985603 629525070
1386.8 629525070 627547646 628661118 630625992 631654053 632313309 632956810 633458939 631410217 628892708
1395.5 628892708 629406357 628623085 626654129 624354248 624162750 625290947 625488815 625688133 625932922
1404.2 625932922 624770966 624695396 624803047 623351631 621642418 620034332 619212799 619113655 619316597
1412.8F19316597J001053R11827K41432r23996j283378j95961l512269J34469K158584
1421.5F17848358L53890o30379K00729K869911K327919Q19054P95441q25577j743546
1430.2F22015800N99518J161652K4948K98615J629295J75667j034470L414269L410987
1438.9F31696281J599350Q8120l80669l52478P22122M80385J038933J398735J7433
1447.6F36308212J39694K362938J587334o41022m04358J04676m7150p80792l87840
1456.2F38241692k372246j246033O540299M799423L743973J927108k2659N84564k795944
1464.9F49400177M14734K408523K319565K148438J519241J860123j278687j855240
1472.6F56936874K663880M555206L706894L36227K466431L233643J931381J537781
$$ plain form
1412.8 619316597 620317650 621229477 621470909 620546913 619263535 619067574 615555305 615689774 617848358
1421.5 617848358 618202248 617571869 617772598 620642509 622970428 623789482 624584923 623759346 622015800
1430.2 622015800 622615318 623776970 623801918 624100533 625729828 625905495 624871025 628285294 631696281
1438.9 631696281 633295631 633383751 633003082 632650604 633372726 633853111 634892044 636290779 636308212
1447.6 636308212 636447906 638810844 640398178 639757156 639352798 639457474 639410324 638629532 638241692
1456.2 638241692 635869446 634623413 641163712 645963135 649707108 651634216 651611557 652196121 649400177
1464.9 649400177 649814911 652223434 654542999 656691437 658210678 660070801 658792114 656936874
1472.6 656936874 659600754 664155960 667862854 668199081 670665512 673899155 675830536 677368317
1480.3F77368317J494903K486954J924362O80847j17950n70755j751022j338807O84967
1489F80861816j990051M51965L444367K186737K09885n79300k020264p700958J654892
1497.7F76519089J97143j942749J402207n89066l80020k43454k54364k494354j1381226
1506.4F60833206o456909J885986L151169K59094J445313j454163k364349j96762k348404
1515.1F54754181j175308m428330k552414L528519J658859n078430n640106J888656
1522.8F42955627K029648J182328k745209O5460M9438j441497Q10318K36282j209030
1531.5F41933365k286377l059082k794762K294045J215553k39296J1177q658638p179832
1540.1F21236153M695587J589203o27327K164802P33567n28260L090325J205787K54517
$$ plain form
1480.3 677368317 678863220 681350174 683274536 683955383 683837433 683266678 681515656 680176849 680861816
1489 680861816 678871765 679323730 682768097 684954834 685164719 684585419 682565155 674864197 676519089
1497.7 676519089 676716232 674773483 676175690 675586624 675206604 674963150 674708786 672214432 660833206
1506.4 660833206 654376297 656262283 659413452 659672546 661117859 659663696 657299347 657102585 654754181
1515.1 654754181 653578873 649150543 646598129 650126648 651785507 646707077 641066971 642955627
1522.8 642955627 644985275 646167603 643422394 643487854 643537292 642095795 642906113 643142395 641933365
1531.5 641933365 639646988 636587906 633793144 636087189 637302742 637063446 637074623 628415985 621236153
1540.1 621236153 625931740 627520943 626893616 629058418 629791985 629263725 632354050 633559837 633814354
1548.8F33814354k052078o30074L336792J422272P05643l058892R65348L116722o19240
1557.5F37000847r299660o052246J1190414O105462M149131K262192N06134o91910
1565.2F45170364Q75397J684952l30200j023712l196793L012009K752914l82080n27268
1573.9F48035583l10134q40302p390060K201690K238617o53610o68640j385193o41861
1582.6F40586090j319694q21343j284714j714706j697311l030053j649246k361793
1590.3F26707230k166062k703628j854248k079087k739525r18540k441826j776657
1598F10027657k790108k434044k940865l083496k274131l629761r95064j914978k086525
1606.7E87878685l165588k129136k178497l651886j180877k888032j585273l253708
$$ plain form
1548.8 633814354 631762276 631132202 634468994 635891266 636596909 633538017 634503365 637620087 637000847
1557.5 637000847 627701187 621648941 632839355 638944817 643093948 645356140 645862274 645170364
1565.2 645170364 646045761 647730713 647400513 646376801 643180008 646192017 648944931 648562851 648035583
1573.9 648035583 647725449 646885147 639495087 641696777 643935394 643281784 642613144 641227951 640586090
1582.6 640586090 639266396 638445053 637160339 635445633 633748322 630718269 629069023 626707230
1590.3 626707230 624541168 621837540 619983292 617904205 615164680 614246140 611804314 610027657
1598 610027657 607237549 604803505 601862640 598779144 596505013 592875252 591880188 589965210 587878685
1606.7 587878685 584713097 582583961 580405464 576753578 575572701 572684669 571099396 567845688
1614.4E67845688j880684k282791q467026K565117n61409q84438k366485j205673l194161
1623.1E49568138n542679J118088q06618l67736m265328r11751L14598j273651j033783
1631.7E36799278k426758l04565k314148n385361j961136J425705J280632M53568J450767
1640.4E29017982q80584Q46367j118470K07673k42310m589005N41115q90808M961128
1649.1E27853088K305642K595520J616478p393837k695275N122986O518250J800422
1656.8E37723274K082024J258163J590004K109185J344032J649093M96407M327698
1664.5E52579880K343597K264328J695748Q6517P15141J029206L953475K326050M571190
1673.2E71565132L796768P10793J571846L354454L669395J527214J874466R41697L831138
$$ plain form
1614.4 567845688 565965004 563682213 555215187 557780304 557218895 556334457 553967972 552762299 549568138
1623.1 549568138 544025459 545143547 544336929 543969193 539703865 538792114 539106712 537833061 536799278
1631.7 536799278 534372520 534067955 531753807 526368446 524407310 525833015 527113647 527567215 529017982
1640.4 529017982 528137398 528983765 527865295 528072968 527830658 523241653 523782768 522891960 527853088
1649.1 527853088 530158730 532754250 534370728 526976891 524281616 529404602 535922852 537723274
1656.8 537723274 539805298 541063461 542653465 544762650 546106682 547755775 548252182 552579880
1664.5 552579880 554923477 557187805 558883553 558970070 559685211 560714417 564667892 566993942 571565132
1673.2 571565132 575361900 576072693 577644539 580998993 584668388 586195602 588070068 589011765 592842903
1681.9E92842903L650322l273239J122055O186752P285271L365669K263527L240128
1689.6F16683388K527580L928833K553291L156777L413543J998673k166214O488800
1697.3F38584671P559357M842453R87549j376420Q366700N293502K351227K489701
1705F69098740L415756M037552M667434M709092K062301J592560K200623J327362J298980
1713.7F94410400j393814J014710M393387M22515l470840O890183N508575K213669
1721.4G09988785R61609j76316M03366J549912J352844J346894J625137J383362j977158
1730.1G16458435O89163L528214P11365n783082m316864O876526M233170J546478K533417
1738.8G26476822l59955m03061M075546J644516j451644J456527K606125O31867M33273
$$ plain form
1681.9 592842903 596493225 593219986 594342041 600528793 607814064 611179733 613443260 616683388
1689.6 616683388 619210968 623139801 625693092 628849869 632263412 634262085 632095871 638584671
1697.3 638584671 646144028 650986481 651974030 650597610 658964310 664257812 666609039 669098740
1705 669098740 672514496 676552048 681219482 685928574 687990875 689583435 691784058 693111420 694410400
1713.7 694410400 693016586 694031296 698424683 698847198 695376358 702266541 707775116 709988785
1721.4 709988785 710950394 710774078 711177444 712727356 714080200 715427094 717052231 718435593 716458435
1730.1 716458435 717147598 720675812 721387177 715604095 711287231 718163757 722396927 723943405 726476822
1738.8 726476822 726116867 725713806 729789352 731433868 729982224 731438751 734044876 734676743 735110016
1747.5G35110016L86200J873474M818191J292954J369019M813385K514114J245651
1755.2G53423004O96640k026596R78088K261277K334823K352829k046127J051865L812408
1763.9G62838211J168442N3634O76651J4802k793885J764069K122421k376327k706986
1772.5G60761032J586533N463409K133789j105575J295623R7275L37296o29425j009751
1781.2G68930206K076721K435837J442032p26700M09088J710816J92337m59061k32696
1789.9G75778580j680222j101074j704407J323776M174805J081009J65253J567535
1797.6G79605255Q46405j345596k065430J057434m82788P63931K279664J185607J294098
1806.3G83138580J11847j23367L37601p57218j904297L15781J016159L65982J122360
$$ plain form
1747.5 735110016 735496216 737369690 742187881 743480835 744849854 749663239 752177353 753423004
1755.2 753423004 754119644 752093048 753071136 755332413 757667236 760020065 757973938 759025803 762838211
1763.9 762838211 764006653 764060287 764736938 764751740 761957855 763721924 765844345 763468018 760761032
1772.5 760761032 762347565 767810974 769944763 768839188 770134811 770232086 770569382 769939957 768930206
1781.2 768930206 771006927 773442764 774884796 774158096 774567184 776278000 776470337 776011276 775778580
1789.9 775778580 774098358 772997284 771292877 772616653 776791458 777872467 778037720 779605255
1797.6 779605255 780451660 779106064 777040634 778098068 777615280 778379211 780658875 781844482 783138580
1806.3 783138580 783250427 783127060 783464661 782707443 780803146 781118927 782135086 782501068 783623428
1815G83623428R94873J200333M57382L76206M01992q21304n28793r23691O35376J25732
1824.6G85541534l142929J398239L340302J800690j765061l507385K171021K079391
1832.3G87915802l07388l29972j28784K18811J05896P30438K186127R68476K93960
1841G91653366n84183j19247j664810n860901K631531K652511J89820Q34503J779403
1849.7G91511993J400452K92358Q1254n42450k68631n03846p10067k25678l35617O13098
1859.3G91312866J118775J314163O29501N08576p0496j038055q79593j791153q41370
1868G90263214j241073k81373K847748K510681J136780L31040j0453p99255o44760
1876.7G94112549o61164l03192J42594K55890R30481K89154O96945L78952r1782K14081
$$ plain form
1815 783623428 784618301 785818634 786276016 786652222 787054214 786232910 785704117 784780426 785415802 785541534
1824.6 785541534 782398605 783796844 787137146 788937836 787172775 783665390 785836411 787915802
1832.3 787915802 787608414 787278442 787149658 787368469 787474365 788204803 790390930 791359406 791653366
1841 791653366 791069183 790949936 789285126 783424225 786055756 788708267 788898087 789732590 791511993
1849.7 791511993 792912445 793204803 793286057 792743607 792474976 791971130 791261063 791035385 790699768 791312866
1859.3 791312866 792431641 793745804 794375305 794883881 794813385 793775330 792895737 791104584 790263214
1868 790263214 789022141 788740768 791588516 794099197 795235977 795567017 795556564 794757309 794112549
1876.7 794112549 793451385 793148193 793290787 793546677 794477158 794766312 795463257 795842209 795750427 795964508
1886.3G95964508n13229k26288j815491k013168J311950J698990J231079Q95539l83835
1895G96150055m19006Q89892n9967n40085j130142j072311J10473L35160Q93249O43540
1904.7G95800858Q77533O03332k23846m30603q69370j157227p62252M15268K59323
1913.3G94513016M55017L55911Q89587J368409k143326p97348J030502n6305r65500
1922G94649963k122879J37787J641159J156922O06002P89414L60718j36338M1352n68161
1931.7G96555939j031876j001358q1482L7918M35333Q95310N38940N96238R689J01318
1941.3G97055969k116470k828446J110688Q29849j34048R7808O36673Q01773P08161
1950G96161957L82309r0103l53470r08585r54666o54984J32218L28827M99344R06448
$$ plain form
1886.3 795964508 795451279 795224991 793409500 791396332 792708282 794407272 795638351 796533890 796150055
1895 796150055 795731049 796620941 796560974 796020889 794890747 793818436 793928909 794264069 795157318 795800858
1904.7 795800858 796678391 797281723 797057877 796627274 795757904 794600677 793838425 794253693 794513016
1913.3 794513016 794968033 795323944 796213531 797581940 795438614 794641266 795671768 795615463 794649963
1922 794649963 792527084 792664871 794306030 795462952 796068954 796858368 797219086 797082748 797124100 796555939
1931.7 796555939 795524063 794522705 794441223 794479141 794914474 795809784 796348724 796944962 796954651 797055969
1941.3 797055969 794939499 792111053 793221741 794051590 793917542 794015350 794652023 795453796 796161957
1950 796161957 796544266 796454163 796100693 795192108 794237442 793582458 793714676 794043503 794542847 795449295
1959.6G95449295L96347M05731J40229j76697o00205r51538r57336j065903J13144
1968.3G92753067R10873R25065O18209L64304J96075O1722l54080q87070n61447o88248
1978G93338470n63736J64719O14090M92172L27759N16052k26669n16891n20783r47189
1987.6G92677994j042176k33917N66941l24326l80707J195679J307831M32510o7367
1996.3G94132462o19965r20868n73196o43769m7073L35770K11258L26690L85437L18909
2005.9G92905655j78909j50605n59311j021804p44553l68118Q4839L00293O31179N30472
2015.6G91429138j20315n08423J57699O0273n44053m71572q80967m52728Q4915P15637
2025.2G89469604J023331K02942R4757j10397l90167p98111r38416n40008r1019K87094
$$ plain form
1959.6 795449295 795845642 796251373 796391602 796214905 795614700 794663162 793705826 792639923 792753067
1968.3 792753067 793663940 794589005 795207214 795571518 795767593 795829315 795475235 794588165 794026718 793338470
1978 793338470 792774734 792939453 793553543 794045715 794373474 794889526 794662857 794145966 793625183 792677994
1987.6 792677994 791635818 791401901 791968842 791644516 791263809 792459488 793767319 794199829 794132462
1996.3 794132462 793512497 792591629 792018433 791374664 791327591 791663361 791874619 792201309 792586746 792905655
2005.9 792905655 792726746 792576141 792016830 790995026 790250473 789882355 789967194 790267487 790898666 791429138
2015.6 791429138 791308823 790800400 790958099 791018372 790474319 790002747 789121780 788669052 788753967 789469604
2025.2 789469604 790492935 790695877 790790634 790680237 790290070 789491959 788553543 788013535 787922516 788209610
2034.9G88209610J58615L54080O00663L41796k83050k54059o30569r08509k67181m40750
2044.5G86880646j3123K136L07465P86209J41373J99051P4310k70004r51004p27310
2054.1G86429749m56543n39780L72848L59650L57742m119l4943K04315k21176l87955
2063.8G86079788j015701o55289j62430r5748j61210m2114L22495N4702J93329l79715
2073.4G84138107q65783p44400p25098o38962m50592p8735j02387L49274J31149j4877
2083.1G80997696K91519k59018n43365o99921l04031k64664l88107K99530R06601N95779
2092.7G80632019j33743K70004K66876m3106j05209l42865l57437k52457K29721O42395
2102.4G80806198P59125M54101L59345N0049q5907J39160l87421k13928O5613M6921
$$ plain form
2034.9 788209610 788368225 788722305 789322968 789664764 789381714 789127655 788497086 787588577 787321396 786880646
2044.5 786880646 786867523 786869659 787177124 787963333 788104706 788303757 788378067 788108063 787157059 786429749
2054.1 786429749 785973206 785433426 785806274 786165924 786523666 786519547 786484604 786688919 786467743 786079788
2063.8 786079788 785064087 784408798 784246368 784150620 783989410 783947296 784269791 784324493 784517822 784138107
2073.4 784138107 783272324 782527924 781802826 781163864 780713272 780634537 780532150 780881424 781012573 780997696
2083.1 780997696 781289215 781030197 780486832 779786911 779482880 779218216 778830109 779129639 780036240 780632019
2092.7 780632019 780498276 780768280 781035156 780992050 780886841 780543976 780186539 779934082 780163803 780806198
2102.4 780806198 781565323 782019424 782378769 782428818 782342911 782482071 782094650 781880722 781946335 781993256
2112G81993256K52380N04608K21176K16446O33240j17340k93503n08652m27475k78015
2121.6G82196121l58581N67474o2866m47998l1586M01840M46244m39225m21676l49045
2131.3G81500702j82037r0332L91159L06701l16314L92532O98624M82482m77752l89710
2140.9G82316055K19040m97741m31138K38953N61524K43606M42658M82940L49655M57154
2150.6G84382706q4381o4087q5373l67356m65316J16424K96173N4550K88697J70059
2160.2G84242096M50363J07193j43661j34736j97677k43225n08881K48337R0408L96653
2169.9G84306870P60421Q3084j30005o91146k71683r8343l43552l30047l80860L3799
2179.5G82938538K37274L08838L19595N02472J9989l11508l33252l05176K30713K670
$$ plain form
2112 781993256 782245636 782750244 782971420 783187866 783821106 783703766 783410263 782901611 782474136 782196121
2121.6 782196121 781837540 782405014 782342148 781894150 781862564 782264404 782710648 782271423 781849747 781500702
2131.3 781500702 781318665 781228333 781619492 781926193 781609879 782002411 782701035 783183517 782705765 782316055
2140.9 782316055 782535095 782037354 781606216 781845169 782406693 782650299 783092957 783575897 783925552 784382706
2150.6 784382706 784298325 784234238 784148865 783781509 783316193 783432617 783728790 783783340 784072037 784242096
2160.2 784242096 784692459 784799652 784655991 784521255 784323578 784080353 783571472 783819809 783910217 784306870
2169.9 784306870 785067291 785150375 785020370 784329224 784057541 783959198 783615646 783285599 782904739 782938538
2179.5 782938538 783175812 783484650 783804245 784306717 784326706 784015198 783681946 783376770 783607483 783610153
2189.1G83610153l7765L19595R19571N39322j6174O52923O67648L32108m74396n97915
2198.8G85915070m807L77503L02734k3041N67703L98636R2850K06833L14407J66474
2208.4G88314362l31955l46451l58124j12457J62277P41959N77240J85318J73797o5918
2218.1G88940048J80207o21338p19376n00641j49155L72620k46429O67267R21401K45591
2227.7G89090195k16751l46222M8217m51736k64893P172l8452q9264l7994J36795L83072
2238.3G88220139L00903l11356K33536j30768o03027j90506j50681j28402j58692L02201
2248G87383347J39999N59845O16913q6899j28174o15539n71137n29098J31378O48193
2257.6G87548828L72162K26746M4708J78680J29700M96063j56097l84674r8191q16726
$$ plain form
2189.1 783610153 783572388 783891983 784811554 785350876 785334702 785987625 786655273 786987381 786512985 785915070
2198.8 785915070 785910263 786287766 786590500 786567459 787135162 787533798 787626648 787833481 788147888 788314362
2208.4 788314362 787982407 787635956 787277832 787165375 787327652 788069611 788646851 788832169 789005966 788940048
2218.1 788940048 789120255 788498917 787779541 787278900 787129745 787502365 787255936 787923203 788844604 789090195
2227.7 789090195 788873444 788527222 788575439 788123703 787858810 787865982 787827530 787738266 787700272 787837067 788220139
2238.3 788220139 788521042 788209686 788443222 788312454 787709427 787518921 787368240 787239838 787081146 787383347
2248 787383347 787523346 788083191 788700104 788613205 788485031 787869492 787298355 786769257 786900635 787548828
2257.6 787548828 787920990 788147736 788192444 788371124 788500824 788996887 788840790 788456116 788357925 787541199
2267.3G87541199l17307L76358O37741J23978J71814L84674r8724j34354l69415N7907
2276.9G88373871o180l20969l83758J56631N87693J82190L45840k06833J12457R1858
2286.5G88932800m44412l97110q28323r2774J20163O58112P05490J95160L50036l49426
2296.2G88849716k35672q3313k98538p66754k7390M36478n21393K46124Q60978O30951
2305.8G89091187l32413k82746q3313p38449l96728n51453k84347n94635M19235O14777
2315.5G86861115j74561J259308L03726n63202p61413n95322l48129p22123l20663
2324.2G84938736n94864Q77380J79673K21100J434631k79770l99246k03629Q9035n80291
2333.8G85682755l69187L24936l26843M54101Q62656k5330m48227J118317j37634j706543
$$ plain form
2267.3 787541199 787223892 787600250 788237991 788361969 788533783 788918457 788819733 788685379 788315964 788373871
2276.9 788373871 788367691 788046722 787662964 787819595 788407288 788589478 788935318 788728485 788840942 788932800
2286.5 788932800 788488388 788091278 787262955 787170181 787290344 787948456 788653946 788849106 789199142 788849716
2296.2 788849716 788614044 788530731 788232193 787465439 787438049 787874527 787353134 787599258 788460236 789091187
2305.8 789091187 788758774 788476028 788392715 787654266 787257538 786706085 786421738 785827103 786246338 786861115
2315.5 786861115 786686554 787945862 788249588 787686386 786924973 786329651 785981522 785259399 784938736
2324.2 784938736 784343872 785221252 785400925 785622025 787056656 786776886 786377640 786174011 786263046 785682755
2333.8 785682755 785313568 785638504 785311661 785765762 786628418 786603088 786154861 787273178 787135544 785429001
2343.4G85429001o06003M8981J040268J14670M62341K002487J749878J74789p45010
2352.1G89671402r68323j199951o71616r44290j268997J55182N92728R98687J731339
2360.8G88096161o97403r30100O87333r50470p17926j90735J22909O4163J13831J766205
2370.4G87363968J870804J238022m31061l54386L23029m13666R8572K594j82877P5074
2380.1G89590073K70919N79758M67758L63922M43802M54407o0348l94211n12924m57688
2389.7G90745468k0370J39999M24805P46612O86722K16751m06647p63626k87246J8539
2399.4G91501007m41055m77753m21295J51291P78045Q38089N26810k25143n22614n44586
2409G91162796l03955l62778n70450n36117j66702P54013Q24356N12695L67050J64414
$$ plain form
2343.4 785429001 784822998 784871979 785912247 786026917 786489258 788491745 790241623 790416412 789671402
2352.1 789671402 788703079 787503128 786831512 785887222 784618225 784773407 785366135 786364822 788096161
2360.8 788096161 787398758 786468658 787155991 786205521 785487595 785296860 785419769 785483932 785597763 787363968
2370.4 787363968 789234772 790472794 790041733 789687347 790010376 789596710 789695282 789697876 789514999 789590073
2380.1 789590073 789860992 790440750 790908508 791272430 791716232 792170639 792110291 791716080 791203156 790745468
2389.7 790745468 790725098 790865097 791289902 792036514 792723236 792939987 792533340 791769714 791482468 791501007
2399.4 791501007 791059952 790582199 790160904 790312195 791090240 791928329 792455139 792229996 791707382 791162796
2409 791162796 790858841 790496063 789925613 789389496 789222794 789976807 790801163 791313858 791680908 791845322
2418.7G91845322m04435p51113o81839r15757k30331K21023j32446l3264N65109Q13446
2428.3G90295715L79105j33514p12357n21622o12869n00336J61209o3629K30942M93012
2438G89015656M11911M94461K10418p72400j011352m79202q22754k16141J33057m0818
2447.6G86922836P07321Q59833M46396j15738l57742p15027j006012q44498m51736
2456.3G85445633o4316L64533P26699J73035N91431O50024m37851m94919n58853p84149
2465.9G85611267q48541k91901J82495L76358N71976L22800J44577k46201n1575l40042
2475.6G85431213j088485q45185m11911J06507J79138K57950N43213P26089K83737
2484.2G85182266m82940l81623o85043q40302l00903n19104o18744K68860N76935L50342
$$ plain form
2418.7 791845322 791440887 790689774 790007935 789092178 788861847 789082870 788950424 788917160 789482269 790295715
2428.3 790295715 790674820 790541306 789828949 789307327 788694458 788194122 788355331 788291702 788522644 789015656
2438 789015656 789427567 789922028 790132446 789360046 788348694 787869492 787046738 786830597 786963654 786922836
2447.6 786922836 787630157 788489990 788936386 788820648 788462906 787747879 786741867 785897369 785445633
2456.3 785445633 785381317 785745850 786472549 786645584 787237015 787887039 787449188 786954269 786395416 785611267
2465.9 785611267 784762726 784470825 784653320 785029678 785601654 785924454 786069031 785822830 785771255 785431213
2475.6 785431213 784342728 783497543 783085632 783192139 783371277 783629227 784172440 784898529 785182266
2484.2 785182266 784699326 784317703 783632660 782792358 782491455 781972351 781353607 781622467 782199402 782549744
2493.9G82549744M75158J33210m77066o29197l94287p81860p69425o5002P1564N19562
2503.5G80632401N82275N31311N38177k51236p71636n66559n02549j013793p39670
2512.2G78438721q0796O37055J235351P37305J86768r0943m48608q48847q16268q12226
2521.9G78137512n54352j08184J77383Q75015N51377L80325L31497k80609n60303r68780
2531.5G77980881o00510l68271l70407j04751N05828Q41370M14734Q58993K15149q28857
2541.1G78544159n17044q07953j306229n68542M32587M48989M99955N13382N01709
2549.8G77741013M02984J12305k27966j034317j214142j095352l92304L30124K97852
2558.5G74920197L56445N01480P33032L68805K16827o09664j538392j078567n55725
$$ plain form
2493.9 782549744 783024902 783158112 782681046 782051849 781657562 780875702 780106277 780041275 780112839 780632401
2503.5 780632401 781214676 781745987 782284164 782032928 781261292 780694733 780192184 779178391 778438721
2512.2 778438721 778357925 778994980 780230331 780967636 781154404 781063461 780614853 779766006 778949738 778137512
2521.9 778137512 777583160 777474976 777652359 778527374 779078751 779459076 779790573 779509964 778949661 777980881
2531.5 777980881 777380371 777012100 776641693 776536942 777042770 777884140 778298874 779157867 779373016 778544159
2541.1 778544159 778027115 777219162 775912933 775344391 775776978 776225967 776725922 777239304 777741013
2549.8 777741013 778143997 778256302 778028336 776994019 775779877 774684525 774292221 774622345 774920197
2558.5 774920197 775276642 775778122 776511154 776879959 777096786 776487122 774948730 773870163 773314438
2567.2G73314438K99301L24402L18603N42069O4316J40609K68326J13449o34155j117630
2576.8G73633728r16519l71933K12936J32141K37046N50995P48519K99759n22766r60617
2586.5G73043289o56280q8120n27344o22940j12457K40631N82428M77829K02561J33667
2596.1G72673264m36326j184005q24127n14451l52478Q4458J74026K70233K65122L69949
2605.7G70525665O3172m76227l58963m28620r91745r54818k05460L71933O51550N17807
2615.4G68714294K01874l26233n51147n39856o23093l21121m69589m03900j76087L59268
2625G65864410P12967K10877K45437l61480n91278n49240r22928p14722n90363j65481
2634.7G63138199k823L80936K62680J45645O40640l8834l58581q18710j234818r58404
$$ plain form
2567.2 773314438 773613739 773938141 774256744 774798813 774863129 775003738 775272064 775385513 774751358 773633728
2576.8 773633728 772717209 772345276 772558212 772690353 772927399 773478394 774226913 774526672 774003906 773043289
2586.5 773043289 772387009 772298889 771771545 771148605 771036148 771276779 771859207 772337036 772539597 772673264
2596.1 772673264 772236938 771052933 770228806 769714355 769361877 769446335 769620361 769890594 770155716 770525665
2605.7 770525665 770588837 770112610 769753647 769325027 768333282 767378464 767173004 767544937 768196487 768714294
2615.4 768714294 768916168 768589935 768038788 767498932 766875839 766554718 766085129 765681229 765505142 765864410
2625 765864410 766577377 766788254 767033691 766672211 766080933 765531693 764608765 763894043 763303680 763138199
2634.7 763138199 763135376 763516312 763778992 763924637 764565277 764526443 764167862 763349152 762114334 761155930
2644.3G61155930m38843K24228L03116L43475M44412P76367j43585q27026n43518j228562
2654G60065994j057052o65436j27182M56924P03507J026535L44009l78113q92410p25860
2663.6G58750916m84925q37402n93796k34680P2708M68750N69229J56479O9885J71433
2673.3G58108597k67945r46350j131668m18319j94779j85852K12326J76468J23596
2681.9G55476074N02548Q5068q41293n56336m34875p36694n01175q4610K4948M5929
2691.6G52979584M81186L65142J36567l00751p41577n76325p10220m19998k26441k93579
2701.2G50693588m2495K05001O61087N15442k74353p19833q14514n57480m53491p83234
2710.9G48429718j28174L93295J87455L52173K74734J47476l69797o79931r08966r18656
$$ plain form
2644.3 761155930 760717087 760941315 761244431 761587906 762032318 762808685 762665100 761838074 761294556 760065994
2654 760065994 759008942 758343506 758216324 758673248 759376755 760403290 760747299 760369186 759476776 758750916
2663.6 758750916 758265991 757428589 756834793 756600113 756672821 757141571 757710800 757867279 757937164 758108597
2673.3 758108597 757840652 756894302 755762634 755344315 755149536 754963684 755176010 755352478 755476074
2681.9 755476074 755978622 756063690 755222397 754666061 754231186 753494492 752993317 752908707 752933655 752979584
2691.6 752979584 753460770 753825912 753962479 753661728 752920151 752343826 751633606 751213608 750987167 750693588
2701.2 750693588 750651093 750856094 751517181 752032623 751758270 751038437 750223923 749666443 749212952 748429718
2710.9 748429718 748301544 748694839 748882294 749234467 749509201 749656677 749286880 748606949 747697983 746779327
2720.5G46779327l07312m27246k7694J16882m6082L73841M59671M9743r76715j153640
2730.2G44840775p44706l95279m56314k50320M12140N84717Q12606k29644m04892j24207
2739.8G44044876p79724m00391p79266o46439j30996j39771M93851M94003k3422l8452
2749.4G42094269L71094j45340p97806j114655j125717m66156l37601k6321K81982
2758.1G38733749K25754K37580O5994k68707o96564p46842n70068n44357l91922K83661
2767.8G36328278K90145k08969j27563Q1787J02539k55585l52096q33054j355667r19952
2777.4G32749863q8654K61688j9760L38593L8147n53055n52979m50973l01056q74176
2787G30547638m73023r8724l03573k7085j17645j81885r9335J83335m04740j007843
$$ plain form
2720.5 746779327 746472015 746044769 746017075 746133957 746087875 746461716 746921387 746971130 745994415 744840775
2730.2 744840775 744096069 743700790 743244476 742994156 743406296 743991013 744803619 744573975 744169083 744044876
2739.8 744044876 743265152 742864761 742085495 741439056 741308060 741168289 741662140 742156143 742132721 742094269
2749.4 742094269 742465363 742320023 741522217 740407562 739281845 738815689 738478088 738451767 738733749
2758.1 738733749 738959503 739197083 739263077 738994370 738297806 737550964 736980896 736436539 736044617 736328278
2767.8 736328278 736618423 736409454 736281891 736363678 736466217 736210632 735858536 735025482 733669815 732749863
2777.4 732749863 732661209 732922897 732903137 733241730 733279877 732726822 732173843 731722870 731421814 730547638
2787 730547638 730074615 729975891 729672318 729645233 729527588 729345703 729246368 729429703 729024963 728017120
2796.7G28017120r26208j033325o70548k36664P9575l2196j41068j25122j26037k26136
2806.3G24579391p51190q23364r53979r29947p83310n15442J6174J8921k51541l57514
2816G19248199j6860n44205r79691o49185o99234p45392o48804k39028n25132l45306
2825.6G13855362j13068m67682k50167j097031j320877q45490o25915m86832q78753
2834.3G07769547m15116j46789j72196n84259j398010j343384j507950j961136k071228
2843F98169479j655197j300125j513595j634522j394119j471405k084351j911468j177063
2851.7F84027634p78122o29349o92978k08130M34494L7461M1122M15039j60751l34244
2861.3F82152176p05338j070175o26220m94233o43539j079178j058960q02002k00577
$$ plain form
2796.7 728017120 727090912 726057587 725387039 725150375 725229950 725197754 725056686 724931564 724805527 724579391
2806.3 724579391 723828201 723004837 722050858 721120911 720337601 719822159 719838333 719857254 719605713 719248199
2816 719248199 719231339 718687134 717707443 717058258 716359024 715613632 714964828 714725800 714200668 713855362
2825.6 713855362 713742294 713274612 713024445 711927414 710606537 709761047 709135132 708648300 707769547
2834.3 707769547 707354431 707207642 707035446 706451187 705053177 703709793 702201843 700240707 698169479
2843 698169479 696514282 695214157 693700562 692066040 690671921 689200516 687116165 685204697 684027634
2851.7 684027634 683249512 682620163 681927185 681719055 682153549 682191010 682232132 682647171 682486420 682152176
2861.3 682152176 681446838 680376663 679750443 679256210 678612671 677533493 676474533 675672531 675471954
2870F75471954J18637r06143j010513q44116j282349j149597n20554j66092n07888
2878.7F69203339m87061j21689M9668k83585p98950o82450n39398p04803q70438q82263
2888.3F63882370o39877n45960n76401k23465p81021j269531m01382n94864j160355
2897F57689514q67157o02341p74765r03778o31942k06833L24402l09754o54220n68238
2906.6F52494888j125946n44357l82767q97140r64661n99518m37011j189652j095200
2915.3F45258636p73696j179352j407318j295472j444358j461182n85709k4452R5787
2924F37182884K23160N35622O9732n48019K43988L39813j96495o87523q58955J35116
2933.6F36439323J145783J195907N38178M89693O76803M37851R8648o0959M59290P02438
$$ plain form
2870 675471954 675590591 674684448 673673935 672829819 671547470 670397873 669877319 669711227 669203339
2878.7 669203339 668716278 668594589 668644257 668360672 667561722 666879272 666339874 665635071 664764633 663882370
2888.3 663882370 663242493 662696533 662120132 661896667 661115646 659846115 659444733 658849869 657689514
2897 657689514 656822357 656220016 655445251 654541473 653909531 653702698 654027100 653717346 653063126 652494888
2906.6 652494888 651368942 650824585 650441818 649544678 648580017 647980499 647543488 646353836 645258636
2915.3 645258636 644484940 643305588 641898270 640602798 639158440 637697258 637111549 637087097 637182884
2924 637182884 637406044 637941666 638011398 637463379 637707367 638047180 637850685 637163162 636304207 636439323
2933.6 636439323 637585106 638781013 639319191 639808884 640485687 640923538 641022186 640961227 641420517 642122955
2943.3F42122955L18909K48413N17807L66669q2474k33078M6463p8049p46765k48871
2952.9F42231979m6692o87713l19748l00598l93143K43912M04739L6545K8534L23105
2962.6F41520920L34778N00030L07770m3793P76139J434478R47037R84268J529389
2971.2F48291016P74002J30462P00379P52487O17065J067658J264572O79245O44455
2979.9F54921341J242447Q72421Q11844R66949L09067M1428M83398Q79822O22025N76706
2989.6F61727448O08673Q47320R27124N0049K44904N19332M60053M79050k93274l85285
2999.2F65185394R1095M84925K73208j76086p3853m7226j95846j47248J07041j49765
3008.8F65351639j90659o7901j39847j0300J09100K0600n28793j96076j59683n62058
$$ plain form
2943.3 642122955 642441864 642690277 643208084 643574753 643492279 643259201 643305664 643227615 642480850 642231979
2952.9 642231979 642185287 641497574 641177826 640877228 640484085 640727997 641132736 641169281 641197815 641520920
2962.6 641520920 641855698 642355728 642663498 642619705 643395844 644830322 645777359 646761627 648291016
2971.2 648291016 649065018 649195480 649895859 650648346 651265411 652333069 653597641 654276886 654921341
2979.9 654921341 656163788 657036209 657848053 658815002 659124069 659165497 659648895 660528717 661150742 661727448
2989.6 661727448 662336121 663183441 664110565 664160614 664405518 664924850 665384903 665863953 665570679 665185394
2999.2 665185394 665276489 665761414 666034622 665858536 665784683 665737457 665541611 665394363 665501404 665351639
3008.8 665351639 665160980 665093079 664953232 664942932 665052032 665072632 664543839 664347763 664188080 663626022
3018.5F63626022l51257o15921l36456o1035j87378l07160m36096q93784q49533K57645
3028.1F59845047k94800r06219o55136l06321L02124j30462p02744j018295k37656
3036.8F55895538K98004m17022m86679o81916j046371q83942l60946m15497p43866
3045.5F51157303m64859j12991j27259n10330p64542j038742l25393K20642q12378
3054.2F47221451j243820q14820j99508O7825k49634o74591p62100o78330l17230k63061
3063.8F42086182q53043o88400j059036p64466O32515L36266o23017r31167n56298
3072.5F37579536o18782m92630n3939l74642o44035o57120k78282j12381L4676k05269
3082.1F34177132m33426k09770o00434o91376j071434j017532m07066r7161J7548n04379
$$ plain form
3018.5 663626022 663274765 662658844 662322388 662261353 662073975 661766815 661330719 660436935 659587402 659845047
3028.1 659845047 659550247 658644028 657988892 657682571 657984695 657854233 657151489 656133194 655895538
3036.8 655895538 656193542 655776520 655289841 654607925 653561554 652677612 652316666 651901169 651157303
3045.5 651157303 650692444 650579453 650452194 649941864 649177322 648138580 647813187 648033829 647221451
3054.2 647221451 645977631 645162811 644963303 645031128 644781494 644106903 643344803 642666473 642349243 642086182
3063.8 642086182 641233139 640544739 639485703 638721237 639353752 639690018 639067001 638135834 637579536
3072.5 637579536 636960754 636468124 636414185 636039543 635395508 634738388 634460106 634347725 634382401 634177132
3082.1 634177132 633743706 633533936 632933502 632242126 631170692 630153160 629746094 629648933 629666481 629162102
3091.8F29162102m73099n37109n32837n95818q24051m30412m22211j69906n74646j265374
3101.4F23336639q43467j94321J20773k16560o05354o87485r15756j055641k61689
3110.1F18677139l15742q85964o6490K77252n64575j272049n72090o40221j383705
3118.8F13253555r03167o35834n96352q68110l81051N913p99980j020279q16650o31752
3128.4F06606293p53441p14264p45087q63647q88329q48655n80292o01578K3346k97813
3138.1F00336533j186219r59549j025047j005478q19626p98874j044197q23898k32201
3146.8E92441444K0295l88871j293792j063309q10776j016388j223717j315917r19686
3155.4E84429283m03442j55144n06783l62358p92465j269951r55658j125221j069336
$$ plain form
3091.8 629162102 628689003 628151894 627619057 627023239 626199188 625768776 625346565 625176659 624602013 623336639
3101.4 623336639 622493172 622298851 622419624 622203064 621597710 620910225 619994469 618938828 618677139
3110.1 618677139 618361397 617475433 617408943 617686195 617121620 615849571 615277481 614637260 613253555
3118.8 613253555 612350388 611714554 611118202 610250092 609869041 609874954 609074974 608054695 607238045 606606293
3128.4 606606293 605852852 605138588 604393501 603529854 602641525 601792870 601212578 600611000 600634346 600336533
3138.1 600336533 599150314 598190765 597165718 596160240 595340614 594541740 593497543 592673645 592441444
3146.8 592441444 592461739 592072868 590779076 589715767 588904991 587888603 586664886 585348969 584429283
3155.4 584429283 584025841 583870697 583363914 583001556 582209091 580939140 579983482 578858261 577788925
3164.1E77788925j223717j070480q71735o05506j56823o66084r02100o60896p10106
3172.8E70921478j335296j178589p18460o71234o35605j000214m24995l61252o67648
3181.5E63928185p18117r74617q08831j322822j337357r12399q76198q14934o20193
3190.1E55542717n23720p75986q37554r44176m09165p04650j437073r94530j009102
3198.8E47906761p12967j10054k32506j018219j170158p14798o24924p60460j032867
3207.5E41529808p13539r07669j053848q65555o25229k02980r01833o77299j98746
3216.2E35383110p27386j011467j000710j091728j173783n02243n95359r82895l27759
3224.9E27969780K65503k72751j051445q95271p30095p16477j098213o87828k68783
$$ plain form
3164.1 577788925 576565208 575494728 574622993 574017487 573860664 573194580 572292480 571631584 570921478
3172.8 570921478 569586182 568407593 567689133 567017899 566382294 565382080 564957085 564595833 563928185
3181.5 563928185 563210068 562235451 561426620 560103798 558766441 557854042 556977844 556162910 555542717
3190.1 555542717 555018997 554243011 553405457 552461281 552052116 551347466 549910393 548915863 547906761
3198.8 547906761 547193794 547083740 546851234 545833015 544662857 543948059 543323135 542562675 541529808
3207.5 541529808 540816269 539908600 538854752 537989197 537363968 537160988 536259155 535581856 535383110
3216.2 535383110 534655724 533644257 532643547 531551819 530378036 529875793 529280434 528297539 527969780
3224.9 527969780 528235283 527962532 526911087 526015816 525285721 524569244 523471031 522783203 522514420
3233.5E22514420o71616m75159r89189j128921o94123n34591o37207q37708p06787
3242.2E15839119q88481p21741r07135n03731J38588l44124o68754q20694o47011r43260
3251.9E09532776j048088q86002q64486n01557m38270l11699n41268m83055n98640
3260.5E03859711n93300l69568j012077j012383p02743l54729n87845m03938K37694
3269.2D99060822k51236k92778m35105q82034j326256r24301l86696o86226n16395
3277.9D93359795q31681o11038Q4915P8163m22172p76405n73578j002846q70705l42140
3287.5D88092308n22079p28226q3466L37067m06036l83912l58734n59807o13670r65690
3297.2D83807755p21703k13471k64434k94113k3690o62231n62668J24817m41590q52775
$$ plain form
3233.5 522514420 521842804 521367645 520378456 519249535 518555412 518020821 517383614 516545906 515839119
3242.2 515839119 514950638 514228897 513321762 512818031 512956619 512612495 511943741 511123047 510476036 509532776
3251.9 509532776 508484688 507598686 506734200 506232643 505794373 505482674 504941406 504458351 503859711
3260.5 503859711 503266411 502896843 501884766 500872383 500169640 499814911 499227066 498823128 499060822
3269.2 499060822 498809586 498516808 498081703 497199669 495873413 494949112 494562416 493876190 493359795
3277.9 493359795 492528114 491917076 492001991 492080154 491657982 490881577 490307999 489305153 488434448 488092308
3287.5 488092308 487570229 486842003 486758537 487095604 486689568 486305656 485946922 485387115 484773445 483807755
3297.2 483807755 483086052 482872581 482608147 482314034 482290344 481628113 481065445 481190262 480748672 479895897
3306.8D79895897r31130j336402j426659l68385j08681j60599P0458p11480n49697
3315.5D74373322n69611j025353q27522m62761n81398r20028l54577m99458m20456
3324.2D68712158m11949q02002l57971q36029j223221j019936p10067n50232n95017
3332.9D62205734o30913n46760r4948n52597q55713r33189j076470n72471n19715r35058
3342.5D55487900r10149k29606l26233m06495l32832r00116j034050j012306q41064
3351.2D49495049j302681j393662m85077l06206m84085p42035o06231j60141m75884
3359.9D43539047j274948j143875o89888p66144p84035r52301p74192j30005J91574
3368.6D37215233o84204q93975l35388j137542j305619q71277n88379o86378q73642
$$ plain form
3306.8 479895897 478964767 477628365 476201706 475833321 475724640 475564041 475634499 474923019 474373322
3315.5 474373322 473803711 472778358 471950836 471488075 470906677 469986649 469632072 469132614 468712158
3324.2 468712158 468300209 467498207 467140236 466304207 465080986 464061050 463350983 462800751 462205734
3332.9 462205734 461574821 461028061 460933113 460380516 459524803 458591614 457515144 456942673 456422958 455487900
3342.5 455487900 454577751 454348145 454021912 453615417 453282585 452382469 451348419 450336113 449495049
3351.2 449495049 448192368 446798706 446313629 446007423 445523338 444781303 444175072 444014931 443539047
3359.9 443539047 442264099 441120224 440430336 439664192 438880157 437927856 437153664 437023659 437215233
3368.6 437215233 436531029 435637054 435301666 434164124 432858505 431987228 431398849 430712471 429838829
3377.2D29838829l46832m52309m29497m59022p47070q09136n94253j03341m58183n63164
3386.9D24876022k28309r7122j68610m74968q67462r44977k45857m7760k93274n77126
3396.5D20930557o01768j77765p5150m87442p49740p9041J6403k17323j42097o08902
3406.2D17807732p20063k80838j95884q53272n67627N42374K78396k50701k38800n55954
3415.8D14965363m57955j5678k21443m61426m20647j48277P5645N76248P24488q3466
3425.5D14532852j39847K5025J71203j35498n65872o6185p2098K65122L33710J53808
3435.1D14502220L82843K06566L36418j01852k8343P97042L27378m68827k52914N7564
3444.7D15758095J002044J140824o82564L02010R42230J17302M5395k26097N33523
$$ plain form
3377.2 429838829 429491997 429039688 428610191 428151169 427404099 426594963 426000710 425897369 425439186 424876022
3386.9 424876022 424647713 424550591 424381981 423907013 423039551 422094574 421848717 421800957 421507683 420930557
3396.5 420930557 420328789 420151024 420075874 419588432 418838692 418759651 418776054 418558731 418416634 417807732
3406.2 417807732 417087669 416806831 416610947 415757675 415190048 415732422 416010818 415760117 415521317 414965363
3415.8 414965363 414507408 414491730 414270287 413808861 413388214 413239937 413315582 413891830 414616318 414532852
3425.5 414532852 414393005 414418030 414589233 414453735 413887863 413821678 413749580 414014702 414348412 414502220
3435.1 414502220 414885063 415091629 415428047 415326195 415297852 416094894 416422272 415953445 415700531 415758095
3444.7 415758095 416760139 417900963 417218399 417520409 418462639 418579941 418625336 418399239 418932762
3453.4D18932762P15256P79343M82139j55411O95877J111260R78012j54495k36130
3462.1D23148613M30374J83449J090317J179046O25344Q56094Q78792O67457O75812
3470.8D29735298K25144R536P60041M56123L34587J282234Q03681m42391N47791J416397
3480.4D35128441O41632P03201N04227R83963R67026L05175P16286K93503L63235J070137
3490.1D41676826J100159O11305J033745J093750J06316N76935O69136O76536P52831
3498.7D48297539N36995R90143J111221Q98552N37987O16683M42772M83551P91626
3507.4D54707069J086655L70483j17454K006645J674996R73167J296005N43480Q15735
3516.1D63356781O82259L02124K05726M07372Q04901J291542J354103N08118J429901
$$ plain form
3453.4 418932762 419648018 420427361 420909500 420754089 421449966 422561226 423539238 423384743 423148613
3462.1 423148613 423578987 423762436 424852753 426031799 426657143 427513237 428392029 429059486 429735298
3470.8 429735298 429960442 429969978 430730019 431186142 431520729 432802963 433606644 433164253 433712044 435128441
3480.4 435128441 435770073 436473274 436977501 437961464 438928490 439233665 439949951 440243454 440606689 441676826
3490.1 441676826 442776985 443388290 444422035 445515785 445622101 446199036 446868172 447544708 448297539
3498.7 448297539 448834534 449824677 450935898 451834450 452372437 452989120 453431892 453915443 454707069
3507.4 454707069 455793724 456164207 456046753 458053398 459728394 460701561 461997566 462541046 463356781
3516.1 463356781 464039040 464341164 464546890 464954262 465759163 467050705 468404808 468912926 470342827
3524.8D70342827J511307J18827m6463J039162R37691Q57658J620560J073303Q76999
3533.5D78331871J079063J841164J481171L99360R22127P19452R46732Q69445J289139
3542.1D87879524P58705J564R65729J103516J506805J39389J850624K641831J168251
3550.8D98015938O80885j444168J229363J932640J835746K178536Q35762K149467J146965
3559.5E08561134O00701O99653J357651J213532L44505K693939o47316j96342J248703
3568.2E15876160J431236M204483J791458J507187J486740J415711J418800J023064
3575.9E30154839J567344O90575K626304J504937R17206K386283J602784J214065O29196
3584.6E43293533L396645L55110j798286L106956K56653L417053L762016K638283R39904
$$ plain form
3524.8 470342827 471854134 471972961 471926498 472965660 473903351 474761009 476381569 477454872 478331871
3533.5 478331871 479410934 481252098 482733269 483132629 484054756 484774208 485720940 486590385 487879524
3542.1 487879524 488638229 488639793 489605522 490709038 492215843 492355232 494205856 496847687 498015938
3550.8 498015938 498696823 497252655 498482018 500414658 502250404 504428940 505264702 507414169 508561134
3559.5 508561134 509161835 509861488 511219139 512432671 512777176 515471115 514823799 514627457 515876160
3568.2 515876160 517307396 521511879 523303337 524810524 526297264 527712975 529131775 530154839
3575.9 530154839 531722183 532412758 535039062 536543999 537461205 539847488 541450272 542664337 543293533
3584.6 543293533 546690178 547045288 545247002 548353958 548610611 552027664 555789680 558427963 559367867
3593.2E59367867N58395L214035j074524J782303L399048J031761K589531P34215J290245
3601.9E72892876K627754K531967K050858K002983J456070q52967L703766o27556j71852
3610.6E85613899P299309Q17184j087722M113350L23562L933907K987175j326256J341362
3619.3F04015770j49117K409668M245873L176002L503418L332978K371521K549438
3627F25455551M673424l884163r802284O418495O889420O024742J529121r36928L522911
3635.7F39890289L665009K009430P13196K180023L096084K137452K77557N91965K845382
3644.4F57406387L511353M995193k044220l278579M766006j693115k399140K181168
3652.1F63445053P077179M390106L301697M343262p145386K775345N743561J694793
$$ plain form
3593.2 559367867 559926262 563140297 562065773 563848076 567247124 568278885 570868416 571602631 572892876
3601.9 572892876 575520630 578052597 580103455 582106438 583562508 582709541 586413307 585785751 585613899
3610.6 585613899 592913208 593730392 592642670 596756020 597079582 601013489 604000664 602674408 604015770
3619.3 604015770 603866653 606276321 610522194 613698196 617201614 620534592 622906113 625455551
3627 625455551 630128975 626244812 616442528 622861023 629750443 635775185 637304306 636367378 639890289
3635.7 639890289 643555298 645564728 646277924 648457947 651554031 653691483 653969040 654561005 657406387
3644.4 657406387 660917740 665912933 663868713 660590134 665356140 663663025 661263885 663445053
3652.1 663445053 670522232 674912338 678214035 682557297 675411911 678187256 683930817 685625610
3659.8F85625610K500840J006469J587677N14298Q13751J467361R47114M598617J650086
3668.5G00711823k747956j099319m876099M314499P944183O219788l319702j7293244
3676.2F89853973M988785R577027M571838j943665J019211L305588J568146R48333
3683.9G13889236N91813K95944K811127M159545r474487l059235Q052369l962098K08664
3692.6G13512878N155793Q57086R47723j116409n64041J428451O19736K451096J691589
3701.3G24983902m476776o24771N049133J437225k38723L00140K129745L142701q292618
3709.9G23409958L157577M081192j1713333O442185N960464L93143j08032J441574
3717.7G33064728K50931m048691J347351M868011m202575k877045N779266N98374j462250
$$ plain form
3659.8 685625610 688126450 689132919 690720596 691234894 692048645 693516006 694463120 699061737 700711823
3668.5 700711823 697963867 696864548 691988449 696302948 704247131 710466919 707147217 689853973
3676.2 689853973 694842758 704419785 708991623 707047958 708067169 711372757 712940903 713889236
3683.9 713889236 714481049 714776993 717588120 721747665 712273178 709213943 717266312 713304214 713512878
3692.6 713512878 718668671 719525757 720473480 719357071 718793030 720221481 720841217 723292313 724983902
3701.3 724983902 720507126 719882355 724931488 726368713 726129990 726430130 728559875 731702576 723409958
3709.9 723409958 726567535 730648727 718935394 725377579 731338043 731731186 731623154 733064728
3717.7 733064728 733315659 729266968 730614319 735482330 731279755 728402710 734181976 734780350 733318100
3726.3G33318100j486435P56073K709732K05536M694595m455795p078857Q197479n02777
3735G36357651p668381M90494K811966J253204K726669K183991m257050L375016R847717
3743.7G47121277j5137634j2669449J2593460O712112N167313n455094j2299881Q768006
3751.4G34800110o238480l102264Q228836N936890L575286n175094K442245M452286
3759.1G44919815p841873k29721M826202J448212m10614K289200l714981l755799M361420
3767.8G41891861M341965r98917q843307K698440L809815J86157J366806M7531M61044
3776.5G44961395r5520J586457j103516o387711L242493K268906Q39386J383819l889847
3785.2G42805862j026001J796418Q49685Q06733M47921J41754k51846O35376j16501
$$ plain form
3726.3 733318100 731831665 732587738 735297470 735503006 740197601 735741806 728662949 736860428 736357651
3735 736357651 728689270 729179764 731991730 733244934 735971603 738155594 733898544 737273560 747121277
3743.7 747121277 731983643 719314194 731907654 738619766 743787079 738331985 726032104 734800110
3751.4 734800110 728561630 725459366 733688202 739625092 743200378 738025284 740467529 744919815
3759.1 744919815 737077942 736848221 741674423 743122635 742712021 745001221 741286240 737530441 741891861
3767.8 741891861 746233826 745234909 736391602 739090042 742899857 743086014 744452820 744500351 744961395
3776.5 744961395 744865875 746452332 745348816 738961105 742203598 744472504 745311890 746695709 742805862
3785.2 742805862 741779861 743576279 744425964 745232697 745680618 745822372 745570526 746205902 746089401
3793.8G46089401N48935J903076n122909l971634K742615L597641L421020r116592
3801.5G40091553p928391O366196M033813M089280L294372j0387039j840744N761871
3809.3G43480911J917420K07748K31476j92871J262054M547577m877624j2437363O847992
3817.9G40987320N275879L164520j468811j6651840M447479O306229K929611K688675
3825.7G47679062o26907m183197M82788K879104K981339o11801q080903L214112N436401
3834.3G49169998o899109P12052Q769684q526383o229858O224136m047012J245193
3842.1G40418701O111069l223572k370605L776931J921692p1945R84573j469955J710663
3850.7G47787552L053436r405975J599273j3593673L752594J1170501j18560K32773
$$ plain form
3793.8 746089401 746638336 748541412 743418503 739446869 742189484 745787125 749208145 740091553
3801.5 740091553 732163162 738529358 742563171 746652451 749946823 739559784 737719040 743480911
3809.3 743480911 745398331 745606079 745837555 745644684 746906738 751454315 746576691 734139328 740987320
3817.9 740987320 746263199 749427719 747958908 731307068 735754547 742060776 744990387 747679062
3825.7 747679062 747052155 742868958 743351746 746230850 749212189 748600388 740519485 743733597 749169998
3834.3 749169998 742270889 742982941 751752625 743226242 736996384 743220520 739173508 740418701
3842.1 740418701 746529770 743306198 740935593 744712524 746634216 746562271 747546844 746076889 747787552
3850.7 747787552 750840988 741435013 743034286 729440613 733193207 744363708 744245148 744477921
3858.4G44477921J909942R41086J143570n786896J161423N198059p702255k846451
3866.2G38496399N747909M661332L729629q851700q162994M938889O168670Q71201
3873.9G47599335r001389L332901M519348m38232J758118L026046o590957n684281
3881.6G38520889O665268J937790J011887J018219j3225632M699402M947204L2654
3889.3G45607681L965073j343613q007660K268219L956223q06732J028824L72238R76104
3898G48016357m23584r029312O178513J545410o014404M254226l368530m91791L029404
3906.7G43696289J558838J132889q62274O77185N40466J41220L2425n98450O15921
3915.3G46934509Q32215l564225k083053M143371n81894k689132K704544J260071j43662
$$ plain form
3858.4 744477921 746387863 747328949 748472519 742685623 743847046 749045105 741342850 738496399
3866.2 738496399 744244308 748905640 752635269 743783569 735620575 740559464 746728134 747599335
3873.9 747599335 738597946 741930847 746450195 746011963 747770081 750796127 744205170 738520889
3881.6 738520889 745186157 747123947 748135834 749154053 735928421 740627823 745575027 745607681
3889.3 745607681 749572754 748229141 740221481 742489700 746445923 745639191 746668015 747040253 748016357
3898 748016357 747592773 738563461 744741974 746287384 740272980 744527206 741158676 740666885 743696289
3906.7 743696289 745255127 746388016 745525742 746202927 746743393 746884613 746917038 746318588 746934509
3915.3 746934509 747766724 744202499 742119446 746262817 745680923 742991791 745696335 746956406 746812744
3924G46812744l035126k129364K909470J658478K31933o92367n89295N46112k529754
3932.7G43182831j233444K009735J511993P38831j71891j94397k4414p32879J010895
3941.4G46097260K68402m051361O4849K364655R82437K23694k091217K71530L00140
3950.1G44430389j380691J436539K12631l13568Q86230L70712m1275n59921l17840
3958.7G44723206l20740P60879L94593j245652K54593O55289J30157Q70057K40173
3967.4G46462555j042862k16293R26742N76019o97326r01947O3782o8818m46624l62397
3977.1G44292831M39530J42822m37546L56827N57022L90549m32892n31540K4643L70712
3986.7G45172958J32218l36533Q07343l0365j096421p0877L99628L39203k15759L28598
$$ plain form
3924 746812744 743777618 741648254 744557724 746216202 746448135 745755768 745166473 745712585 743182831
3932.7 743182831 741949387 743959122 745471115 746209946 746038055 745843658 745819244 745086365 746097260
3941.4 746097260 746365662 742314301 742379150 744743805 745726242 745949936 743858719 744130249 744430389
3950.1 744430389 743049698 744486237 744698868 744385300 745271530 745642242 745600967 745041046 744723206
3958.7 744723206 744402466 745163345 745557938 744312286 744566879 745222168 745352325 746222382 746462555
3967.4 746462555 745419693 745203400 746130142 746706161 746008835 745106888 745170670 745101852 744655228 744292831
3977.1 744292831 744732361 744875183 744437637 744794464 745351486 745742035 745309143 744777603 744802246 745172958
3986.7 745172958 745305176 744968643 745775986 745745621 744649200 744578323 744977951 745317154 745101395 745429993
3996.3G45429993N20096p03202r03930J60827
4000.2G44503784
$$ plain form
3996.3 745429993 745950089 745246887 744342957 744503784
4000.2 744503784
##END=$$ End of the data block
