##TITLE=$$ Begin of the data block
##JCAMP-DX=5.00 $$ ACD/SpecManager v 10.08
##SPECTROMETER/DATA SYSTEM=Varian
##DATE=07 Jan 2013 17:14:10
##DATA TYPE=INFRARED SPECTRUM
##DATA CLASS=XYDATA
##ORIGIN=
##OWNER=
##NPOINTS=3735
##FIRSTX=399.26403809
##LASTX=4000.35498047
##MAXX=4000.35498047
##MINX=399.26403809
##MAXY=79.91458130
##MINY=18.52544785
##XFACTOR=1.0000000000
##YFACTOR=0.000000100000000
##FIRSTY=61.47746277
##DELTAX=0.96440572
##XUNITS=1/CM
##YUNITS=TRANSMITTANCE
##XYDATA=(X++(Y..Y))
$$ plain form
399.3 614774628 622194557 608243408 600719223 603470039 612541847 622838860 621767082 623442764
407 623442764 632074471 630719299 620970535 612321548 608488579 610264778 615470047 617122383 616474609
415.7 616474609 620881042 623467407 625337181 615323486 603602982 606324081 603738823 599912262
423.4 599912262 603065300 607391586 613361473 614936104 618491287 626741600 624247322 613090019
431.1 613090019 609401512 608353996 607337189 610344009 611753731 612822304 617173195 618814812
438.8 618814812 614112968 607935143 604385986 604473038 600349350 601305122 610128212 610082359 607574654
447.5 607574654 608739967 611681366 612551994 607261810 604460411 599088211 593785667 592373466 596870270
456.2 596870270 606256065 608675537 611116219 611448250 608598099 606301270 602271423 598692055 593265114
$$ packed form
399.3F14774628P419929j3951149p524185K750816R071808J0297013j071778J675682
407F23442764Q631707j355172r748764q648987l832969J776199N205269J652336o47774
415.7F16474609M406433K586365J869774j0013695j1720504K721099k585258l826561
423.4E99912262L153038M326286N969887J574631L555183Q250313k494278j1157303
431.1F13090019l688507j047516j016807L006820J409722J068573M350891J641617
438.8F18814812m701844o177825l549157Q7052m123688R55772Q823090m5853k507705
447.5F07574654J165313K941399Q70628n290184k801399n372200n302544j412201M496804
456.2E96870270R385795K419472K440682L32031k850151k296829m029847l579368n426941
$$ plain form
464.8 593265114 588330002 588267174 592359047 592704239 596845512 605286293 603009987 592907906 590970383
473.5 590970383 592342072 591471863 593343925 597470016 601482735 605772629 609695244 612087822 607632141
482.2 607632141 601358185 601215706 602847672 598281937 595031586 598970299 602384453 605864258 608082581
490.9 608082581 609973373 609019547 604972267 602897186 599241943 595816917 593416519 596936073 603223801
499.6 603223801 604793625 605723228 604676361 603345070 601906395 599711647 597462158 595121727 594020462
508.2 594020462 594989433 597761459 594804268 592337761 593194733 594079933 593103600 589303856 587748299
516.9 587748299 583267670 580290375 580265617 579031563 578894501 580173759 583096504 582321548 579709892
525.6 579709892 579123764 578533020 577203560 576886292 576757355 575816383 577546310 578073425 580034676
$$ packed form
464.8E93265114m935112o2828M091873L45192M141273Q440781k276306j0102081j937523
473.5E90970383J371689q70209J872062M126091M012719M289894L922615K392578m455681
482.2F07632141o273956j42479J631966m565735l250351L938713L414154L479805K218323
490.9F08082581J890792r53826m047280k075081l655243l425026k400398L519554O287728
499.6F03223801J569824R29603j046867j331291j438675k194748k249489k340431j101265
508.2E94020462R68971K772026k957191k466507Q56972Q85200r76333l799744j555557
516.9E87748299m480629k977295k4758j234054j37062J279258K922745p74956k611656
525.6E79709892n86128n90744j329460l17268j28937r40972J729927N27115J961251
$$ plain form
534.3 580034676 582398453 580413017 579216919 577421913 574555817 572985077 574148750 575538979
542 575538979 576705666 579283524 581898460 585294037 586899757 586253090 583110085 579388962 577473221
550.7 577473221 576752014 579410477 581002846 581004028 582682304 585666962 588332253 587969627 584972267
559.4 584972267 581630898 580707932 579607811 579025879 581242256 583764496 585233841 584949570 584747391
568 584747391 585237083 585066071 583283043 581179848 578616486 576078568 577250633 578740425 579305916
576.7 579305916 579563599 580502090 581541939 580289574 578933907 577284660 576727371 576313744 575087738
585.4 575087738 576315956 578779564 579730072 580165558 581972427 582183266 581446533 580016747 577883034
594.1 577883034 577267075 576606750 577403641 578144798 577488785 575996971 574129524 573383942 570037994
$$ packed form
534.3E80034676K363777j985436j196098j795006k866096j570740J163673J390229
542E75538979J166687K577858K614936L395577J605720o46667l143005l721123j915741
550.7E77473221p21207K658463J592369J182J678276K984658K665291l62626k997360
559.4E84972267l341369r22966j100121n81932K216377K522240J469345k84271k02179
568E84747391M89692j71012j783028k103195k563362k537918J172065J489792N65491
576.7E79305916K57683R38491J039849j252365j355667j649247n57289m13627j226006
585.4E75087738J228218K463608R50508M35486J806869K10839p36733j429786k133713
594.1E77883034o15959o60325P96891P41157o56013j491814j867447p45582l345948
$$ plain form
602.8 570037994 564396591 560394402 557831078 552641182 546326485 539798279 530384369 519668121
610.5 519668121 506360245 493785439 481934814 472270203 467373848 464792862 465956726 467926292
618.2 467926292 466873322 462000732 455292473 443982544 430874786 423091316 421868210 429845428
625.9 429845428 442920227 460141144 476856384 491970901 504111328 511019630 513825874 511501999
633.6 511501999 507398071 499549828 490839310 483024750 476337204 474852676 476275826 485501747
641.3 485501747 500747681 519652939 539218826 555917435 569563751 579354820 586497879 591642685
649 591642685 594385567 595818634 597420998 600748978 604903412 607982216 609405632 610123863 610937996
657.7 610937996 611820488 612425690 611772346 611306000 611572189 612945747 615485878 617969551 621082687
$$ packed form
602.8E70037994n641403m002189k563324n189896o314697o528206r413910j0716248
610.5E19668121j3307876j2574806j1850625r664611m896355k580986J163864J969566
618.2D67926292j052970m872590o708259j1309929j3107758p783470j223106P977218
625.9D29845428J3074799J7220917J6715240J5114517J2140427O908302K806244k323875
633.6E11501999m103928p848243q710518p814560o687546j484528J423150R225921
641.3D85501747J5245934J8905258J9565887J6698609J3646316R791069P143059N144806
649E91642685K742882J433067J602364L327980M154434L078804J423416P18231Q14133
657.7F10937996Q82492O05202o53344m66346K66189J373558K540131K483673L113136
$$ plain form
666.4 621082687 621222992 611608315 616779938 619854240 620689316 621236801 620280075 619574585 620976448
675.1 620976448 623444290 626374969 629345627 629718246 628612862 627878380 627381172 627498169 626613350
683.8 626613350 626047707 626886673 627335968 627846947 628464508 628663712 627086754 623669472 621125755
692.4 621125755 618863068 615761566 613642426 613276978 614594269 616950798 618152199 617462616 615852089
701.1 615852089 613723831 611993141 611286125 611095200 610841904 611382256 613849182 617193222 620974960
709.8 620974960 623651543 624943542 626524925 626837959 626633224 627363319 627720451 629005585 631628151
718.5 631628151 634487114 637867508 640769501 642947083 644391403 643959274 641947403 639520798 637529602
727.2 637529602 637072487 637561493 637996941 639490814 641584702 642210922 641055374 639503403 637491989
$$ packed form
666.4F21082687J40305r614677N171623L074302Q35076N47485r56726p05490J401863
675.1F20976448K467842K930679K970658L72619j105384p34482m97208J16997q84819
683.8F26613350n65643Q38966M49295N10979O17561J99204j576958l417282k543717
692.4F21125755k262687l101502k119140l65448J317291K356529J201401o89583j610527
701.1F15852089k128258j730690p07016j90925k53296N40352K466926L344040L781738
709.8F20974960K676583J291999J581383L13034k04735P30095L57132J285134K622566
718.5F31628151K858963L380394K901993K177582J444320m32129k011871k426605j991196
727.2F37529602m57115M89006M35448J493873K093888O26220j155548j551971k011414
$$ plain form
735.8 637491989 635104599 633598709 632449684 632202072 633317451 635120010 637659721 640601196 642567902
744.5 642567902 642717972 642546539 642821579 643414001 644246140 645894394 649223709 653424606 659305496
753.2 659305496 664868088 667763672 670461426 671512299 670293198 669624710 669199142 668478088 670121002
761.9 670121002 673332977 676063309 678847351 680899582 681465454 679421158 676509628 673342361 669634705
770.6 669634705 668319931 669040070 670219193 672398224 677161789 681901550 684734344 686674423 686137466
779.2 686137466 685392075 684440842 682984314 683578186 686238403 690233307 693928223 697559357 700739975
787.9 700739975 702139664 701783676 700088043 696694565 693634491 693174973 694026260 696557693 699389038
796.6 699389038 702327423 705075531 706099243 705843658 702553406 699199448 696948013 695084839 695074615
$$ packed form
735.8F37491989k387390j505890j149025k47612J115379J802559K539711K941475J966706
744.5F42567902J50070j71433K75040N92422Q32139J648254L329315M200897N880890
753.2F59305496N562592K895584K697754J050873j219101o68488m25568p21054J642914
761.9F70121002L211975K730332K784042K052231N65872k044296k911530l167267l707656
770.6F69634705j314774P20139J179123K179031M763565M739761K832794J940079n36957
779.2F86137466p45391r51233j456528N93872K660217L994904L694916L631134L180618
787.9G00739975J399689l55988j695633l393478l060074m59518Q51287K531433K831345
796.6F99389038K938385K748108J023712k55585l290252l353958k251435j863174j0224
$$ plain form
805.3 695074615 696171036 698680649 702603302 707163162 709257126 708111649 706187363 703394394
813 703394394 700083313 697835007 697202454 698343735 701365204 704939728 708747482 711185837 710631866
821.7 710631866 708402176 704832458 701073151 697528000 694913712 694125519 695502014 697124634 697023544
830.4 697023544 696706085 695354462 692158585 686438293 679413300 674029922 669751053 666271210 664320908
839 664320908 663390198 663018951 663207169 662732086 660923767 657885818 653406067 648302841 644352951
847.7 644352951 643644791 645763855 649789810 655325546 661004486 666048355 669295959 671162109 672077332
856.4 672077332 671064072 669948196 670462112 672485504 676677933 682553024 687395630 691814423 695007553
865.1 695007553 694562683 692453156 689827271 687614594 685507202 684834366 686686325 690306931 695389481
$$ packed form
805.3F95074615J096421K509613L922653M559860K093964j145477j924286k792969
813G03394394l311081k248306o32553J141281L021469L574524L807754K438355n53971
821.7G10631866k229690l569718l759307l545151k614288p88193J376495J622620j01090
830.4F97023544l17459j351623l195877n720292p024993n383378m278869l479843j950302
839F64320908r30710l71247J88218m75083j808319l037949m479751n103226l949890
847.7F44352951p08160K119064M025955N535736N678940N043869L247604J866150R15223
856.4F72077332j013260j115876N13916K023392M192429N875091M842606M418793L193130
865.1F95007553m44870k109527k625885k212677k107392o72836J851959L620606N082550
$$ plain form
873.8 695389481 699524994 702364197 703060455 701642914 698785019 694529572 690131607 685911255 684191666
882.4 684191666 685449982 687785721 689509048 690488205 690786743 688117523 684035645 679882584 674665070
891.1 674665070 670992126 671279068 673754349 676826706 680893707 685606995 688676758 689057846 687360840
899.8 687360840 682997284 678408737 675535889 673991928 674442444 675960159 678114929 679418869 679345398
908.5 679345398 677843475 673476257 667696152 661220856 655361633 651275177 648619080 647544556
916.2 647544556 647481689 648322754 649764938 649052734 644949722 639131660 632522087 626553650 622663078
924.9 622663078 620442657 619992523 621535034 623939209 626677895 627890472 627079201 625928802 623680458
933.6 623680458 620622826 619186668 620487366 623843384 629481697 636885796 643557587 649262848
$$ packed form
873.8F95389481M135513K839203O96258j417541k857895m255447m397965m220352j719589
882.4F84191666J258316K335739J723327R79157K98538k669220m081878m153061n217514
891.1F74665070l672944K86942K475281L072357M067001M713288L069763L81088j697006
899.8F87360840m363556m588547k872848j543961M50516J517715K154770J303940p3471
908.5F79345398j501923m367218n780105o475296n859223m086456k656097j074524
916.2F47544556o2867Q41065J442184p12204m103012n818062o609573n968437l890572
924.9F22663078k220421m50134J542511K404175K738686J212577q11271j150399k248344
933.6F23680458l057632j436158J300698L356018N638313P404099O671791N705261
$$ plain form
941.3 649262848 653810654 656438980 657275848 656422729 655620041 656203079 658522568 663276520 668764877
949.9 668764877 673501892 677192764 678854599 677819366 674870148 670920029 666063766 662325668
957.7 662325668 659531250 658022156 658940811 660086594 660325546 659633713 657270432 652584915 646606445
966.3 646606445 640572433 635317612 631874504 630583191 631247215 633036575 634974480 636488228 636069374
975 636069374 633264160 629695587 625898972 621986275 619160118 617984009 618368301 619387627 619814301
983.7 619814301 619691467 618970909 616140366 610768929 603816376 597198219 592066803 587398148 582909622
992.4 582909622 576853447 567063522 552458763 539076729 538382187 549113159 560831375 566327057
1000.1 566327057 566832886 565866241 566182098 568093948 569934540 571941681 573158913 573129272 570998154
$$ packed form
941.3F49262848M547806K628326Q36868q53119q02688N83038K319489M753952N488357
949.9F68764877M737015L690872J661835j035233k949218l950119m856263l738098
957.7F62325668k794418j509094R18655J145783K38952o91833k363281m685517n978470
966.3F46606445o034012n254821l443108j291313O64024J789360J937905J513748m18854
975F36069374k805214l568573l796615l912697k826157j176109L84292J019326M26674
983.7F19814301j22834p20558k830543n371437o952553o618157n131416m668655m488526
992.4E82909622o056175r789925j4604759j3382034o94542J0730972J1718216N495682
1000.1E66327057N05829r66645L15857J911850J840592K007141J217232k9641k131118
$$ plain form
1008.8 570998154 567095413 563220177 559129677 555325623 552409897 551027908 550893097 551354179 550948639
1017.5 550948639 550155067 548672981 544742889 539852219 534172783 529594116 525981712 523939476
1025.2 523939476 523941536 523497429 524291306 524021606 522645340 519691429 515069008 511390228 507397308
1033.8 507397308 504589119 502378082 501558189 502173920 502840919 503834991 504436493 503739471 501268768
1042.5 501268768 498748512 495818481 494361458 494179192 494578667 496513672 499363518 503374825 505373383
1051.2 505373383 505767860 504478035 502425575 500861282 500860367 501985817 500789795 502215767 504430351
1059.9 504430351 506125679 507244644 506315536 505978394 503344040 500427628 497721443 495459709 494358253
1068.6 494358253 494537621 496272812 496660652 497648315 497490997 496612473 494210434 490837021 487872200
$$ packed form
1008.8E70998154l902741l875236m090500l804054k915726j381989j34811M61082m05540
1017.5E50948639p93572j482086l930092m890670n679436m578667l612404k042236
1025.2E23939476K060m44107P93877k69700j376266k953911m622421l678780l992920
1033.8E07397308k808189k211037q19893O15731O66999R94072O01502o97022k470703
1042.5E01268768k520256k930031j457023j82266L99475J935005K849846M011307J998558
1051.2E05373383L94477j289825k052460j564293r15J125450j196022J425972K214584
1059.9E04430351J695328J118965r29108l37142k634354k916412k706185k261734j101456
1068.6D94358253J79368J735191L87840R87663j57318q78524k402039l373413k964821
$$ plain form
1077.2 487872200 484454155 484241371 483804436 484934196 486897812 487907448 488842545 487574768 485266914
1085.9 485266914 480559692 476381302 471713753 467723045 464800110 461045036 458464088 452719917
1093.6 452719917 446454887 437709503 426840782 415657845 402854881 391690216 380194473 370634346
1101.4 370634346 359876595 349799919 340307693 330361176 320742950 308651466 298715935 286899281
1109.1 286899281 276930332 267883015 259760456 253732300 247698231 245053158 240518169 239593391
1116.8 239593391 238837128 239065113 239717560 238924904 241605244 242313499 245336437 247045536 250020027
1125.5 250020027 252758579 253442497 255662365 255291157 256522923 254819298 253055515 249862518 245804977
1134.1 245804977 243537502 238998604 236695061 232890949 230627079 227055664 223823757 220285645
$$ packed form
1077.2D87872200l418045k12784m36935J129760J963616J009636R35097j267777k307854
1085.9D85266914m707222m178390m667549l990708k922935l755074k580948n744171
1093.6D52719917o265030q745384j0868721j1182937j2802964j1164665j1495743r560127
1101.4C70634346j0757751j0076676r492226r946517r618226j2091484r935531j1816654
1109.1B86899281r968949r047317q122559o028156o034069k645073m534989r24778
1116.8B39593391p56263K27985O52447p92656K680340P08255L022938J709099K974491
1125.5B50020027K738552O83918K219868l71208J231766j703625j763783l192997m057541
1134.1B45804977k267475m538898k303543l804112k263870l571415l231907l538112
$$ plain form
1141.9 220285645 214262276 211717548 206549053 202680130 197171497 193351269 190903912 187831554
1149.6 187831554 187848148 185254478 185976467 185406914 186103039 186902390 187506618 190704174 191455231
1158.3 191455231 195065174 196963863 200845795 204161472 207650719 212563477 215280647 221088753
1166 221088753 224720097 230812378 236896305 243326359 251122723 258501492 267961311 275504570 285006485
1174.6 285006485 292971592 302110806 311099529 318472481 327682457 336217804 346427193 354531136
1182.4 354531136 364431343 374234390 382028809 389598808 395092278 401582794 406179886 411335640
1190.1 411335640 416493912 421979218 428446579 434326553 441224709 446852875 453313065 458533592
1197.8 458533592 463262291 468102455 472120018 476963882 481127357 486867371 493004494 499283829
$$ packed form
1141.9B20285645o023369k544728n168495l868923n508633l820228k447357l072358
1149.6A87831554J6594k593670P21989n69553O96125P99351O04228L197556P51057
1158.3A91455231L609943J898689L881932L315677L489247M912758K717170N808106
1166B21088753L631344O092281O083927O430054P796364P378769R459819P543259R501915
1174.6B85006485P965107R139214Q988723P372952R209976Q535347J0209389Q103943
1182.4C54531136R900207R803047P794419P569999N493470O490516M597092N155754
1190.1D11335640N158272N485306O467361N879974O898156N628166O460190N220527
1197.8D58533592M728699M840164M017563M843864M163475N740014O137123O279335
$$ plain form
1205.5 499283829 504748688 509109421 513022385 515373306 517530670 518134537 519373589 521845284
1213.2 521845284 524872932 528976021 532919617 536456642 538491478 539981918 540307236 539795303 538486557
1221.9 538486557 536811295 536565666 536960335 539215240 541882286 544588127 546498108 546973457 546922226
1230.6 546922226 545865479 544780998 543147125 543007889 543996086 545433350 548095741 550790100 553686256
1239.3 553686256 555020485 555108185 554196167 552965393 551771812 550711288 550938110 551613274 553952408
1247.9 553952408 556504898 558683128 560024300 560394592 560351639 558716583 557191200 555784607 555762558
1256.6 555762558 556682510 558309975 561216354 563696747 566259041 567080383 566948013 566271210 564917603
1265.3 564917603 563805084 563308449 564724693 566502876 569580650 573103790 576280289 578871803
$$ packed form
1205.5D99283829N464859M360733L912964K350921K157364O03867J239052K471695
1213.2E21845284L027648M103089L943596L537025K034836J490440L25318n11933j308746
1221.9E38486557j675262k45629L94669K254905K667046K705841J909981M75349n1231
1230.6E46922226j056747j084481j633873j39236R88197J437264K662391K694359K896156
1239.3E53686256J334229Q7700r12018j230774j193581j060524K26822O75164K339134
1247.9E53952408K552490K178230J341172L70292m2953j635056j525383j406593k2049
1256.6E55762558R19952J627465K906379K480393K562294Q21342j32370o76803j353607
1265.3E64917603j112519m96635J416244J778183L077774L523140L176499K591514
$$ plain form
1273 578871803 580287437 581173744 580852127 580647774 580351677 581164055 583687134 587214203 591611061
1281.7 591611061 595108681 598394470 600565872 601672020 602168541 601765556 601820335 602837029 605034943
1290.4 605034943 607707748 611461563 615477180 618626480 621195107 622642097 622918510 622417526 621871147
1299 621871147 621605110 622337036 624355011 626926727 629813805 632515030 634425430 635070343 634862595
1307.7 634862595 633819809 632772636 632038040 631037827 631680412 633505707 635686684 638500786 640660019
1316.4 640660019 642004318 642081604 640959396 639604454 638608398 638515663 639205093 641007233 643485870
1325.1 643485870 646000519 648366852 649665604 650095367 649521561 647980499 646086197 644552231 644211655
1333.8 644211655 644932175 645974579 647141266 648404160 649534531 649539566 648272324 647836685 647440033
$$ packed form
1273E78871803J415634Q86307l21617k04353k96097Q12378K523079L527069M396858
1281.7E91611061L497620L285789K171402J106148M96521m02985N4779J016694K197914
1290.4F05034943K672805L753815M015617L149300K568627J446990K76413n00984n46379
1299F21871147k66037P31926K017975K571716K887078K701225J910400O44913k07748
1307.7F34862595j042786j047173p34596j000213O42585J825295K180977K814102K159233
1316.4F40660019J344299P7286j122208j354942r96056r2735O89430J802140K478637
1325.1F43485870K514649K366333J298752M29763n73806j541062j894302j533966l40576
1333.8F44211655P20520J042404J166687J262894J130371N035j267242m35639l96652
$$ plain form
1342.4 647440033 646093445 645528107 645589600 646013031 647612000 649474792 650589905 651050949 650807190
1351.1 650807190 649375458 647150421 644688187 643188477 642848129 643160400 644040222 645194321 646610184
1359.8 646610184 646679459 645583878 643685150 641091766 640977173 640191193 638716965 637676888 637058640
1368.5 637058640 637959404 638996544 639368668 638951683 637225418 633773766 631571198 630944595 630611763
1377.2 630611763 630367546 630617409 631500359 632138977 633119545 633831100 633299713 632367172 631693535 630745392
1386.8 630745392 628442154 628917122 630501785 631376152 632294502 633498955 634507599 632464981 629861488
1395.5 629861488 630242500 629454308 627753220 625188713 624881630 626096039 626430626 626653519 626551247
1404.2 626551247 625316887 625338593 625430031 623849144 622201347 621000786 620078735 619860458 620261078
$$ packed form
1342.4F47440033j346588n65338O1493M23431J598969J862792J115113M61044k43759
1351.1F50807190j431732k225037k462234j499710l40348L12271Q79822J154099J415863
1359.8F46610184O9275j095581j898728k593384j14593p85980j474228j040077o18248
1368.5F37058640R00764J037140L72124m16985j726265l451652k202568o26603l32832
1377.2F30611763k44217K49863Q82950O38618R80568P11555n31387r32541o73637r48143
1386.8F30745392k303238M74968J584663Q74367R18350J204453J008644k042618k603493
1395.5F29861488L81012p88192j701088k564507l07083J214409L34587K22893j02272
1404.2F26551247j234360K1706R1438j580887j647797j200561r22051k18277M00620
$$ plain form
1412.8 620261078 621085930 621759834 622010269 621124496 619718170 619007950 615473175 616422615 618349953
1421.5 618349953 618366585 618630829 619505119 621682129 623775253 624273834 624549332 623847008 622739143
1430.2 622739143 623670540 624495811 624176369 624764290 626695518 627117386 625651093 629075089 632877541
1438.9 632877541 634274139 634113655 633838120 633488617 633914833 634288216 635545845 636995926 637080460
1447.6 637080460 637148590 639331436 641031876 640384674 639479485 639537735 640104065 639430962 638166733
1456.2 638166733 636136398 635974045 642097244 646895065 650705185 652196426 651813965 652309189 649616318
1464.9 649616318 650179520 652763824 655154190 657308350 659147263 661084137 660421753 659093857 660825806
1473.6 660825806 665416031 668842468 669003448 671571503 674868851 676896362 678034973 679209976
$$ packed form
1412.8F20261078Q24852O73904K50435q85773j406326p10220l534775R49440J927338
1421.5F18349953J6632K64244Q74290K177010K093124M98581K75498p02324j107865
1430.2F22739143R31397Q25271l19442N87921J931228M21868j466293L423996L802452
1438.9F32877541J396598j60484k75535l49503M26216L73383J257629J450081Q4534
1447.6F37080460O8130K182846J700440o47202r05189N8250N66330o73103j264229
1456.2F38166733k030335j62353O123199M797821L810120J491241l82461M95224k692871
1464.9F49616318N63202K584304K390366K154160J838913J936874o62384j327896J731949
1473.6F60825806M590225L426437J60980K568055L297348K027511J138611J175003
$$ plain form
1481.3 679209976 681547928 683530807 684428711 684436569 684156189 682319260 680697403 681136322 678565140
1490 678565140 679315796 683031082 685106888 685264130 684984436 683745728 677160721 678680420 678423538
1498.7 678423538 675839005 677029190 676340485 675703735 675549164 675764389 673667526 660866928 651581345
1507.3 651581345 654607315 659022446 659722595 661367798 660123062 657975388 657970886 655461044 653862839
1516 653862839 649772339 647852173 651148224 652043152 645612640 639946289 643089294 646126556 647413101
1524.7 647413101 644370880 644601593 644699020 643112946 643835297 644138870 643072357 640962296 637967682
1533.4 637967682 634958954 637278023 638592873 638517838 638721428 630644417 623338890 626684952 628190346
1542.1 628190346 628242607 629993401 630642929 630558243 633727150 635139427 635384979 633131714 631952744
$$ packed form
1481.3F79209976K337952J982879Q97904P858k80380j836929j621857M38919k571182
1490F78565140P50656L715286K075806J57242k79694j238708o585007J519699k56882
1498.7F78423538k584533J190185o88705o36750j54571K15225k096863j2800598r285583
1507.3F51581345L025970M415131P00149J645203j244736k147674m502k509842j598205
1516F53862839m090500j920166L296051Q94928o430512n666351L143005L037262J286545
1524.7F47413101l042221K30713R7427j586074P22351L03573j066513k110061k994614
1533.4F37967682l008728K319069J314850p5035K03590q077011p305527L346062J505394
1542.1F28190346N2261J750794O49528q4686L168907J412277K45552k253265j178970
$$ plain form
1550.7 631952744 634896011 636209450 636917763 634937553 635972595 638617554 637975655 627083359
1558.5 627083359 621101074 633753738 639965706 644218216 646504059 646797180 645752335 647032089
1566.2 647032089 649184875 648814316 646834259 643357544 646725693 649128571 649286194 649506378 649526596
1574.9 649526596 648903198 640737228 642713089 644777374 644549255 644270477 642602844 641988144 640814667
1583.5 640814667 639919167 638583870 636763725 634904900 632255974 630681648 627715836 625802917
1591.2 625802917 623166275 620714340 618526001 615811119 614574509 612268906 610920982 607858353
1599 607858353 605418663 602456245 598831100 596889534 593813133 592611313 590327110 588362503 585535622
1607.6 585535622 583476257 581231232 577444420 576232452 572916756 570986443 567958374 566051826
$$ packed form
1550.7F31952744K943267J313439P08313j980210J035042K644959o41899j0892296
1558.5F27083359n982285J2652664O211968M252510K285843K93121j044845J279754
1566.2F47032089K152786l70559j980057l476715L368149K402878J57623K20184K0218
1574.9F49526596o23398q165970J975861K064285k28119k78778j667633o14700j173477
1583.5F40814667q95500j335297j820145j858825k648926j574326k965812j912919
1591.2F25802917k636642k451935k188339k714882j236610k305603j347924l062629
1599F07858353k439690k962418l625145j941566l076401j201820k284203j964607k826881
1607.6E85535622k059365k245025l786812j211968l315696j930313l028069j906548
$$ plain form
1615.4 566051826 563029861 554565468 557725754 557316666 556437492 553677406 551955185 548501930 544030304
1624 544030304 545871162 544824791 544330330 540400009 539376717 539339180 537993431 537003860 534469299
1632.7 534469299 534776306 533260422 526486549 524357910 526239204 527447281 527783737 529155769 528140831
1641.4 528140831 529037514 528193245 528787384 529214249 524871025 524374084 522759361 528064842 530699654
1650.1 530699654 533288689 534726295 526286964 526652908 530924225 536490898 538344078 540631485
1657.8 540631485 541872482 543149757 544971085 546721535 549277496 549809723 553954506 556187325
1665.5 556187325 558105354 559751701 559693451 560042114 561462936 565289345 567465591 572321968 576599388
1674.2 576599388 577452850 578289070 581794930 585645332 587040443 588475113 589415245 593752708 597638664
$$ packed form
1615.4E66051826l021965q464393L160286m09088q79174k760086j722221l453255m471626
1624E44030304J840858j046371m94461l930321j023292l7537j345749r89571k534561
1632.7E34469299L07007j515884o773873k128639J881294J208077L36456J372032j014938
1641.4E28140831Q96683q44269N94139M26865m343224m96941j614723N305481K634812
1650.1E30699654K589035J437606q439331L65944M271317N566673J853180K287407
1657.8E40631485J240997J277275J821328J750450K555961N32227M144783K232819
1665.5E56187325J918029J646347n8250L48663J420822L826409K176246M856377M277420
1674.2E76599388Q53462Q36220L505860L850402J395111J434670R40132M337463L885956
$$ plain form
1682.9 597638664 594108162 594836426 601089935 608431740 611722221 613830986 617150459 619692345
1690.6 619692345 623695297 626692200 630451660 634586601 637701950 635178528 640569839 647606354
1698.3 647606354 652578812 654093857 650390854 659060211 665106506 668063126 670791473 674031677
1706 674031677 677385864 682030411 686938705 688885880 690371780 692688599 694153824 695197449 693726883
1714.7 693726883 695292206 699209442 699273758 696778336 703551102 708989563 711122742 712073212 711913223
1723.4 711913223 712543869 714184036 715021362 716345596 718058319 719445877 717939453 718211365 721513062
1732 721513062 722560196 716985779 712279129 719089432 723528137 725060501 727544022 727408295 727079239
1740.7 727079239 731216202 733094101 731470947 732360153 735293503 736540375 736821060 736612244 738290329
$$ packed form
1682.9E97638664l530502P28264O253509P341805L290481K108765L319473K541886
1690.6F19692345M002952K996903L759460M134941L115349k523422N391311P036515
1698.3F47606354M972458J515045l703003Q669357O046295K956620K728347L240204
1706F74031677L354187M644547M908294J947175J485900K316819J465225J043625j470566
1714.7F93726883J565323L917236O4316k495422O772766N438461K133179R50470j59989
1723.4G11913223O30646J640167Q37326J324234J712723J387558j506424K71912L301697
1732G21513062J047134n574417m706650O810303M438705J532364K483521j35727l29056
1740.7G27079239M136963J877899j623154Q89206K933350J246872K80685k08816J678085
$$ plain form
1749.4 738290329 743197937 744212646 745661850 750546265 752962265 754268799 754852066 752827377
1757.1 752827377 754241486 756851654 759245529 761320953 758697128 759573593 763491287 764967575
1764.8 764967575 765534210 766327896 765868530 762533035 764270706 766664505 765049057 762889328 763958817
1773.5 763958817 768810120 770561676 769798279 771433868 771553268 771715622 770624161 769715424 772115631
1782.2 772115631 774543762 776222153 775595703 775660400 777250443 777527390 776927032 776517258 775274277
1790.9 775274277 774192734 771884918 773801346 778446426 779490204 779326859 780879669 781616287 779858093
1799.5 779858093 778051529 779285812 778636093 779371109 781739044 783027878 784231644 784373322 784183121
1808.2 784183121 784579391 784329834 782393036 782328339 783234558 783611908 784721680 785584869 786721878
$$ packed form
1749.4G38290329M907608J014709J449204M884415K416000J306534N83267k024689
1757.1G52827377J414109K610168K393875K075424k623825Q76465L917694J476288
1764.8G64967575N66635P93686m59366l335495J737671K393799j615448k159729J069489
1773.5G63958817M851303J751556p63397J635589J19400J62354j091461r08737K400207
1782.2G72115631K428131J678391o26450O4697J590043K76947o00358m09774j242981
1790.9G75274277j081543k307816J916428M645080J043778j63345J552810P36618j758194
1799.5G79858093j806564J234283o49719P35016K367935J288834J203766J41678j90201
1808.2G84183121L96270k49557j936798o4697R06219L77350J109772Q63189J137009
$$ plain form
1816.9 786721878 787177582 787704697 788387909 787689819 787139282 786004791 786141739 786189270 783662949
1825.6 783662949 785344925 788646317 789933777 787987823 785207825 787439499 789593201 789195099
1833.3 789195099 788666611 788618546 788932266 788910217 789492035 791830826 792776947 792977753 792375336 792077103
1842.9 792077103 790319672 784412079 787049103 789705582 789838486 790702515 792547607 794047699 794377594
1851.6 794377594 794405746 793966599 793812408 793228455 792357330 792134247 792091370 792807999 793871765 795140381
1861.3 795140381 795335541 795629959 795996857 795218964 794036865 792029953 791073074 789553070 789491425
1869.9 789491425 792475967 795146255 796683426 797128754 797042160 796382065 795896606 795107498 794638901
1878.6 794638901 794514389 794304810 795091248 795885696 797142868 797459183 797317734 797687302 797064667
$$ packed form
1816.9G86721878M55704N27115O83212o98090n50537j134491J36948M7531k526321
1825.6G83662949J681976L301392J287460j945954k779998K231674K153702l98102
1833.3G89195099n28488m8065L13720k2049N81818K338791R46121K00806o02417k98233
1842.9G92077103j757431n907593K637024K656479J32904Q64029J845092J500092L29895
1851.6G94377594K8152m39147j54191n83953q71125k23083m2877P16629J063766J268616
1861.3G95140381J95160K94418L66898p77893j182099k006912r56879j520004o1645
1869.9G89491425K984542K670288J537171M45328q6594o60095m85459p89108m68597
1878.6G94638901j24512k09579P86438P94448J257172L16315j41449L69568o22635
$$ plain form
1887.3 797064667 796548157 794327316 792120438 793513260 795118484 796137772 797256241 797193222 796905136
1896 796905136 798161850 798107834 797402802 796436462 795524521 795545425 795449371 796113434 796962128 798106155
1905.6 798106155 798657913 798098602 797659836 797195053 796341324 795668335 796066055 795859680 795862045 796577454
1915.3 796577454 798013763 799145813 796504898 796154022 797349854 796922073 795905609 793811798 793665237
1923.9 793665237 795268784 796670914 797540817 798520050 798916016 798504486 797929459 797045212 796264496
1932.6 796264496 795431366 795373001 795513077 796054611 796939468 797361603 797956619 797943573 797725372 795698776
1942.3 795698776 793741913 794802094 795050049 794761353 795138702 796112671 796930771 797605515 797978058
1951 797978058 797769852 797280655 796441879 795862198 795171509 795053253 795312958 795595398 796316986 796637039
$$ packed form
1887.3G97064667n16510k220841k206878J392822J605224J019288J118469o3019k88086
1896G96905136J256714n4016p05032r66340r11941K0904r6054O64063Q48694J144027
1905.6G98106155N51758n59311m38766m64783q53729o72989L97720k06375K365P15409
1915.3G96577454J436309J132050k640915l50876J195832m27781j016464k093811j46561
1923.9G93665237J603547J402130Q69903R79233L95966m11530n75027q84247p80716
1932.6G96264496q33130n8365J40076N41534Q84857M22135N95016j3046k18201k026596
1942.3G95698776j956863J060181K47955k88696L77349R73969Q18100O74744L72543
1951G97978058k08206m89197q38776n79681o90689j18256K59705K82440P21588L20053
$$ plain form
1960.6 796637039 797101364 797469635 797351913 796757584 796093826 795074234 793527908 793664474 794844055
1969.3 794844055 795975800 796629944 796867752 797090225 797289505 797008438 796115494 795323257 794255753
1978 794255753 793763046 794087372 794662323 795266037 795526199 796151352 796196899 795518417 794770355 793834305
1987.6 793834305 792873764 792362061 792641449 792458649 792340012 793777084 795068283 795227280 795100861
1996.3 795100861 794694748 793889923 793190536 792547760 792231827 792423325 793340454 793788452 793898315 794647446
2005.9 794647446 794722137 793957138 792783432 792406540 792385101 791850662 791690903 791815796 792376175 792816315
2015.6 792816315 792755127 792361069 792368469 792288971 791513596 790909882 790222702 790230942 790410538 790550385 791211624
2026.2 791211624 791565247 791848221 791927795 791933899 791222229 790200882 789691086 789275665 789255676 789534225
$$ packed form
1960.6G96637039M64325L68271j17722n94329o63758j019592j546326J36566J179581
1969.3G94844055J131745O54144K37808K22473J99280k81067q92944p92237j067504
1978G94255753m92707L24326N74951O03714K60162O25153M5547o78482p48062r36050
1987.6G93834305r60541n11703K79388j82800j18637J437072J291199J58997j26419
1996.3G95100861m06113q04825o99387o42776l15933J91498R17129M47998J09863P49131
2005.9G94647446P4691p64999j173706l76892k1439n34439j59759J24893N60379M40140
2015.6G92816315o1188l94058P400p9498p75375o03714o87180Q240J79596J39847O61239
2026.2G91211624L53623K82974P9574O104p11670j021347n09796m15421j9989K78549
$$ plain form
2035.8 789534225 790182037 790490952 790718002 790953598 790529480 789897690 789230804 788577499 787817307 787818298
2045.5 787818298 788124542 788428192 789164505 789650116 789849396 789591141 789268341 788720398 788001022 787350006
2055.1 787350006 786883087 786912308 787071457 787453232 787529373 787894135 788194351 787945557 787553329 786517410
2064.7 786517410 785908890 785667725 785619278 785487747 785406876 785659332 785686417 785905380 785298309 784470673
2074.4 784470673 783942108 783196411 782492599 781968307 781990356 781873245 782116776 782456970 782520905 782712555
2084 782712555 782599106 782251205 781475067 780746536 780154419 779924469 780280914 780922852 781687012 782348022
2093.7 782348022 782706451 782402115 782428818 782389069 782083740 781794739 781416245 781701126 782105637 782865524
2103.3 782865524 783569031 783968582 783934937 783653564 783910370 783666229 783605957 783524017 783362045 783689041
$$ packed form
2035.8G89534225O47812L08915K27050K35596m24118o31790o66886o53305p60192R91
2045.5G87818298L06244L03650P36313M85611J99280k58255l22800n47943p19376o51016
2055.1G87350006m66919K9221J59149L81775P6141L64762L00216k48794l92228j035919
2064.7G86517410o08520k41165m8447j31531q0871K52456K7085K18963o07071q27636
2074.4G84470673n28565p45697p03812n24292K2049j17111K43531L40194O3935J91650
2084G82712555j13449l47901p76138p28531n92117k29950L56445O41938P64160O61010
2093.7G82348022L58429l04336K6703l9749l05329k89001l78494K84881M04511P59887
2103.3G82865524P03507L99551l3645k81373K56806k44141o0272q1940j61972L26996
$$ plain form
2113 783689041 784200211 784709778 784651413 785034256 785283661 785141830 784612808 783849792 783760071 783386612
2122.6 783386612 783241882 783448486 783599548 783492889 783644867 784196701 784065628 783812485 783346024 783068542
2132.3 783068542 782962723 782981262 783318024 783370590 783625870 783854904 784253387 784376984 784032516 783816757
2141.9 783816757 783703613 783635559 783284073 783433609 783793030 784375000 785408249 786197357 786477737 785974731
2151.5 785974731 785659866 785519333 785086975 784567184 784429474 784803772 785101013 785589447 786213531 786476593
2161.2 786476593 786305466 786305389 786348801 785960083 785229950 785057449 785775833 785992737 786155319 786372375
2170.8 786372375 786504974 786535110 786048660 785874634 785424271 784766846 784314117 784014587 783978882 784407501
2180.5 784407501 785087433 785258560 785402832 785267487 785459137 785601959 785142212 785283127 785356216 785394897
$$ packed form
2113G83689041N11170N09567n8365L82843K49405j41831n29022p63016q9721l73459
2122.6G83386612j44730K06604J51062j06659J51978N51834j31073k53143m66461k77482
2132.3G83068542j05819J8539L36762N2566K55280K29034L98483J23597l44468k15759
2141.9G83816757j13144o8054l51486J49536L59421N81970J033249P89108K80380n03006
2151.5G85974731l14865j40533m32358n19791j37710L74298K97241M88434O24084K63062
2161.2G86476593j71127p7M3412l88718p30133j72501P18384K16904J62582K17056
2170.8G86372375J32599L0136m86450j74026m50363o57425m52729k99530l5705M28619
2180.5G84407501O79932J71127J44272j35345J91650J42822m59747J40915P3089L8681
$$ plain form
2190.1 785394897 785780792 786480865 786926727 787275467 787707748 787826233 788212662 788022232 787675552 787567368
2199.8 787567368 787709351 787861252 787859650 788656235 788998260 789248047 789546127 789414368 789270477 789079590
2209.4 789079590 789140701 788880157 788614655 788359146 788935394 789975204 790145111 790290985 790391998 790520325
2219 790520325 790165558 789660492 789230881 788985672 789226456 789084167 789349594 789810257 790098190 790141144
2228.7 790141144 790210342 790254364 789721451 789719696 789593811 789272995 789253387 789219437 789167099 789568024 790320358
2239.3 790320358 790455246 790387115 789891739 789602203 789389496 788849106 788571014 788371124 788862915 789222107
2248.9 789222107 789874496 790658569 790538788 789959793 789152908 788726120 788191986 788223572 788539505 789057617
2258.6 789057617 789711533 789558334 789966354 790539398 790748978 790228577 789690781 789606400 789241562 789128952
$$ packed form
2190.1G85394897L85895P00073M45862L48740M32281J18485L86429j90430l46680j08184
2199.8G87567368J41983J51901j602P96585L42025K49787K98080j31759j43891j90887
2209.4G89079590O1111k60544k65502k55509N76248J039810J69907J45874J01013J28327
2219G90520325l54767n05066m29611k45209K40784j42289K65427M60663K87933M2954
2228.7G90141144O9198M4022n32913j755j25885l20816j9608l3950n2338M00925P52334
2239.3G90320358J34888o8131m95376k89536k12707n40390k78092j99890M91791L59192
2248.9G89222107O52389P84073j19781n78995q06885m26788n34134L1586L15933N18112
2258.6G89057617O53916j53199M08020N73044K09580n20401n37796q4381l64838j12610
$$ plain form
2268.2 789128952 788930893 789555359 790331879 790224304 789804840 789866562 790332489 789751282 789271774 789279251
2277.9 789279251 789330444 789090347 789286728 790198822 790459671 790583344 790384293 790452957 790420074 789814835
2287.5 789814835 789285202 788879471 788947296 788802719 789352341 789872208 790365906 790820847 790527267 790858688
2297.2 790858688 790264816 789287872 788633270 788850479 789452820 788843079 789021530 789592819 790254288 790334320
2306.8 790334320 790082169 790062637 789412842 789199677 788747711 788396149 787788086 787857361 788426971 788587036
2316.4 788587036 789929352 790151672 789439163 788912811 788568573 787832336 786981583 786997910 786645660 787372284
2326.1 787372284 787372208 787504654 788178406 787930298 787875519 787616577 788497543 787402115 786491394 787111435
2335.7 787111435 786561966 787555466 788870850 789378586 789338837 790492172 790748520 788668823 787440186
$$ packed form
2268.2G89128952j98059O24466P76520j07575m19464O1722M65927n81207m79508P477
2277.9G89279251N1193k40097J96381R12094K60849J23673j99051O8664l2883o05239
2287.5G89814835n29633m05731O7825j44577N49622N19867M93698M54941k93580L31421
2297.2G90858688n93872r76944o54602K17209O02341o09741J78451N71289O61469Q0032
2306.8G90334320k52151j9532o49795k13165m51966l51562o08063O9275N69610J60065
2316.4G88587036J342316K22320p12509n26352l44238p36237q50753J6327l52250P26624
2326.1G87372284p6J32446O73752k48108n4779k58942Q80966j095428r10721O20041
2335.7G87111435n49469R93500J315384N07736l9749J153335K56348k079697j228637
$$ plain form
2344.4 787440186 786323700 786640320 787520752 788632584 790668259 792154922 792702408 792648468 791550522
2353.1 791550522 790059128 788317184 786100235 785333939 787061386 787991638 788069992 789755859 789626923
2361.8 789626923 789256668 790814667 789907990 789164734 789182968 787922516 787480316 788383713 789127045
2370.4 789127045 789793091 791175385 791267166 790928040 791181717 791187134 791394958 791459579 791169815 791059341
2380.1 791059341 791745071 792422867 792802582 793467407 794066010 794207306 793849182 793652725 793190384 792609329
2389.7 792609329 792643051 792780380 793119431 793697739 794265747 794383240 794235077 793927612 793468323 793123627
2399.4 793123627 792308578 791594925 791621399 792076340 792841797 793795929 794042892 793510895 793234024 793175583
2409 793175583 793078461 792400970 791508331 791050034 791371155 792165985 792423935 792795944 793128662 793310852
$$ packed form
2344.4G87440186j116486L16620Q80432J111832K035675J486663N47486n3940j097946
2353.1G91550522j491394j741944k216949p66296J727447R30252P8354J685867j28936
2361.8G89626923l70255J557999r06677p43256J8234j260452m42200R03397P43332
2370.4G89127045O66046J382294R1781l39126K53677N417K07824O4621k89764j10474
2380.1G91059341O85730O77796L79715O64825N98603J41296l58124j96457m62341n81055
2389.7G92609329L3722J37329L39051N78308N68008J17493j48163l07465m59289l44696
2399.4G93123627q15049p13653K6474M54941P65457R54132K46963n31997k76871n8441
2409G93175583r7122o77491q92639m58297L21121P94830K57950L72009L32718J82190
$$ plain form
2418.7 793310852 793063812 792465286 792103806 791333618 791120453 791022263 790807419 791179352 791773758 792450180
2428.3 792450180 792528610 792352295 791696701 790781174 790055389 789531097 789691467 789900513 790270462 790557556
2438 790557556 790794525 791441193 791704025 791113205 790309830 789602966 788663330 788469772 788559799 788594971
2447.6 788594971 789405746 790107193 790429916 790636902 790439453 789625092 788645782 787751312 787277679 787130966
2457.2 787130966 787201996 788211823 789107666 789349518 789372711 789299240 788784714 787794342 787175064 786831894
2466.9 786831894 786630859 786206131 786342239 786949234 787205811 787588959 787439880 787399902 787084198 786062775
2476.5 786062775 785508423 785194321 784935532 784670334 785071335 786066132 786739044 786815338 786573868 786241837
2486.2 786241837 785422974 784285736 783330231 783175049 783422775 783953934 784576187 784702682 784873123
$$ packed form
2418.7G93310852k47040n98526l61480p70188k13165r8190k14844L71933N94406O76422
2428.3G92450180P8430j76315o55594r15527p25785n24292J60370K09046L69949K87094
2438G90557556K36969O46668K62832n90820q03375p06864r39636j93558R0027L5172
2447.6G88594971Q10775P01447L22723K06986j97449q14361r79310q94470m73633j46713
2457.2G87130966P1030J009827Q95843K41852K3193p3471n14526r90372o19278l43170
2466.9G86831894k01035m24728J36108O06995K56577L83148j49079l9978l15704j021423
2476.5G86062775n54352l14102k58789k65198M01001R94797O72912P6294k41470l32031
2486.2G86241837q18863j137238r55505j55182K47726N31159O22253J26495J70441
$$ plain form
2494.8 784873123 785022583 785131607 784671783 783765640 782924652 782189026 781740112 781549911 782256546 782766342
2504.5 782766342 783030014 783521042 783396835 783094559 782530136 781700897 780781708 780368576 780482254 780974808
2514.1 780974808 781940689 782445908 782778625 782953339 782778473 782142639 781148529 780254288 779553909 779235001
2523.8 779235001 779248810 780133514 780945511 781394119 781755447 781264038 780649948 780027084 779504852 778841705
2533.4 778841705 778337250 778696671 779101410 779558258 780144196 780753403 780801315 780292892 779972000 779295654
2543.1 779295654 778118362 777515335 777677841 778030930 778772659 779281921 779622040 780020447 779852371
2551.7 779852371 779433670 778607712 777467041 776330109 775941467 776401901 776986313 777473984 777821884
2560.4 777821884 778546677 778742828 778565674 778207626 776949997 776192856 775947342 775554276 775323792
$$ packed form
2494.8G84873123J49460J09024m59824r06143q40988p35626m48914j90201P06635N09796
2504.5G82766342K63672M91028j24207l02276n64423q29239r19189m13132J13678M92554
2514.1G80974808R65881N05219L32717J74714j74866o35834r94110q94241p00379l18908
2523.8G79235001J3809Q84704Q11997M48608L61328m91409o14090o22864n22232o63147
2533.4G78841705n04455L59421M04739M56848N85938O09207M7912n08423l20892o76346
2543.1G79295654j177292o03027J62506L53089P41729N09262L40119L98407j68076
2551.7G79852371m18701q25958j140671j136932l88642M60434N84412M87671L47900
2560.4G77821884P24793J96151j77154l58048j257629p57141k45514l93066k30484
$$ plain form
2569.1 775323792 775714798 776434250 776819458 777235031 777466125 776986389 775979843 775070343 774422455
2577.8 774422455 774216080 774417038 774711609 775179596 775661621 776169205 776208420 775758209 775075302 774170609
2587.4 774170609 773565216 773139343 772852631 772917023 773379593 773790741 773939590 774126205 774222183 773946609
2597.1 773946609 773017578 772018280 771599731 771365356 770983582 771112747 771584091 771966248 772420273 772429733
2606.7 772429733 772231293 771582260 770671158 769940186 769146729 768915558 769109726 769828873 770463638 770524521
2616.4 770524521 770632629 770530701 769768448 768598785 768090286 767667923 767333527 767543488 767773132
2625 767773132 768160324 768621979 769191513 768842545 767977142 767384109 766485062 765592194 764878235 764897232
2634.7 764897232 765121002 765171280 765522995 766115494 766343307 766015778 765783081 764911880 763995438 763373718
$$ packed form
2569.1G75323792L91006P19452L85208M15573K31094m79736j006546r09500o47888
2577.8G74422455k06375K00958K94571M67987M82025N07584L9215m50211o82907r04693
2587.4G74170609o05393m25873k86712O4392M62570M11148J48849J86615R5978k75574
2597.1G73946609r29031r99298m18549k34375l81774J29165M71344L82157M54025R460
2606.7G72429733j98440o49033r11102p30972p93457k31171J94168P19147O34765O0883
2616.4G70524521J08108j01928p62253j169663n08499m22363l34396K09961K29644
2625G67773132L87192M61655N69534l48968q65403n93033q99047q92868p13959J8997
2634.7G64897232K23770N0278L51715N92499K27813l27529k32697q71201r16442o21720
$$ plain form
2644.3 763373718 762811584 762927780 763225784 763597412 763767853 764007263 764055786 763702545 762980423 761583862
2654 761583862 760573425 760078278 760370789 760888901 761233215 761876678 762170792 762209015 761594772 760748901
2663.6 760748901 760289154 759691467 758807907 758325348 758682022 759100037 759421921 759351425 759489059 759950943
2673.3 759950943 759503860 758673172 758100357 757631683 756951981 756710358 757183228 757520142 757463913 757501144
2682.9 757501144 757649078 757206955 756672287 756100922 755445633 754945068 754622116 754759827 754859924 755440292
2692.5 755440292 756279755 756234894 755620575 755049210 754375839 753416901 752906723 752711716 752700272 753007736
2702.2 753007736 753286819 753604736 753832016 753669205 753074265 752358551 751633301 751045609 750378265 749891586
2711.8 749891586 750016403 750440903 751126175 751428299 751619034 751419983 750375290 749463806 748722458
$$ packed form
2644.3G63373718n62134J16196K98004L71628J70441K39410M8523l53241p22122j396561
2654G61583862j010437m95147K92511N18112L44314O43463K94114L8223o14243q45871
2663.6G60748901m59747n97687q83560m82559L56674M18015L21884p0496J37634M61884
2673.3G59950943m47083q30688n72815m68674o79702k41623M72870L36914n6229L7231
2682.9G57501144J47934m42123n34668n71365o55289n00565l22952J37711J00097N80368
2692.5G55440292Q39463m4861o14319n71365o73371r58938n10178j95007j1444L07464
2702.2G53007736K79083L17917K27280j62811n94940p15714p25250n87692o67344m86679
2711.8G49891586J24817M24500O85272L02124J90735j99051j044693r11484p41348
$$ plain form
2720.5 748722458 748314133 747898712 747579956 747652969 747702789 748025360 748502731 748759232 748400192 747613602
2730.2 747613602 746778412 746176147 745673294 745251999 745237274 745411377 746133270 746509933 746272278 745944748
2739.8 745944748 745301056 744812317 743912430 743095627 743152924 743505020 743712692 743681793 743735046 743872147
2749.4 743872147 744155960 743953476 743179626 742317047 741512680 741024857 740476074 740467911 741126709 741707001
2759.1 741707001 741964264 741606979 741071167 740670166 740257874 739663467 738794937 738045425 737847214 738138885
2768.7 738138885 738285599 738090744 738227158 738160858 737582321 737414780 736758957 735504379 734740295 734554977
2778.4 734554977 734805679 735015030 735265198 735329971 735012054 734556732 733850632 733281860 732967682 732368469
2788 732368469 731694946 731604080 731521835 731234818 730949707 730856628 730950928 730519333 730018768 729382935 728564911
$$ packed form
2720.5G48722458m08325m15421l18756P3013M9820L22571M77371K56501l59040p86590
2730.2G47613602q35190o02265n02853m21295j4725J74103P21893L76663k37655l27530
2739.8G45944748o43692m88739q99887q16803N7297L52096K07672l0899N3253J37101
2749.4G43872147K83813k02484p73850q62579q04367m87823n48783q163O58798N80292
2759.1G41707001K57263l57285n35812m01001m12292n94407q68530p49512j98211K91671
2768.7G38138885J46714j94855J36414o6300n78537j67541o55823j254578p64084j85318
2778.4G34554977K50702K09351K50168O4773l17917m55322p06100n68772l14178n99213
2788G32368469o73523r0866q2245k87017k85111r3079R4300m31595n00565o35833q18024
$$ plain form
2798.6 728564911 727737656 726846085 726597137 726760254 726959305 726764145 726325989 725814209 725237045 724619446
2808.3 724619446 723652191 723004456 722441635 722262192 722297974 722050705 721879501 721207199 720796738 720399323
2817.9 720399323 719648514 719024887 718177414 717141266 716419678 716440430 715975266 715543747 715694656 715387726
2827.6 715387726 714760132 713606415 712642975 712078247 711287613 710346451 709682312 709304886 708815155
2836.2 708815155 708705673 708372116 707257843 705660934 703638992 701549149 699861984 698532028 697068863
2844.9 697068863 695577164 694153519 692917252 691105576 688906326 687769089 686846008 685430069
2852.6 685430069 684117813 683536758 683385239 683376770 683702011 684217834 684637070 684242859 683705292 683186722
2862.3 683186722 682445526 681593552 680486908 679691849 678570099 677580643 677284698 676725922 676227112
$$ packed form
2798.6G28564911q27255q91571k48948J63117J99051j95160m38156n11780n77164o17599
2808.3G24619446r67255o47735n62821j79443L5782k47269j71204o72302m10461l97415
2817.9G20399323p50809o23627q47473j036148p21588K0752m65164m31519J50909l06930
2827.6G15387726o27594j153717r63440n64728p90634r41162o64139l77426m89731
2836.2G08815155j09482l33557j114273j596909k021942k089843j687165j329956j463165
2844.9F97068863j491699j423645j236267j811676k199250j137237r23081j415939
2852.6F85430069j312256n81055j51519q469L25241N15823M19236l94211n37567n18570
2862.3F83186722p41196q51974j106644p95059j121750r89456k95945n58776m98810
$$ plain form
2870.9 676227112 676312485 676251373 675085526 673509979 672420425 672058258 671758270 671154251 670733490
2879.6 670733490 670201111 670295334 670662308 670084381 669266510 668544998 667586060 666427155 665381622
2888.3 665381622 664937515 664968109 664538651 663663940 662560043 661661453 661190872 660228577 659160614
2897 659160614 658398209 657937469 657310944 656217957 655446548 655433731 655949173 655641327 654942932 654121552
2906.6 654121552 652896347 652544403 652136917 650913544 649813080 649351044 648662567 647641144 647013702
2915.3 647013702 646043015 644722595 643246002 642322311 641846542 640853195 640063019 639517326 638752251
2924 638752251 638104134 638263054 638538208 638880234 639546776 639431000 639077568 638723755 638547173 638968658
2933.6 638968658 639537735 640286026 641207123 642080002 642387619 642430267 643023148 643688202 643883972 644089355
$$ packed form
2870.9F76227112Q5373o1112j165847j575547j089554l62167k99988o04019m20761
2879.6F70733490n32379R4223L66974n77927q17871p21512r58938j158905j045533
2888.3F65381622m44107L0594m29458q74711j103897q98590m70581r62295j067963
2897F59160614p62405m60740o26525j092987p71409j2817N15442l07846o98395q21380
2906.6F54121552j225205l51944m07486j223373j100464m62036o88477j021423o27442
2915.3F47013702r70687j320420j476593r23691m75769r93347p90176n45693p65075
2924F38752251o48117J58920K75154L42026O66542j15776l53432l53813j76582M21485
2933.6F38968658N69077P48291R21097Q72879L07617M2648N92881O65054J95770K05383
$$ plain form
2943.3 644089355 644267349 644566345 644956589 644918671 645188599 645366669 645240860 644937973 644437180 644337311
2952.9 644337311 643799896 643203430 642889633 642837601 643160019 643151245 643233566 643151627 643138046 643634262 644048462
2963.5 644048462 644236221 644554672 645072861 645516968 646582489 647814407 648669891 649494934 650484467
2972.2 650484467 651749573 652403107 652807922 653554077 654526443 655654831 656438904 657189407 658244934
2980.9 658244934 659273148 660163345 661002274 661320801 661488876 662226715 662749405 662829742 663338928 664449158
2990.5 664449158 665647125 666524124 666820602 666944122 667158203 667479172 668029404 668185577 667819138
2999.2 667819138 667630997 668150177 668394470 667824631 667457199 667649078 668284836 668385620 667985306 667877960
3008.8 667877960 667622833 667443542 667630234 667542648 667248993 667270966 667117920 666843948 666385651 665631714
$$ packed form
2943.3F44089355J77994K98996L90244l7918K69928J78070j25809l02887n00793r9869
2952.9F44337311n37415n96466l13797n2032L22418q774Q2321q1939j3581M96216M14200
2963.5F44048462J87759L18451N18189M44107J065521J231918Q55484Q25043R89533
2972.2F50484467J265106O53534M04815P46155R72366J128388P84073P50503J055527
2980.9F58244934J028214Q90197Q38929L18527J68075P37839N22690Q0337N09186J110230
2990.5F64449158J197967Q76999K96478J23520K14081L20969N50232J56173l66439
2999.2F67819138j88141N19180K44293n69839l67432J91879O35758J00784m00314j07346
3008.8F67877960k55127j79291J86692q7586k93655K1973j53046k73972m58297p53937
$$ plain form
3018.5 665631714 665173187 664835205 664690628 664440689 664259644 664191055 663626175 663025131 662739868 662718811
3028.1 662718811 662016068 660994186 660481491 660019379 659801102 659730377 659650345 659255676 658610306 658194962
3037.8 658194962 657989807 657694244 657110519 656285172 655381699 654760590 654050140 653548737 653097763 652787247
3047.4 652787247 653201752 652998886 652434616 651591492 650567093 649892960 648902283 648288193 647936935
3056.1 647936935 647506866 647129288 646744537 646475067 646073837 645415802 644886703 644235764 642630920
3064.8 642630920 641875610 641919556 641678467 642051544 642209549 641962967 641309204 640180054 639155998
3073.5 639155998 638745651 638726082 638284607 637882538 637282219 636991768 637257614 637276573 637155914 636697617
3083.1 636697617 635932884 634806595 634176750 633943825 633319740 632628441 631976395 631807022 631530380
$$ packed form
3018.5F65631714m58527l37982j44577k49939j81045o8589n64880o01044k85263k1057
3028.1F62718811p02743j021882n12695m62112k18277p0725q0032l94669o45370m15344
3037.8F58194962k05155k95563n83725q25347r03473o21109p10450n01403m50974l10516
3047.4F52787247M14505k02866n64270q43124j024399o74133r90677o14090l51258
3056.1F47936935m30069l77578l84751k69470m01230o58035n29099o50939j604844
3064.8F42630920p55310M3946k41089L73077J58005k46582o53763j129150j024056
3073.5F39155998m10347j9569m41475m02069o00319k90451K65846J8959j20659m58297
3083.1F36697617p64733j126289o29845k32925o24085o91299o52046j69373k76642
$$ plain form
3091.8 631530380 630978127 630676308 630511208 629822617 628512192 627918129 627876205 627478676 626590843 626074791
3101.4 626074791 625945854 625476036 624852066 624023170 623669853 623568840 622963905 622170143 621171989 620127220
3111.1 620127220 619485168 619329262 619456444 619485741 618618546 617739677 617327805 616228180 614925995
3119.8 614925995 614049721 613336258 612352142 612077942 612458878 611889725 610916023 609993095 609264145 608612289
3129.4 608612289 607393188 606128960 605428963 605022011 604592628 604324493 603902321 603289375 602530403
3138.1 602530403 601588135 600600739 599460106 598586044 597769737 596775818 596071930 595577812 594815216
3146.8 594815216 594294014 594350777 593758965 592577553 591687241 590818329 589600296 588343582 587293358
3155.4 587293358 586677017 586339531 585541229 584757118 583899727 582910080 582258682 581520309 580630264 579202499
$$ packed form
3091.8F31530380n52253l01819j65100o88591j310425n94063m1924l97529q87833n16052
3101.4F26074791j28937m69818o23970q28896l53317j01013o04935p93762r98154j044769
3111.1F20127220o42052j55906J27182K9297q67195q78869m11872j099625j302185
3119.8F14925995q76274p13463r84116k74200L80936n69153r73702r22928p28950o51856
3129.4F08612289j219101j264228o99997m06952m29383k68135m22172o12946p58972
3138.1F02530403r42268r87396j140633q74062q16307r93919p03888m94118p62596
3146.8E94815216n21202N6763n91812j181412q90312q68912j218033j256714j050224
3155.4E87293358o16341l37486p98302p84111q57391r89647o51398p38373q90045j427765
$$ plain form
3165.1 579202499 577621613 576721191 576496315 576290779 575743713 575358276 574595222 573307419 572198334
3173.8 572198334 571371994 570295563 569110336 568266983 567485771 567048798 566743050 566243591 565405846
3182.4 565405846 564435310 563501167 562152138 561148796 560486259 559619179 558723755 558039246 557579231
3191.1 557579231 556963730 555974503 554808311 554156036 553410301 552312317 551431351 550693245 550105972
3199.8 550105972 549389000 548746567 548091202 547395782 546569099 545643616 545118217 544383049 543171997
3208.5 543171997 541921310 541328430 540613976 539814758 539723511 538845482 537605591 536870880 536279259
3217.2 536279259 535757713 534863701 533495483 532556381 532474670 532002525 531026230 530437965 530808563 530855637
3226.8 530855637 529578629 528357201 527015457 525972176 525497017 524959564 524627380 524105186 523202400
$$ packed form
3165.1E79202499j580886r00422k24876k05536n47066l85437p63054j287803j109085
3173.8E72198334q26340j076431j185227q43353p81212m36973l05748m99459q37745
3182.4E65405846r70536r34143j349029j003342o62537q67080q95424o84509m60015
3191.1E57579231o15501r89227j166192o52275p45735j097984q80966p38106n87273
3199.8E50105972p16972o42433o55365o95420q26683r25483n25399p35168j211052
3208.5E43171997j250687n92880p14454p99218r1247q78029j239891p34711n91621
3217.2E36279259n21546q94012j368218r39102q1711m72145r76295n88265L70598M7074
3226.8E30855637j277008j221428j341744j043281m75159n37453l32184n22194r02786
$$ plain form
3235.5 523202400 522277451 522074203 521833458 520767288 519504013 518567085 517789841 516764908 516103745
3244.2 516103745 515472679 515004883 515193977 515031738 514004211 512803040 512046242 511301460 510826874
3252.8 510826874 510096626 508972549 508425255 508151474 507931137 507034645 505936852 505328979 504850044
3261.5 504850044 504299316 503501167 502736740 502143822 501813164 501255531 501201401 501495857 500931892 500715752
3271.2 500715752 500620766 499641876 498012924 496851845 496494637 496307220 495731659 494506569 494340897
3279.8 494340897 494670448 493883972 493163528 492739220 491834259 490686493 490067787 489977036 489928398 489609871
3289.5 489609871 489405212 489237709 488896942 488391800 487563934 487386627 486889915 485585213 484872398
3298.2 484872398 484613266 484528503 484122009 483567352 483171577 482712212 482375870 482249336 481679764 480297089
$$ packed form
3235.5E23202400r24949k03248k40745j066170j263275r36928p77244j024933o61163
3244.2E16103745o31066m67796J89094j62239j027527j201171p56798p44782m74586
3252.8E10826874p30248j124077n47294k73781k20337q96492j097793o07873m78935
3261.5E04850044n50728p98149p64427n92918l30658n57633n4130K94456n63965k16140
3271.2E00715752r4986r78890j628952j161079l57208j87417n75561j225090j65672
3279.8D94340897L29551p86476p20444m24308r04961j147766o18706r0751m8638l18527
3289.5D89609871k04659j67503l40767n05142q27866j77307m96712j304702p12815
3298.2D84872398k59132q4763m06494n54657l95775m59365l36342j26534n69572j382675
$$ plain form
3307.8 480297089 479239388 478497734 477938156 477529602 476815948 476666985 476770859 476305466 475557060
3316.5 475557060 474849968 474080544 473160553 472126427 471339378 470895386 470232582 470071449 470135765 469389992
3326.1 469389992 468738976 468180351 466729355 465274658 464741173 464277611 463505058 462691956 462312660
3334.8 462312660 462182159 461953125 461645622 460691528 459592323 458509941 457834549 457412987 456183090
3343.5 456183090 455316925 455023880 454631653 453979111 453125000 452451172 451557732 450310402 449231262
3352.2 449231262 448472366 447508392 446664429 445986404 445080566 444425507 444206467 443927803 443065071 442366142
3361.8 442366142 441735992 440907288 439721718 438176231 437631073 437327118 437026482 436918030 436321869
3370.5 436321869 435410118 434509926 433964806 432994461 431834221 430978966 430561867 430438309 429800568
$$ packed form
3307.8D80297089j057701p41654n59578m08554p13654j48963J03874m65393p48406
3316.5D75557060p07092p69424r19991j034126p87049m43992o62804j61133O4316p45773
3326.1D69389992o51016n58625j450996j454697n33485m63562p72553q13102l79296
3334.8D62312660j30501k29034l07503r54094j099205j082382o75392m21562j229897
3343.5D56183090q66165k93045l92227o52542q54111o73828q93440j247330j079140
3352.2D49231262p58896r63974q43963o78025r05838o55059k19040k78664q62732o98929
3361.8D42366142o30150q28704j185570j545487n45158l03955l00636j08452n96161
3370.5D36321869r11751r00192n45120r70345j160240q55255m17099j23558o37741
$$ plain form
3379.2 429800568 429313087 428687096 428058357 427849159 427073669 426086807 425709076 425353775 424570465 424113655
3388.8 424113655 423779678 423535347 423316345 422624855 422109261 421809654 421542664 420901375 420016251 419849739
3398.4 419849739 420204620 420052071 419219284 418685532 418609505 418637428 418229446 417439919 416754951 416518440
3408.1 416518440 416668167 416316452 415923309 415613441 415158920 415623779 416379776 415829659 414918556 414559631
3417.7 414559631 414182510 414366837 414388885 413848343 413869286 413841934 413415947 413188934 413510132 413851852
3427.4 413851852 413896675 413579063 413439789 413528633 413547211 414035187 413982010 413984222 414472313 414571457 414658432
3438 414658432 414749107 415049896 415205994 415277977 415065727 415091476 415702553 416366653 417245598 417159119 417748184
3448.6 417748184 418729630 418647652 418841515 419265900 419845886 419958496 420081558 420638161 421195221 421626968
$$ packed form
3379.2D29800568m87481o25991o28739k09198p75490r86862l77731l55301p83310m56810
3388.8D24113655l33977k44331k19002o91490n15594k99607k66990o41289q85124j66512
3398.4D19849739L54881j52549q32787n33752p6027K7923m07982p89527o84968k36511
3408.1D16518440J49727l51715l93143l09868m54521M64859P55997n50117r11103l58925
3417.7D14559631l77121J84327K2048n40542K0943k7352m25987k27013L21198L41720
3427.4D13851852M4823l17612j39274Q8844J8578M87976n3177K212M88091R9144Q6975
3438D14658432R0675L00789J56098P1983k12250K5749O11077O64100Q78945q6479N89065
3448.6D17748184R81446q1978J93863M24385N79986J12610J23062N56603N57060M31747
$$ plain form
3458.2 421626968 421870232 422985420 424092102 424721298 424948158 425246620 425818558 425805626 426284943
3466.9 426284943 427479591 428664284 429071159 429669189 430686035 430885887 431259308 431383209 431281929
3475.6 431281929 431891365 433297348 434733849 435312157 435665512 436094131 436662903 437422752 438505707
3484.3 438505707 438777847 438680420 439657898 440583191 441165237 441729851 442931290 444392662 445422554
3493 445422554 445729446 445737267 446784821 447605553 448306427 449102516 449527740 450281410 451336632 452416954
3502.6 452416954 452466125 453063545 454832535 455519066 455598755 456470833 456778030 456913452 458723412 460191383
3512.2 460191383 461038361 461972618 462744713 463712997 464736900 465451736 466167564 467088470 467482758
3520.9 467482758 468774338 469756660 469660187 471158638 472227745 473046417 474263000 474964104 475269279
$$ packed form
3458.2D21626968K43264J115188J106682O29196K26860K98462N71938j2932M79317
3466.9D26284943J194648J184693M06875N98030J016846J99852L73421J23901j01280
3475.6D31281929O09436J405983J436501N78308L53355M28619N68772P59849J082955
3484.3D38505707K72140r7427R77478R25293N82046N64614J201439J461372J029892
3493D45422554L06892P821J047554Q20732P00874P96089M25224P53670J055222J080322
3502.6D52416954M9171N97420J768990O86531P9689Q72078L07197J35422J809960J467971
3512.2D60191383Q46978R34257P72095R68284J023903P14836P15828R20906L94288
3520.9D67482758J291580R82322r6473J498451J069107Q18672J216583P01104L05175
$$ plain form
3529.6 475269279 476093826 477016830 477792587 479600868 480774956 482304726 483185806 483058891 484536629
3538.3 484536629 485709114 487071800 487788849 488773117 489920464 490065994 491095543 492340126 494230690
3547 494230690 495003242 496895523 498760185 499207077 500150223 498814240 499945297 502399826 504379501
3555.6 504379501 506400146 507240524 509097290 510039024 510815506 511980247 513629570 514473076 514704208
3564.3 514704208 517356491 516214714 516397209 518466148 519777145 523718681 525601921 526855125
3572 526855125 528317451 529854431 530692902 531684647 534131241 535406494 537919159 539803543 540634995
3580.7 540634995 542290840 544185143 545718803 546004181 548975716 549997101 549030876 550940819 551404266
3589.4 551404266 555340691 558634720 560933113 562141800 562919502 565370102 563804169 566315765
$$ packed form
3529.6D75269279Q24547R23004P75757J808281J174088J529770Q81080j26915J477738
3538.3D84536629J172485J362686P17049R84268J147347J45530J029549J244583J890564
3547D94230690P72552J892281J864662M46892R43146j335983J131057K454529J979675
3555.6E04379501K020645Q40378J856766R41734P76482J164741J649323Q43506K31132
3564.3E14704208K652283j141777J82495K068939J310997L941536J883240J253204
3572E26855125J462326J536980Q38471R91745K446594J275253K512665J884384Q31452
3580.7E40634995J655845J894303J533660K85378K971535J021385r66225J909943M63447
3589.4E51404266L936425L294029K298393J208687P77702K450600j565933K511596
$$ plain form
3597.1 566315765 570210190 571175537 574019127 575001335 576282005 579008827 581405487 583554192 585626030
3605.8 585626030 586972961 585915947 589177208 588777313 589160843 596517487 597027359 596283607 600760384
3614.5 600760384 600579872 604431152 608056870 607621841 609402542 608591385 609676285 614112892 617702408
3623.1 617702408 620356102 622938728 624569244 627571106 634255791 631219406 620253983 626279259
3630.9 626279259 633207932 639039955 640437775 640242462 644062881 647762527 650127335 651270905
3638.6 651270905 653103943 655428314 657347260 658001938 658578949 661085205 664617004 669320450 667331467
3647.3 667331467 665079422 670319366 668764877 665922852 668188248 674854050 679108429 682372513
3655 682372513 685774460 678986893 682204285 687921600 689772491 691963806 692960281 694585876 694822845
$$ packed form
3597.1E66315765L894425R65347K843590R82208J280670K726822K396660K148705K071838
3605.8E85626030J346931j057014L261261l99895L83530P356644N09872p43752M476777
3614.5F00760384j80512L851280L625718m35029J780701q11157J084900M436607L589516
3623.1F17702408K653694K582626J630516L001862O684685l036385j0965423O025276
3630.9F26279259O928673N832023J397820j95313L820419L699646K364808J143570
3638.6F51270905J833038K324371J918946O54678N77011K506256L531799M703446j988983
3647.3F67331467k252045N239944j554489k842025K265396O665802M254379L264084
3655F82372513L401947o787567L217392N717315J850891K191315R96475J625595K36969
$$ plain form
3663.6 694822845 695516357 697198181 698633957 703277893 704345169 700948944 699980698 695899734 700643539
3672.3 700643539 708688660 713715210 706995010 691410141 697936096 707266083 712198639 711704407
3680 711704407 713212814 716179199 717699280 718478699 718888626 719028931 721705170 726282806 716187668
3688.7 716187668 712445755 720009918 715988464 717764130 722819214 722655563 723812485 723371353 722795105
3697.4 722795105 724234238 724918289 727096634 728823318 724254761 723479919 728654022 729884186 729588242
3706.1 729588242 730363693 732201767 734433060 727588806 731289444 733820877 722393951 729434967
3713.8 729434967 735327225 735689087 736284409 737697220 737342300 733662949 734267654 738387375 734499435
3722.5 734499435 732001724 738009262 738872986 737708664 735346146 736241379 739877930 739877167 744268112
$$ packed form
3663.6F94822845O93512J681824J435776M643936J067276l396225r68246m080964M743805
3672.3G00643539Q045121N026550o720200j5584869O525955R329987M932556m94232
3680G11704407J508407K966385J520081P79419M09927J40305K676239M577636j0095138
3688.7G16187668l741913P564163m021454J775666N055084j63651J156922m41132n76248
3697.4G22795105J439133O84051K178345J726684m568557p74842N174103J230164k95944
3706.1G29588242P75451J838074K231293o844254L700638K531433j1426926P041016
3713.8G29434967N892258L61862N95322J412811l54920l679351O04705M119721l887940
3722.5G34499435k497711O007538Q63724j164322k362518Q95233L636551p63M390945
$$ plain form
3731.2 744268112 740114822 733043671 740975800 739913559 731557159 732001877 734984207 736519165
3738.9 736519165 739582672 742367783 738868484 741371460 750201035 736371918 723900299 736674194
3746.6 736674194 743658981 749037704 743194580 729698715 739802551 735260620 730975723 738439789
3754.3 738439789 743962708 747390137 741703720 743684769 748831482 741836166 740562820 744370651
3762 744370651 745298004 745569382 749115524 745701294 741357803 745062180 749180450 748541794 740074768
3770.7 740074768 742959976 746806717 747286072 748492279 748023682 748747787 748768463 750177231 749147110
3779.4 749147110 742683487 745874710 748122635 749142914 750935135 747075272 745578461 747365494
3787.1 747365494 748642807 749243240 749256287 749711914 749734726 749784088 749331360 750612106 753180618 747986221
$$ packed form
3731.2G44268112m153290p071151P932129j062241q356400M44718K982330J534958
3738.9G36519165L063507K785111l499299K502976Q829575j3829117j2471619J2773895
3746.6G36674194O984787N378723n843124j3495865J0103836m541931m284897P464066
3754.3G38439789N522919L427429n686417J981049N146713o995316j273346L807831
3762G44370651R27353K71378L546142l414230m343491L704377M118270o38656q467026
3770.7G40074768K885208L846741M79355J206207m68597P24105K0676J408768j030121
3779.4G49147110o463623L191223K247925J020279J792221l859863j496811J787033
3787.1G47365494J277313O00433J3047M55627K2812M9362m52728J280746K568512n194397
$$ plain form
3796.7 747986221 743474197 745847244 749517746 753360443 744361496 735648499 742404327 746593323
3804.4 746593323 750216904 754061356 745002060 742039719 746987000 749208908 749762802 750592651 751181183
3813.1 751181183 751604996 755783539 752453461 738822174 745165863 750774536 753439102 751143951
3820.8 751143951 734524536 738986435 745652466 748802872 751278610 751254349 748046188 748197479 750003433
3829.5 750003433 752550583 752019272 743766556 747890396 753921509 745886536 746215439 754271088 743495102
3838.2 743495102 738772125 746611404 742905807 744314117 750525360 747450714 745105667 748779984
3845.9 748779984 750527039 750053177 751255722 750436707 752170715 755328827 746618729 748433838 732929382
3854.6 732929382 735832748 747771149 748660355 748391037 749845428 751079559 752675476 746667328
$$ packed form
3796.7G47986221m512024K373047L670502L842697q998947q712997O755828M188996
3804.4G46593323L623581L844452r059296k962341M947281K221908N53894Q29849N88532
3813.1G51181183M23813M178543l330078j3631287O343689N608673K664566k295151
3820.8G51143951j6619415M461899O666031L150406K475738k4261l208161J51291J805954
3829.5G50003433K547150n31311q252716M123840O031113q034973L28903Q055649j0775986
3838.2G43495102m722977P839279l705597J408310O211243l074646k345047L674317
3845.9G48779984J747055m73862J202545q19015J734008L158112q710098J815109j5504456
3854.6G32929382K903366J1938401Q89206k69318J454391J234131J595917o008148
$$ plain form
3862.3 746667328 747329407 752998047 745721359 742281113 747362976 751735306 756448975 748680573
3870 748680573 739765778 744070816 749992523 751286850 742235184 745251312 749791412 749667587 751990280
3878.7 751990280 754997482 748181915 742723389 748758926 750097504 751183624 753283615 741507721
3886.4 741507721 745162430 749951401 750302658 753736725 752273712 744181595 745854416 749381866
3894.1 749381866 748980408 750786133 751409683 752859039 752773666 742546463 747443924 748982315 744914627
3902.8 744914627 749847946 745997467 744246826 746157837 748200302 750383377 749878082 750057449 750071259
3911.5 750071259 750147018 750189209 749687958 750010529 750713959 747894669 745690308 750272675 750442352
3920.2 750442352 747224884 749675598 750586395 750610352 748367996 746340866 748761444 749770660 749862518
$$ packed form
3862.3G46667328O62079N668640p276688l440246N081863M372330M713669p768402
3870G48680573q914795M305038N921707J294327r051666L016128M540100j23825K322693
3878.7G51990280L007202o815567n458526O035537J338578J086120K099991j1775894
3886.4G41507721L654709M788971L51257L434067j463013q092117J672821L527450
3894.1G49381866m01458J805725O23550J449356q5373j0227203M897461J538391m067688
3902.8G44914627M933319l850479j750641J911011K042465K183075n05295J79367J3810
3911.5G50071259P5759M2191n01251L22571P03430k819290k204361M582367J69677
3920.2G50442352l217468K450714R10797K3957k242356k027130K420578J009216R1858
$$ plain form
3928.8 749862518 748622131 748538971 750167084 747333298 746513214 748460999 748879471 749125977 749045563
3937.5 749045563 749031219 749546890 749444885 750432663 750346527 745864182 746346359 748880005 749711075 750593872
3947.2 750593872 748706284 748681717 748456192 746935730 749016800 749856415 749340363 748976212 748763657
3955.8 748763657 748965225 748988876 748811111 748215866 749178848 749533539 748606339 748528366 748370056 748775253
3965.5 748775253 749926605 750342789 749273453 748521881 748999329 750001678 749778061 748816910 749169388
3974.2 749169388 749081879 748880997 748811646 749030151 749097290 748260193 748513031 749048767 749481583 749600067
3983.8 749600067 749058456 749033661 749420700 749498825 749051819 748701553 748666229 749337997 749918900 750214539
3993.5 750214539 750140228 749125977 748899841 749413834 749219971 748254013 748303146
$$ packed form
3928.8G49862518j240387q3160J628113k833786q20084J947785M18472K46506q0414
3937.5G49045563j4344N15671j02005R87778q6136m482345M82177K533646Q31070Q82797
3947.2G50593872j887588k4567k25525j520462K081070Q39615n16052l64151k12555
3955.8G48763657K01568K3651j77765n95245R62982L54691r27200p7973j58310M05197
3965.5G48775253J151352M16184j069336p51572M77448J002349k23617r61151L52478
3974.2G49169388q7509k00882o9351K18505O7139q37097K52838N35736M32816J18484
3983.8G49600067n41611k4795L87039P8125m47006l50266l5324O71768N80903K95639
3993.5G50214539p4311j014251k26136N13993j93863r65958M9133
$$ plain form
4000.2 748303146
$$ packed form
4000.2G48303146
##END=$$ End of the data block
