##TITLE=$$ Begin of the data block
##JCAMP-DX=5.00 $$ ACD/SpecManager v 10.08
##SPECTROMETER/DATA SYSTEM=Varian
##DATE=07 Jan 2013 10:46:00
##DATA TYPE=INFRARED SPECTRUM
##DATA CLASS=XYDATA
##ORIGIN=
##OWNER=
##NPOINTS=3735
##FIRSTX=399.26403809
##LASTX=4000.35498047
##MAXX=4000.35498047
##MINX=399.26403809
##MAXY=95.15532684
##MINY=17.27801323
##XFACTOR=1.0000000000
##YFACTOR=0.000000100000000
##FIRSTY=57.32979584
##DELTAX=0.96440572
##XUNITS=1/CM
##YUNITS=TRANSMITTANCE
##XYDATA=(X++(Y..Y))
399.3E73297958l5194625K64836730J48613205j09038848k21835633l5353889L4117050
406F19441948j12820854Q817634K4290696j2449036N330200l0744553M6286698m3554459
413.7E04598274P157402N8644371j33817520j07672348p6057796L9805050J37320976
420.5D29978409L5361290P626953J8574295R541626K1113167j594467J1240234K4695587
428.2E56537094q6842155p4039650O0428314R2657204M0543060K8208656m6653328
434.9E70839195p7981872L1961898J12260514N3213768j6833725n3400612m3294907
441.7E76764259k3036918k5374527l5305329M3426667R7434845n6780777p2494965
448.4E04633255K1334572j7930412J3474197N8527031l6551285j1107445L658676j0072593
$$ plain form
399.3 573297958 538103333 802940063 951553268 842514420 620678787 585324898 619441948
406 619441948 506621094 515438728 539729424 527280388 532610588 501866035 548152733 504598274
413.7 504598274 511755676 570400047 436582527 328910179 252852383 292657433 429978409
420.5 429978409 465339699 472966652 491540947 501082573 522195740 520601273 531841507 556537094
428.2 556537094 469694939 395655289 456083603 548740807 589283867 617492523 570839195
434.9 570839195 492857323 524819221 637079735 690293503 673459778 620059166 576764259
441.7 576764259 553727341 528352814 493047485 536474152 633908997 577128220 504633255
448.4 504633255 525967827 508037415 521511612 580038643 543487358 532379913 536038589 525965996
456.2E25965996M3283005o3762360J555519J9236259j8923721M8556748J5899734j0029259
463.9E61781921p7791977q6300773L3337784M5297165J00408935J07280159l627777
470.6F80385437j2897415k8451462N1237488l1176376q4205361L674584J1156005l8519363
478.3E51203537m7965240q603287J6552315k0614586l9563637J5780449N5493355K4522361
486.1E46805267K1978226l0968819k8603401M4343453J1080818n2439003j1057778
492.8E01138763M3239861L434486n7239265K589264N1340179L2466660O526565k1667366
500.5E61829147n6789474l5546837N0278625J219445j865158P1414528O354255l0678482
508.2E66216049J1031494R745331o461525q142395j435852l8471184l0363121L37601
$$ plain form
456.2 525965996 569249001 505486641 507042160 526278419 507354698 555911446 571811180 561781921
463.9 561781921 483989944 397689171 431026955 476324120 576733055 684013214 680385437
470.6 680385437 667488022 639036560 690274048 659097672 574892311 578566895 589722900 551203537
478.3 551203537 503238297 494635010 511187325 490572739 451009102 466789551 522282906 546805267
486.1 546805267 568783493 537814674 509211273 553554726 564635544 512196541 501138763
492.8 501138763 544378624 547813110 490573845 493163109 544503288 576969948 583496513 561829147
500.5 561829147 505039673 469492836 519771461 520990906 519125748 590540276 596894531 566216049
508.2 566216049 577247543 586992874 580531349 572388954 570953102 532481918 502118797 502456398
516E02456398j7557259j5348587J7044869J4802704r918938q745689m223099K8198547
523.7E06708946J6055336j6251945K6432152R844589j4001961j4295425j4378434k502746
531.4D97610512J0628433J9066696J3365631K0879135j0563697j7279663Q103408k3398399
539.1E18412056k5107002M762611K7655678j0089264l2836952Q591575Q389740K2292939
546.8E22071381J8764877j3405724r493255R38492J8616218J2796440N676003r694329
554.5E46270103k7692985k277832J3976517o135636n377884K5177117Q626365r460067
562.3E43105698L269310l583985p447929k1052399q736000K2312813P784843M380036
570E40032387N028190j1242332N436821O359329k3072243j7064399K702980L619880
$$ plain form
516 502456398 484899139 469550552 486595421 501398125 491479187 482733498 478510399 506708946
523.7 506708946 522764282 506512337 532944489 542789078 528787117 514491692 500113258 497610512
531.4 497610512 508238945 527305641 540671272 561550407 550986710 533707047 541810455 518412056
539.1 518412056 493305054 498067665 525723343 515634079 482797127 491388702 499778442 522071381
546.8 522071381 540836258 527430534 517937279 518875771 537491989 550288429 555964432 546270103
554.5 546270103 518577118 516299286 530275803 524140167 518762283 543939400 552565765 543105698
562.3 543105698 546375008 542791023 535343094 514290695 505554695 527867508 535652351 540032387
570 540032387 545060577 533818245 539255066 545614395 522542152 505477753 508180733 511800613
577.7E11800613O193009Q471832O016693M989815M58755j2889785j5179024j3784294
585.4D96077614n380516J3055649J0464286J0196991R783364r909478j1038475O408196
593.1E19657631M885445l6316J13830j4222488o445084K0146294J9788704j0771065
600.8E33116951k8407822R006272J7602920j365776k58713k7300758j8060989K857818
608.5D87189903j7042999p578926k926407r687347r127732j5739174k2059631j2279015
616.3C90748672J7853356J2568245o855164l645744m568329p387199m331398l640862
624C90741577r978218P660675K3802261J5273362J8604965J1770630N460815R842911
631.7D73178978o995201j130676P898559o454964q799438j1711998r854393o207085
$$ plain form
577.7 511800613 517993622 526465454 532482147 537471962 537930717 525040932 509861908 496077614
585.4 496077614 490697098 503752747 514217033 524414024 534197388 524287910 513249435 519657631
593.1 519657631 524543076 524506760 524620590 510398102 503953018 524099312 543888016 533116951
600.8 533116951 504709129 513715401 531318321 529952545 529693832 502393074 484332085 487189903
608.5 487189903 470146904 462567978 459641571 449954224 440826492 425087318 403027687 390748672
616.3 390748672 408602028 421170273 414315109 410669365 406101036 398713837 394382439 390741577
624 390741577 380763359 388424034 412226295 427499657 446104622 457875252 463336067 473178978
631.7 473178978 466183777 465053101 472951660 466496696 457697258 445985260 436130867 429923782
639.4D29923782j577491J8124694J6983109J9201889K8670921J2817612k900429j575203
647.1E19668884J1670227L135529p954483R333305J542473J415749J6169967J339569
654.8E56321220m972763p48901N910339R095459o317367j0273361l690415m73480J2585792
663.5E57436523K1710625K0172196J4627571R3307k2695312j2778359j1707191J962471
671.2E68821831K97432J302643R104194k651977j901970K01873j586380l0784P241859
679.9E80798721Q397293p51571M72069n73998j2056351j9898719K701911J7076302
687.6E76165657p6332j503601q84285M08249j851235k522812R88846p266159P14798
696.3E64173126l56941j0242043k52189L439064k017136k958107O514206J833649j4036217
$$ plain form
639.4 429923782 428346291 446470985 463454094 482655983 511326904 524144516 521244087 519668884
647.1 519668884 531339111 534474640 526520157 535853462 537395935 538811684 554981651 556321220
654.8 556321220 551348457 550599556 556509895 565605354 559287987 549014626 545324211 544850731 557436523
663.5 557436523 579147148 599319344 613946915 614040222 591344910 578566551 566859360 568821831
671.2 568821831 569119263 570421906 579526100 576874123 574972153 575174026 573587646 573556862 580798721
679.9 580798721 589196014 588444443 588916512 588342514 576286163 556387444 559089355 576165657
687.6 576165657 576089325 574585724 573701439 574109688 572258453 569735641 570724487 563458328 564173126
696.3 564173126 563816185 553574142 553321953 556761017 554743881 551785774 558299980 560133629 546097412
705E46097412r21593J4544297M224243m56925M097824n454597q660393M762764R523010
713.7E67756042L191414j287307O488418J2588501N100212K664261k663536o568642
721.4E87269363j632156p945938J375198J3114281P129745P853547o095200r288826
729.1E91780014P444038j288528n217857k741089j3180466j1206131l788795O812629
736.8E68613815J6568146J0547447O47736k993279m080772j0731239o471672K377014
744.5E74477196m97895L700867N576286Q175965J0468979N843124P027626J607742
752.2F16379890m96711J717033O078110L856621o990204k347641k373810Q28133O821861
760.9F23473282M518280P767830o25115j1897583o624756L051453k50015N580215J7993546
$$ plain form
705 546097412 545175819 559720116 563944359 563487434 567585258 562130661 553470268 558233032 567756042
713.7 567756042 570947456 569660149 576148567 588737068 593837280 596501541 593838005 587269363
721.4 587269363 585637207 577691269 579066467 592180748 599310493 607164040 601068840 591780014
729.1 591780014 599224052 597935524 592717667 589976578 576796112 565589981 561801186 568613815
736.8 568613815 585181961 595729408 596377144 593383865 589303093 578571854 572100182 574477196
744.5 574477196 573979301 577680168 583256454 591432419 601901398 607744522 614772148 616379890
752.2 616379890 615883179 617600212 623678322 627534943 620544739 618197098 615823288 616651421 623473282
760.9 623473282 627991562 635759392 635134277 623236694 616611938 619663391 619413376 624993591 642987137
769.6F42987137L084183j4576226r464950R45053m784279j001473J4963189J3703460
777.3F45856094m234619j8504181n56869J7621536J7838974J0078812o361924r311141
785F52426682l603592K017059J327896R38568K431336J900787J455231k098694M346313
793.7F61141586P70874k400741Q790359N104981j0064240j1448746L362885R148407
801.4F64405365Q804321q68149o605224J198273l77579K207413r449997q685379J2924499
810.1F63553543j394501q745041K734452p16706m746704n957489L201905O134796p510987
818.8F46553268L615876J0497207k014312J0727996P526322j9895477j8649827N369034
826.5F43730087J3964768r6131n072097j704026L66211o629104l482056M988327j2672119
$$ plain form
769.6 642987137 646071320 631495094 622030144 622975197 618190918 617189445 632152634 645856094
777.3 645856094 641621475 623117294 622560425 640181961 658020935 668099747 661737823 652426682
785 652426682 648823090 650840149 652168045 653106613 655537949 657438736 658893967 656795273 661141586
793.7 661141586 661912460 659511719 668302078 673407059 663342819 651894073 655256958 664405365
801.4 664405365 673209686 672341537 665736313 666934586 666557007 668764420 659314423 650629044 663553543
810.1 663553543 662159042 653414001 656148453 655431747 650685043 644727554 647929459 654064255 646553268
818.8 646553268 650169144 660666351 658652039 669380035 676906357 657010880 638361053 643730087
826.5 643730087 657694855 657598724 652526627 650822601 651188812 644559708 641077652 646065979 633393860
835.2F33393860j5496216m40597L910102r679794k4165001m410515J1381722K728309
842.9E97221870l877372o148568O26069K089500q455849m463768O710892R364204J1064415
851.6F04131393J551667p620735m593659J207771J0198479R595680J0135346J3410873
859.3F38016815P946396J052475m964447o71387L258591q81500j742172J216583L085022
868F46316376L320312N905609j611251r443131l264923j160126K125015J0047760J3366089
876.7F65601730P457962j3867187j9878082l866997L252983K237396k424545p413712
884.4F31099548j064644O922265J99356l788872J371002l655357o427918L839836P961884
893F36457100o131172q933373L348885L25050J961670M563065n321884l175660J302910
$$ plain form
835.2 633393860 617897644 617457047 621367149 611687355 587522354 583111839 594493561 597221870
842.9 597221870 593344498 587195930 587821999 589911499 581455650 576991882 583702774 593066978 604131393
851.6 604131393 605683060 598062325 593468666 594676437 604874916 614470596 624605942 638016815
859.3 638016815 645963211 647015686 642051239 641379852 644638443 643756943 642014771 643231354 646316376
868 646316376 649636688 655542297 653931046 644487915 641222992 640062866 642187881 652235641 665601730
876.7 665601730 673059692 659192505 639314423 635447426 638700409 640937805 638513260 631099548
884.4 631099548 630034904 636957169 637156525 633367653 634738655 631083298 624655380 628495216 636457100
893 636457100 630325928 621392555 624741440 625066490 627028160 631591225 626269341 623093681 624396591
901.7F24396591j449470j637650J784554j870385q307342l97530O460419J892548m16909
910.4F20454826o126632r968453j01394o32096m630546K002830k938614r941864r368362
919.1E78749695l717003J487846m416885n264969l701248j865654O387215J586227
926.8E69245224o369247k554284M032059J142120n945854J485024K498359m651336
934.5E58882065j395073k035217K240905Q647499N692673N837746O247597P137451
942.2E91255646K360039k362938N318794Q107643K904358Q89015K690620R17969j536484
950.9F10544662N77202K734223L252792M127426K367287k308312k497978n330429l740120
959.6F09726753K773171n75943p041893o109200J795654n702972j1056061j781387
$$ plain form
901.7 624396591 622947121 621309471 623094025 621223640 612916298 612518768 618979187 620871735 620454826
910.4 620454826 614328194 604359741 604258347 603626251 598995705 600998535 598059921 588118057 578749695
919.1 578749695 575032692 576520538 572103653 566838684 563137436 561271782 567658997 569245224
926.8 569245224 562875977 560321693 564353752 565495872 559550018 561035042 563533401 558882065
934.5 558882065 557486992 555451775 557692680 566340179 572032852 577870598 584118195 591255646
942.2 591255646 593615685 591252747 596571541 604679184 607583542 608472557 611163177 612081146 610544662
950.9 610544662 611121864 613856087 617108879 621236305 623603592 621295280 618797302 613466873 609726753
959.6 609726753 612499924 611923981 604882088 598772888 600568542 594865570 583809509 582028122
967.3E82028122j836014J724587M198455N72319k243843j859054K881317j93558k362213
976E82910118k553291j280136j539650m844818j937180K23160K503433r20792n756721
984.7E66804123l737831l110390l54042P23610o836433j0418930j671258J141816m153672
993.3E38386993j1803779j7132721q571968M86450P640343J0863304L647423j78528
1001.1E23337517K612915L419990L35312K50473k400589j706428k826844n769348Q38967
1009.7E18091965k362519l719978j283455l12767K159500k413025M22058k001075o125603
1018.4E02455101J2550q83979l195992l666649q919296r455605L12996P00608l431359
1027.1D73928375k761688k931175n60990l902473l493576k462196k367135L730965
$$ plain form
967.3 582028122 580192108 581916695 586115150 586687469 584443626 582584572 585465889 585272331 582910118
976 582910118 580356827 579076691 577537041 572692223 570755043 570978203 573481636 572560844 566804123
984.7 566804123 563066292 559955902 559601860 560325470 553489037 543070107 541398849 542540665 538386993
993.3 538386993 526583214 509450493 500878525 501364975 509005318 519868622 523516045 523337517
1001.1 523337517 525950432 529370422 529705734 529956207 527555618 525849190 523022346 517252998 518091965
1009.7 518091965 515729446 512009468 510726013 510413246 512572746 510159721 510581779 508580704 502455101
1018.4 502455101 502467651 501583672 498387680 494721031 485801735 476346130 476659126 477359734 473928375
1027.1 473928375 471166687 468235512 467674522 463772049 460278473 457816277 455449142 459180107
1034.8D59180107N02129l092232k234192k032967o07299J870422m03595o928520l264008
1043.5D42989845M272499K124634k50435N37110l978424r79844J956063j029129N71632
1052.2D46213951n37071K307701L381805J700516J327896M430466L285751n844040
1059.9D56266975j998291j250038j156387k093086n595589L98636J293297J096115
1067.6D46961632l216515j780128j931610m731980l50189L488960J2046852K29569
1075.3D50716591r286080n389976J908112P196350l568573k387658n334243l072739
1083D30781784J950226j879349L918839m69590O55098K119713n386658q326721k687797
1091.7D20675545k823754q772506n973778j2181778m399948l206558r957428m392357
$$ plain form
1034.8 459180107 459682236 456590004 454355812 452322845 451715546 453585968 453182373 446253853 442989845
1043.5 442989845 447262344 449386978 449136543 449673653 445695229 444715385 446671448 445642319 446213951
1052.2 446213951 445676880 447984581 451366386 453066902 454394798 458825264 462111015 456266975
1059.9 456266975 454268684 453018646 451862259 449769173 444173584 444572220 445865517 446961632
1067.6 446961632 443745117 441964989 440033379 435301399 434951210 438440170 450487022 450716591
1075.3 450716591 441430511 436040535 437948647 445144997 441576424 439188766 433854523 430781784
1083 430781784 432732010 430852661 434771500 434301910 434957008 437076721 431690063 423363342 420675545
1091.7 420675545 417851791 409079285 403105507 390923729 386523781 383317223 373359795 368967438
1099.4C68967438j4158669j2255974j0883751j1993255r513855r252262p821102j4556351
1107.1B78532219r985790j0177422p172108l965187j0505294o849480l729363m095211
1114.9B22052364n092868J680336J601009j175385j850471k222786O191616N187454
1122.6B26371269q72288m577846K030811L645611o04916K226315k540264k882557j422749
1131.2B21373386q8310j092510l147049l602257j943226N739403j633034p939987n879383
1139.9B01787033n364609o726360o599388j770153j915569k88201j681290J129818
1147.6A78571281N18055l501453J003475J880493K157078m409485l439312L073426
1155.4A75853558L466415M045849N148296M740238n95092M444999L323441r32102N024490
$$ plain form
1099.4 368967438 354808769 342552795 331669044 319675789 310161934 300909672 293088570 278532219
1107.1 278532219 268546429 258369007 251196899 247231712 236726418 229876938 226147575 222052364
1114.9 222052364 216959496 218639832 220240841 219065456 217214985 214992199 221183815 226371269
1122.6 226371269 225498981 220921135 222951946 226597557 225992641 228218956 225678692 222796135 221373386
1131.2 221373386 221285076 220192566 217045517 213443260 211500034 217239437 215606403 207666416 201787033
1139.9 201787033 196422424 189696064 183096676 181326523 179410954 179122753 177441463 178571281
1147.6 178571281 179089336 175587883 176591358 178471851 180628929 176219444 172780132 175853558
1155.4 175853558 179319973 183365822 188514118 193254356 192659264 197104263 200427704 199495602 204520092
1164B04520092O691723M390468L704358P673454L437652O195393R754772L776818O916256
1172.7B57060986P864513N893078P283916J0973225P776184M227085R191437J1298599
1180.4C21569023Q705864O464501P960472P834777R715691Q781090N176544O209908
1188.1C82417870M404907K508125K345429N619850N595970L748131N518150N026207
1195.9D17184639N018005J999016L302078R709359P962074K527504L401337M473762
1203.6D55577774J126747J336632K966461N607681L559609o54411L246879N698128
1211.3D78465500N066528J901741j610145k343064O72570N945282K425460l117981
1219D87405891j875343J225624J861229J291847N57366j135330n40429j394310j582222
$$ plain form
1164 204520092 211211815 215602283 219306641 226980095 230417747 236613140 246367912 250144730 257060986
1172.7 257060986 264925499 270818577 278102493 289075718 296851902 301078987 310270424 321569023
1180.4 321569023 330274887 336739388 344699860 352534637 362250328 371031418 376207962 382417870
1188.1 382417870 386822777 389330902 391676331 397296181 402892151 406640282 412158432 417184639
1195.9 417184639 422202644 424201660 427503738 437213097 445175171 447702675 451104012 455577774
1203.6 455577774 456704521 458041153 461007614 466615295 470174904 469520493 472767372 478465500
1211.3 478465500 483532028 485433769 483823624 481480560 482153130 488098412 490523872 487405891
1219 487405891 485530548 486756172 488617401 489909248 490466614 489331284 488790855 487396545 485814323
1227.7D85814323K52572j76850K598496L770904L96691J073303J39923k734108k68097
1236.4D90867157o82678n07584K576218J242866K399330M123612J416588j976700j168785
1245D98290024J282882O16799p12242j486778N62973R69123q82530P20940K030754
1253.7E01391945R61838j262322q14819L107147K737732j183319M4441o8626k365456
1262.4E02548561L08685K966614L211632J034088J040726J436958J165199J587296
1270.1E15299759m53301N09758l93333J118355M674873K527466J550484l38974N11474
1278.8E25006561K022171K726708L115463J083183L984490L270569J867523L721657
1286.5E46798325J430626R57107J681862N34363p88002J619987M950333K907715J073188
$$ plain form
1227.7 485814323 486066895 485890045 488488541 492259445 492656136 493729439 493869362 491135254 490867157
1236.4 490867157 490184479 489676895 492253113 493495979 495895309 500018921 501435509 499458809 498290024
1245 498290024 499572906 500189705 499477463 497990685 498553658 499522781 498640251 499361191 501391945
1253.7 501391945 502353783 501091461 500276642 503383789 506121521 504938202 504982643 504914017 502548561
1262.4 502548561 502857246 505823860 509035492 510069580 511110306 512547264 513712463 515299759
1270.1 515299759 514846458 515356216 514962883 516081238 520756111 523283577 524834061 524495087 525006561
1278.8 525006561 527028732 529755440 532870903 533954086 537938576 541209145 543076668 546798325
1286.5 546798325 548228951 549186058 550867920 551402283 550614281 552234268 557184601 560092316 561165504
1295.2E61165504L32413R93500N438042O797294J402741l716812n74875M450264M534797
1303.9E80822868J396523l50304K323685K193375l72086j976738L02315K774048l54348
1312.5E86759338j257705k326279J576920N547256J754379K183457J475792L258819
1320.3E98971977L354988k208976k880440k413521N0087Q00171K587509N230026M00849
1328.9F03892670j694489p39784p48901N11550K30866k98081O93665K019463K209625
1337.6F06076584m2725l70788o90918j610527q25463l279152N02625L334961j273995
1346.3F01820602q96720J016044K777939p82318l388176j41945j134300j935921j007385
1355E96327820k67296J266403L203850J673431Q00019Q43048j36795L563919m344635
$$ plain form
1295.2 561165504 561497917 562491417 567929459 574726753 576129494 572412682 571837807 576288071 580822868
1303.9 580822868 582219391 581869087 584192772 586386147 586014061 584037323 584339638 587113686 586759338
1312.5 586759338 585501633 583175354 584752274 590299530 592053909 594237366 595713158 598971977
1320.3 598971977 602326965 600117989 597237549 594824028 594874115 595674286 598261795 603491821 603892670
1328.9 603892670 602198181 601458397 600709496 601221046 601451912 601153831 601847496 603866959 606076584
1337.6 606076584 606033859 605663071 604972153 603361626 602536163 599257011 599759636 603094597 601820602
1346.3 601820602 600923882 601939926 604717865 603935547 600547371 600405426 599271126 597335205 596327820
1355 596327820 596060524 597326927 600530777 602204208 603004227 603847275 603710480 607274399 602929764
1363.7F02929764n881653j873016j760064J094170j949348J918869L212547l047562
1371.4E94643707k776718j696052M38804r96170k181396k550049j157990K962952K459373
1380.1E89146461L48816m084396j157379L077545j06468k220497l111229R37958L855896
1388.7E86686707K960128k15835j355820O56815L82347k1935m246101J282005L558235
1397.4E89686546J752625p49283p464867j1749J991577j223793J597176o78597j652031
1406.1E83247604N494j920243k283058o78253J180572J083336j2741l60298r67979
1414.8E79294434j642838r9831J72997j132851J10588k110214q04596M539719N821228
1423.4E84148636J80893N43976K128830k203255k166405L294869K246284j607208j110039
$$ plain form
1363.7 602929764 597048111 595175095 593415031 594509201 592559853 594478722 597691269 594643707
1371.4 594643707 591866989 590170937 590609741 589613571 587432175 584882126 583724136 586687088 589146461
1380.1 589146461 589495277 585410881 584253502 587331047 587224579 585004082 581892853 582830811 586686707
1388.7 586686707 589646835 589431000 588075180 588731995 589114342 589092407 584846306 586128311 589686546
1397.4 589686546 591439171 590689888 583225021 583213272 585204849 583981056 585578232 584899635 583247604
1406.1 583247604 583253098 581332855 579049797 578371544 579552116 580635452 580622711 580262413 579294434
1414.8 579294434 577651596 577551765 577724762 576591911 576702499 574592285 573787689 578327408 584148636
1423.4 584148636 584329529 584873505 587002335 584799080 582632675 585927544 588173828 586566620 585456581
1432.1E85456581j715279J288109L603325L537140R74083j688080J594238m64096q40530
1440.8E91745491K192040O16569j668663L70903L023033K231980n42222n547943l69529
1449.5E92051659M940300M666633N57289k959633J846428M025155N35087J296539J048584
1458.2F08008041R35746j430016p91244O22863L036042L797607r34219k005463R51843
1466.8F12191200L090821L475532K016296q12492l812714K282715P230454N648498
1474.6F31310310J320420j825676L963279L602562P31163J224404L501129J500473
1482.3F45328064j285019k34146P86133K040481P37686p98721L260727l267822n166092
1491F41401291K833710j167298m179077j133613K492332k521286j858597j112747O72836
$$ plain form
1432.1 585456581 583741302 585029411 588632736 592169876 593143959 591455879 593050117 592586021 591745491
1440.8 591745491 593937531 594554100 592885437 593256340 596279373 598511353 597969131 592421188 592051659
1449.5 592051659 596991959 601658592 602215881 599256248 601102676 605127831 605662918 606959457 608008041
1458.2 608008041 608943787 607513771 606722527 607345390 610381432 614179039 613244820 611239357 612191200
1466.8 612191200 615282021 618757553 620773849 619961357 616148643 618431358 625661812 631310310
1474.6 631310310 632630730 630805054 634768333 638370895 639102058 640326462 643827591 645328064
1482.3 645328064 644043045 643808899 644595032 646635513 647373199 646574478 649835205 646567383 641401291
1491 641401291 644235001 643067703 638888626 637755013 640247345 637726059 635867462 634754715 635427551
1499.6F35427551J830368j044960j303444j971778Q22601r06410k3590928P31087Q255882
1508.3F18249969P64809j207199l014k490806m774513q81844m78592Q82301m794693
1517F05266418o496887M600983O331177K484436m667893l989677k156906l34626k676429
1525.7E98360596J019287J128044K7847J776810k42615N26810l8262p299461n844536
1534.3E89414520M380722J895829l026696m505806o045570K447014K651710J951752
1542.1E89163475j016693J194496J94016n519829q2093K12403J589165K845077K8992
1550.7E88609009L141823K922935J242676j874542j087380K630234N868645J816139
1558.5F03269539l8442154J6829681J8475724M146537L61061K09389L52898j177139
$$ plain form
1499.6 635427551 637257919 636212959 634909515 632937737 633760338 632853928 609263000 609994087 618249969
1508.3 618249969 619014778 617807579 617804565 615313759 610539246 609657402 609178810 610061111 605266418
1517 605266418 598769531 603370514 609701691 612186127 607518234 603528557 601371651 601037025 598360596
1525.7 598360596 599379883 600507927 600535774 602312584 602069969 602596779 602558517 595259056 589414520
1534.3 589414520 593795242 595691071 592664375 588158569 582112999 584560013 587211723 589163475
1542.1 589163475 588146782 589341278 589535294 584015465 583933372 584145775 585734940 588580017 588609009
1550.7 588609009 591750832 594673767 595916443 594041901 592954521 595584755 601453400 603269539
1558.5 603269539 564827385 581657066 600132790 604279327 604640388 604849777 605202675 604025536
1566.2F04025536J044540K756920j997872n782394O307716M576378j388893l086128
1573.9F06455803j131935J432724j345444j99776l36074j163216p24754k291527q78639
1582.6E99817162j294823j260376k239838l098297j516456l533516j496010l30773
1590.3E85047073k131881k067795o06651j614037m657936m082413l537521l171654
1598E63177185l275108j124497k491569k866364j764145l153343j364097k786141j916351
1606.7E42435570l416023m026528k541199l349685o93398j917915l312683l381424
1614.4E19796715J007843L196182o349831n749626l628006p15103l962211j254158
1622.1E02341805j215249n425644N72663q73184P78312k716369k278557j746254l870964
$$ plain form
1566.2 604025536 605070076 607826996 605829124 600046730 606354446 610930824 609541931 606455803
1573.9 606455803 605323868 606756592 605411148 605211372 604875298 603712082 602987328 600695801 599817162
1582.6 599817162 598522339 597261963 595022125 591923828 590407372 586873856 585377846 585047073
1590.3 585047073 582915192 580847397 580240746 578626709 573968773 569886360 566348839 563177185
1598 563177185 559902077 558777580 556286011 553419647 551655502 548502159 547138062 544351921 542435570
1606.7 542435570 539019547 534993019 532451820 529102135 528408737 526490822 523178139 519796715
1614.4 519796715 520804558 524000740 517650909 511901283 508273277 507558174 503595963 502341805
1622.1 502341805 501126556 495700912 496273575 495400391 496178703 493462334 491183777 489437523 485566559
1630.8D85566559k095680r36470J410522j838722j930390J678963J091614k683525
1638.5D80262871l086395K18620q49648P97043q60290N00106L12691l362694J230240
1647.2D75162544O37512M414826J560669K503548L003921L33481m856453O94885L697930
1655.9D87152863K533416M259529O96373L83454J92070J52855L728294L93181L212471
1664.5E02704506K154465K122383J752548K162132P463799P42912R04083N29290L748474
1673.2E24284592L813743K193566m56772J158867M998283K597694L887978L261528
1680.9E45739479J057320N644111J3647042l949433p960396N164948K947922M107818
1688.6E66398811N525856K738953N309830K848510Q32291K986221N975571L817864
$$ plain form
1630.8 485566559 483470879 482534409 483944931 482106209 480175819 481854782 482946396 480262871
1638.5 480262871 477176476 477395096 476545448 477342491 476482201 476982307 477294998 473932304 475162544
1647.2 475162544 475800056 480214882 481775551 484279099 487283020 487616501 482760048 483454933 487152863
1655.9 487152863 489686279 493945808 494642181 495025635 495217705 495370560 499098854 499492035 502704506
1664.5 502704506 504858971 506981354 508733902 510896034 518359833 519102745 520006828 520536118 524284592
1673.2 524284592 528098335 530291901 529835129 530993996 535992279 538589973 542477951 545739479
1680.9 545739479 546796799 552440910 566087952 562138519 554178123 559343071 562290993 566398811
1688.6 566398811 571924667 574663620 579973450 582821960 583654251 586640472 592616043 596433907
1696.4E96433907K396011N714416M649048M578324N189361L706017M108314K983055
1704.1F29758453K413559N041085J602287J642914M895858L657914K943954J976624
1711.8F53932648L590011M153290k3880K318649L722840N105896j701050k503128K229690
1720.5F70824966K564469L666153J706543L45764J881256M33807o80999J930236M921875
1729.1F87594070J9379j461639K578201Q17490m557419r526520P253799P911606M506302
1737.8F95135269L636170j399002l006287K084656K325439K550202J359405K888565
1745.5G05574417K398148O09512L049698M568634M194412Q79440l367691P74537K221145
1754.2G20902252K871552L258972p48367R41696L691177J496048P38907p67822N410919
$$ plain form
1696.4 596433907 598829918 604544334 609193382 613771706 618961067 622667084 626775398 629758453
1704.1 629758453 632172012 637213097 638815384 640458298 645354156 649012070 651956024 653932648
1711.8 653932648 657522659 661675949 661652069 663970718 667693558 672799454 671098404 668595276 670824966
1720.5 670824966 673389435 677055588 678762131 679107895 680989151 681422958 680741959 682672195 687594070
1729.1 687594070 687613449 686151810 688730011 689547501 684990082 675463562 682717361 690628967 695135269
1737.8 695135269 698771439 697372437 694366150 696450806 698776245 701326447 702685852 705574417
1745.5 705574417 707972565 708582077 711631775 716200409 720394821 721274261 717906570 718681107 720902252
1754.2 720902252 723773804 727032776 726284409 727226105 730917282 732413330 733152237 732384415 737795334
1762.9G37795334M095154l133469k074432K291107M595184q87832q73185K167664k08664
1771.6G43766861j34888l947067K255020M525604K65885O79474J601028J425324j117859
1780.3G49319382j865158J37176K204361M694748J841583k357254j628875L72543O4773
1788.9G52783279o37741N59464J859207l58276r84650K681732J477204k80381J275177
1797.6G58375015Q01621j098480o80314J217957j588135j583481L836289M049454j970749
1806.3G61359177k445908N95551J752548J155395k594070J51520J188202L29361J773986
1815G63265762K85035j25046p50656J221466K700958J66778j071472k137680N24903
1823.7G64080048K471847l241043k302322M289398M173202j011734l643341R40094
$$ plain form
1762.9 737795334 741890488 738757019 736682587 738973694 743568878 742681046 741807861 743975525 743766861
1771.6 743766861 743631973 739684906 741939926 746465530 746731415 747410889 749011917 750437241 749319382
1780.3 749319382 747454224 747591400 749795761 754490509 756332092 753974838 752345963 752718506 752783279
1788.9 752783279 752145538 752705002 754564209 754205933 753221283 755903015 757380219 757099838 758375015
1797.6 758375015 759176636 758078156 757397842 758615799 757027664 755444183 759280472 763329926 761359177
1806.3 761359177 758913269 759508820 761261368 762416763 759822693 759974213 761162415 761491776 763265762
1815 763265762 763550797 763425751 762675095 763896561 766597519 766764297 765692825 763555145 764080048
1823.7 764080048 766551895 763310852 761008530 765297928 769471130 768459396 764816055 765756149
1831.4G65756149L508835Q90122j889267j715546J58462L12806l24021K236176J253280
1840.1G70186996j0910J80054J704712L98712p047195R07516K141953M28467J731338
1848.7G70621643J957321L97263j928177L4866J148453M13437R87320j48010j157990
1857.4G72326126n0201p04117k039032J28937J657028K955627J707154j762467j349411
1866.1G72869644k82135R45740J14670k952500J9837K011032m04740j09558J258622
1874.8G73470612P6980P18384N10025J035843o77567k305603J496582K231369J40992
1883.4G76697617r35517n6000n82656L26385K249374l42483k510147l016434r84955
1892.1G70845184P94831M69207J285553P11975J650544J966400J983j622161p89643
$$ plain form
1831.4 765756149 769264984 770155106 768265839 766550293 766708755 767021561 766697540 768933716 770186996
1840.1 770186996 770176086 770356140 772060852 772459564 765412369 766319885 768461838 768890305 770621643
1848.7 770621643 772578964 772976227 771048050 771082916 772231369 772644806 773632126 773484116 772326126
1857.4 772326126 772275925 771571808 769532776 769661713 771318741 774274368 775981522 774219055 772869644
1866.1 772869644 772587509 773533249 773647919 770695419 770715256 772726288 772321548 772211990 773470612
1874.8 773470612 773547592 774265976 774776001 775811844 775134277 772828674 774325256 776556625 776697617
1883.4 776697617 775762100 775706100 775123444 775449829 777699203 777356720 774846573 771830139 770845184
1892.1 770845184 771640015 772109222 773394775 774106750 775757294 777723694 777725677 776103516 775313873
1900.8G75313873p60498k02255K534256J01929n69763K25601L41034P97500j832733
1909.5G75948944n44205J023865j23596n38101k87857j000138k79464K612991O03104
1918.2G77415543j624070q56323M98352J702423j864929k641144r29718M42734J940842
1926.8G74083710K06680l19366L08227m03824K72217R62677j2436n99060J34125J77231
1936.5G74810181j027985K40936J306382L0441q40378j074600L50723Q02612P65686
1945.2G75363998m49905j417084l18603K975J058045R84573n10712k429657n55725
1953.8G71727905L727341Q37097k164917p41424J59683m55399n50918P81860J075745
1962.5G74396973m73481j053237L88412m93927n47333n09109q07114R32770j28403
$$ plain form
1900.8 775313873 774553375 774351120 776885376 776987305 776417542 776643143 776984177 777781677 775948944
1909.5 775948944 775404739 776428604 776305008 775766907 775479050 774478912 774199448 776812439 777415543
1918.2 777415543 775791473 774935150 775433502 777135925 775270996 772629852 771700134 772142868 774083710
1926.8 774083710 774290390 773971024 774279251 773875427 774147644 775110321 775097885 774498825 774632950 774810181
1936.5 774810181 773782196 774023132 775329514 775359955 774519577 773444977 773795700 774598312 775363998
1945.2 775363998 774914093 773497009 773178406 773181381 774239426 775223999 774713287 772283630 771727905
1953.8 771727905 775455246 776292343 774127426 773386002 773545685 773090286 772539368 773321228 774396973
1962.5 774396973 773923492 772870255 773258667 772764740 772217407 771708298 770901184 771833954 771705551
1971.2G71705551O05698P53555L83988K68554l556671j126633K225037J18408q37021
1979.9G70540466P89261K568512K90756k598571j085816M74014o86721j54953M01916
1988.6G70538864o03027j00861N61371O22025P24639q0337k883072k779999p44018
1997.2G65255585K06909J095505J396331J883545l26233n86242J41296j668472j68991
2005.9G67229233O39038O85806J001434Q04215q7891k524566k024613J357193K972794
2014.6G70052643q17566k283630o27060j495896N54581J377945m79508p82394R49402
2023.3G66448517K389297M06494j109466j493530n22385n03006k133865m61350M26865
2032G63447571J296692K437362m9591j242981j318283n24521l61633j670380O49109
$$ plain form
1971.2 771705551 772311249 773064804 773448792 773717346 770160675 769034042 771259079 771377487 770540466
1979.9 770540466 771329727 773898239 774188995 771590424 770504608 770978622 770291901 770136948 770538864
1988.6 770538864 769935837 769834976 770396347 771018372 771743011 771662674 768779602 765999603 765255585
1997.2 765255585 765462494 766557999 767954330 769837875 769511642 768925400 769066696 767398224 767229233
2005.9 767229233 767868271 768554077 769555511 770359726 770271835 767747269 765722656 767079849 770052643
2014.6 770052643 769235077 766951447 766324387 764828491 765383072 766761017 766281509 765499115 766448517
2023.3 766448517 768837814 769244308 768134842 766641312 766118927 765615921 763482056 763020706 763447571
2032 763447571 764744263 767181625 767132034 765889053 764570770 764046249 763684616 762014236 762663345
2040.6G62663345O10352m18625K350464J377487p86591M05198o32706k939987j800690
2049.3G60828247n94253j1979L22190J405868J630478j469345j66626Q14591j1902
2058G62747269Q0032j074905R46960l05862o62766P99637p92389J039429J21536j799698
2067.6G61099243j078567l27607L20893n58167j067428k12632O49262J6937N09567
2076.3G59351501M1810j653290j444245p11212N15290O22711M34189j248093j041184
2085G54867477J087647j63040q01392j364136j476364j647186n16663J786423J057129
2093.7G52829895J568451Q92105k45666Q19549j67007r18579L93600M65546j145630
2102.4G54492264o11420R75647O38886k0447J075287P46765l5935J305619J58691k28119
$$ plain form
2040.6 762663345 763273697 762855072 765205536 766583023 765796432 766201630 765568924 762628937 760828247
2049.3 760828247 760233994 760222015 760544205 761950073 763580551 762111206 761944580 762759171 762747269
2058 762747269 762827301 761752396 762699356 762393494 761730728 762530365 761737976 762777405 762898941 761099243
2067.6 761099243 760020676 759693069 760013962 759455795 758388367 758175735 758824997 758841934 759351501
2076.3 759351501 759393311 757740021 756295776 755584564 756099854 756722565 757156754 755908661 754867477
2085 754867477 755955124 755792084 754990692 753626556 752150192 750503006 749986343 751772766 752829895
2093.7 752829895 754398346 755290451 755044785 755864334 755697327 754778748 755172348 755637894 754492264
2102.4 754492264 753880844 754856491 755495377 755474930 756550217 757296982 757261047 758566666 758725357 758497238
2112G58497238l64685j515732R93042J362763o81381l1205N7450k05765O04858j164551
2121.6G57552032j706161M40750N72205r54743p72247J750336J208114m91180k101746
2130.3G55497360j723404J613770J201858l5476j539612R68857L530197j230087k239609
2139G56043854j91803J664047J564636q0948k4261m88663K46506M23813j014252j221313
2148.6G56921616Q47931N70449j02615P46460l78418J018982O04553m98352o23245
2157.3G59107361k022934J046066K247162j18103m26712O88858M33731j251144j325150
2166G58379135N92804J413879l56979n00183j9073l94211j839600j454468K838898
2174.7G58660202K260819j116562j501999J76773K249222J239776j128464k29339L34015
$$ plain form
2112 758497238 758132553 756616821 757609863 758972626 758291245 758260040 758317490 758111725 758716583 757552032
2121.6 757552032 755845871 756286621 756858826 755904083 755131836 756882172 758090286 757599106 755497360
2130.3 755497360 753773956 755387726 756589584 756554108 755014496 755983353 759513550 758283463 756043854
2139 756043854 755852051 757516098 759080734 758999786 758975525 758486862 758733368 759157181 758142929 756921616
2148.6 756921616 757769547 758339996 758237381 758983841 758605423 759624405 760228958 759730606 759107361
2157.3 759107361 757084427 758130493 760377655 760259552 759832840 760521698 760955429 759704285 758379135
2166 758379135 758971939 760385818 760028839 759528656 759509583 759115372 757275772 755821304 758660202
2174.7 758660202 760921021 759804459 758302460 758479233 760728455 761968231 760839767 760610428 760944443
2183.4G60944443j337891J30615n17196p50122K002182M07180j337890j827545j30158
2192G57583618J793747J247711R86939L99322K8229k12021n05981k75727K053299J274567
2201.7G64373703j243896m50898m26635J523666J329880p86743q0338M10004J52435
2210.4G64801178l49426O42395j202469j493683J716690J307526M80499K38876j66320
2219G65975266r14002m39987N71136j51062k39410R77020R79309j436157j510696o5689
2228.7G63745728J2054l23334n96924m01764J295014K253342j250306j635131Q07495
2237.4G63906174J882400J496964j370087j221008m73786M91333K17743j492386m93698
2246G62943649n90286K91290K47574J25961K054215Q70590j284561j179428Q07648
$$ plain form
2183.4 760944443 759606552 759737167 759219971 758469849 760472031 760879211 759541321 757713776 757583618
2192 757583618 759377365 760625076 761612015 762011337 762039566 761827545 761321564 761045837 763099136 764373703
2201.7 764373703 763129807 762678909 762252274 763775940 765105820 764319077 764238739 764648743 764801178
2210.4 764801178 764451752 765094147 763891678 762397995 764114685 765422211 765902710 766141586 765975266
2219 765975266 765061264 764621277 765192413 765041351 764801941 765778961 766758270 765322113 763811417 763745728
2228.7 763745728 763757782 763434448 762837524 762435760 763730774 765984116 764733810 763098679 763906174
2237.4 763906174 765788574 767285538 765915451 764694443 764220657 764711990 764929733 763437347 762943649
2246 762943649 762353363 762644653 762892227 763018188 765072403 765942993 764658432 763479004 764286652
2254.7G64286652M82940q36105K51770J575165R86252j048661p53936N7220j342621
2263.4G63658676j346054P15027J973572J475372j568603j724854P46765O44760J276169
2272.1G65850830p13501j626511J82496r84955k57187Q68912J351165J219712J5487
2280.8G65906448k31247J02234J140442J071320o14853k481384q37403R98917M89654
2289.4G65544128R66568M18549n24979l62320j4572j176071j59607J081467k86255
2298.1G65486908L2120j217118l44925N00336j31378J782684k82135j313629J29700
2306.8G64642563k18582M04205j46408k055130r9640K278137K97852p83386N10101
2315.5G64829712K312622L4866l204422j663513J013947j044541m513778J057434L346634
$$ plain form
2254.7 764286652 764769592 763933487 764185257 765760422 766746674 765698013 764944077 765001297 763658676
2263.4 763658676 762312622 763027649 765001221 766476593 764907990 763183136 763929901 764574661 765850830
2272.1 765850830 765137329 763510818 763693314 762708359 762451172 763320084 764671249 765890961 765906448
2280.8 765906448 765675201 765777435 766917877 767989197 767374344 764892960 764055557 765054474 765544128
2289.4 765544128 766510696 766929245 766404266 766041946 766027374 764851303 764691696 765773163 765486908
2298.1 765486908 765519028 764301910 763956985 764457321 764325943 766108627 765826492 764512863 764642563
2306.8 764642563 764423981 764828186 764681778 762626648 762527008 764805145 765102997 764319611 764829712
2315.5 764829712 767142334 767177200 763972778 762309265 763323212 762278671 757764893 758822327 762168961
2324.2G62168961J84249j183319R6588K450181k724076P98416N136032K393952M93927
2332.8G69814911k222901n21469k005005O89240Q64716m777146l871002j7776M767913
2341.5G62721481J581116O15082J743698K5101r36585k095413Q81195J418533p83767
2350.2G65170441j793442M7989O68258J230927K796631O63910j4572j562348K541657
2358.9G69749451M363632m149628j0860672m251327O655349K294999K593841M956284
2366.6G71351929J103439k148514l514175n50842J724090K049866n96619J21231r36813
2375.3G68603592k204666M91409q58688Q10699L042755J473847p72095j562576o25000
2383.9G68399277j81732J110229J57929j445694o50406R82818J350174P79877L47595
$$ plain form
2324.2 762168961 762353210 761169891 761266479 763716660 760992584 761791000 766927032 769320984 769814911
2332.8 769814911 767592010 767070541 765065536 765754776 766619492 761842346 757971344 757953568 762721481
2341.5 762721481 764302597 764917679 766661377 766686478 765749893 763654480 764535675 765954208 765170441
2350.2 765170441 763376999 763424988 764093246 765324173 768120804 768784714 768770142 767207794 769749451
2358.9 769749451 774113083 769963455 759102783 754851456 761506805 763801804 766395645 771351929
2366.6 771351929 772455368 770306854 766792679 766241837 767965927 770015793 769419174 769540405 768603592
2375.3 768603592 766398926 766890335 766031647 766842346 769885101 771358948 770586853 769024277 768399277
2383.9 768399277 768217545 769327774 769485703 768040009 767389603 768372421 769722595 770502472 770850067
2392.6G70850067j822052q30688K63137k88543O55975K03171O09207j23825k210083
2401.3G67306366j340637J467056R72824j305237r85946J24054J885528J092377j19095
2410G69097290m56238j823883j353454m0741J722793K93884j278839P37229J026535
2418.7G67924576n1422r67102j40152J572952J308670p96204k496719j714096J11465
2427.3G64751968P55616L94134K60849k89078n62133m92020l47443K43759P50885O59791
2437G66126328r07212j241226R5673Q30764L14103j49918j135254k031784J016693
2445.7G62918167J949234j61743q16269o08063R28650P69196m81873r17434o45371
2454.3G62934494j39465k95563q8959j46026l64075L06473J062393p80182k612686
$$ plain form
2392.6 770850067 769028015 768197327 768460464 768171921 768827896 769031067 769640274 769516449 767306366
2401.3 767306366 765965729 767432785 768405609 767100372 766114426 766238480 768124008 769216385 769097290
2410 769097290 768641052 766817169 765463715 765422974 767145767 767439651 766160812 766898041 767924576
2418.7 767924576 767873154 766906052 766765900 768338852 769647522 768851318 766354599 764640503 764751968
2427.3 764751968 765507584 765901718 766162567 765873489 765311356 764819336 764471893 764715652 765466537 766126328
2437 766126328 765219116 763977890 764073563 764904327 765218430 765068512 763933258 761901474 762918167
2445.7 762918167 764867401 764705658 763889389 763281326 764209976 764979172 764497299 763579865 762934494
2454.3 762934494 762795029 762499466 762410507 762264481 761900406 762206879 763269272 762489090 759876404
2463G59876404j017151J445846J428605p02286j375733p72705J096115N10712j729431
2471.7G58760376M80423K047272Q55255r95331j147079m75235j571045j22528J311340
2480.4G59143448q75092j189193n9586r18503P18003K189102K46734j492691q30688
2489.1G56931534J920242n65262l113174m35257K289123J972123k346573p69120J565934
2497.7G57449570j321717j293716o96564o5384O12259P95746Q24585Q85620P58896
2506.4G57949295j566238j420823R27277k42386j937027k27356N24979L12881N87311
2515.1G54907913n07431k60391L9291p91092j254196j33590K133102J641846j103134
2523.8G54672318j068497R51233n55268j539688k70004K83432K61383n79987l47671
$$ plain form
2463 759876404 758859253 760305099 761733704 761031418 759655685 758882980 759979095 760489807 758760376
2471.7 758760376 759240799 761288071 762143326 761147995 760000916 759525681 757954636 757832108 759143448
2480.4 759143448 758268356 757079163 757019577 756101074 756819077 759008179 759254913 757762222 756931534
2489.1 756931534 758851776 758286514 755173340 754738083 757027206 758999329 756652756 755883636 757449570
2497.7 757449570 756127853 754834137 754137573 754072189 754684448 755480194 756304779 757190399 757949295
2506.4 757949295 756383057 754962234 755889511 755647125 753710098 753482742 754007721 754320602 754907913
2515.1 754907913 754400482 754140091 754179382 753388290 752134094 752000504 754133606 755775452 754672318
2523.8 754672318 753603821 754555054 753999786 752460098 752190094 752473526 752734909 752154922 751807251
2532.5G51807251k92664O97174R03016m32587m01764k002335k093200M96750K461242
2541.1G51142883J458435n64499l44848l83377o05545k36817Q05970l4256q83484l72849
2550.8G49981613k12097J273575j11389p04346Q52737l83377j531524n09186Q24966
2559.5G49480972j311722j221847J492920K10571j020584J146469K022324o50406r40476
2568.1G49208221j129608q79135J677017J82114j136551o97937k33230r16o97556j2207
2577.8G46280212K1134j06583k89078r26361o19506Q51287K498246k45591k331466
2586.5G45132294l31269L0442P42492Q96302j022339j599884o87256J014557R689j073761
2596.1G43111267j62659n68313J029358O13174j680450J27563P24030j128006k182007
$$ plain form
2532.5 751807251 751514587 752211761 753114777 752682190 752280426 750278091 748184891 748681641 751142883
2541.1 751142883 752601318 752036819 751691971 751308594 750703049 750466232 751272202 751237946 750354462 749981613
2550.8 749981613 749769516 751043091 750931702 750227356 751080093 750696716 749165192 748656006 749480972
2559.5 749480972 748169250 746947403 748440323 748650894 747630310 748776779 750799103 750148697 749208221
2568.1 749208221 748078613 747199478 748876495 749058609 747922058 747224121 746990891 746989975 746292419 746280212
2577.8 746280212 746301346 746194763 745905685 744979324 744359818 745211105 747709351 747463760 745132294
2586.5 745132294 744801025 744831467 745573959 746470261 745447922 743848038 743160782 744175339 744185028 743111267
2596.1 743111267 742948608 742380295 743409653 744022827 742342377 742469940 743193970 742065964 739883957
2604.8G39883957l68500J233444o3552n02701j30539K78015K24533P56531J60675j469956
2614.4G40001907o2713o03104q16116L3493l15705K258606L36609k104339R8419l26843
2624.1G38500214p37839p25403K34299Q93783k594K18506q97445q13981k17666j195297
2633.7G35256577j922913L15704K643128j582489j727600J650390K71912K60010p52106
2642.4G34412613j285095M98047r74350p50428J135178j118012j817474n34J42136
2651.1G30242081J32599K82745R70611L34397n54047k42996K25906Q24280j074905
2659.8G31140671j265183l82538l74603Q7433j070175r0561L26157j173478r22546
2668.4G26275177K90680M30450R6589J323165r8190j946335j308288l92762K86866
$$ plain form
2604.8 739883957 739515457 740748901 740685349 740182648 740052109 740330124 740554657 741311188 741471863 740001907
2614.4 740001907 739939194 739336090 738519974 738553467 738237762 740496368 740832977 738728638 738827057 738500214
2624.1 738500214 737762375 737036972 737271271 738165054 738162460 738380966 737483521 736669540 736451874 735256577
2633.7 735256577 733333664 733649368 736292496 734710007 732982407 734632797 734904709 735164719 734412613
2642.4 734412613 733127518 733625565 732651215 731900787 733035965 731917953 730100479 730099945 730242081
2651.1 730242081 730374680 730657425 731628036 731962433 731408386 731165390 731391296 732215576 731140671
2659.8 731140671 729875488 729492950 729118347 729205780 728135605 728045044 728371201 727197723 726275177
2668.4 726275177 726565857 726996307 727092896 728416061 728317871 726371536 725063248 724670486 724957352
2677.1G24957352O89315R34220k2812n20020j600570m47388J132660k65427K50855
2685.8G25108185q23822j402893m01459l59268P3852l77350l86734L25013J975021
2694.5G23730545O19659j903305j005706J64795L71093Q7891Q85620n97610j787949
2703.1G20565033p91626o43921M97971N90439m54178j859360l96805Q74558k32315
2711.8G18149796l14866k006073p0190J464310j16806m45023j538238L75595J266403
2720.5G16764908K37503N42450J69372o5612j465149j737976l97568j023407o58722
2729.2G12365799Q79593j66092p0343K91595j203155m05350O77796N97915p79724j078186
2738.8G11109848J0529k82975J10703m82330m01917m00085j291809j43891j024246
$$ plain form
2677.1 724957352 725646667 726580887 726558075 726038055 724437485 723990097 725122757 724857330 725108185
2685.8 725108185 724284363 722881470 722480011 722120743 722194595 721817245 721430511 721755524 723730545
2694.5 723730545 724350204 722446899 721441193 721605988 721977081 722064972 722950592 722352982 720565033
2703.1 720565033 719773407 719129486 719627457 720217896 719763718 717904358 717507553 718382111 718149796
2711.8 718149796 717834930 715828857 715758667 717222977 717106171 716661148 715122910 715498505 716764908
2720.5 716764908 717002411 717544861 717714233 717648621 716183472 714445496 714047928 713024521 712365799
2729.2 712365799 713245392 713079300 713008957 713300552 712097397 711692047 712369843 712967758 712188034 711109848
2738.8 711109848 711120377 710837402 710948105 710465775 710063858 709663773 708371964 708228073 707203827
2747.5G07203827o38962J242447N89600P62252K53296q84399m02069k71607p92541
2756.2G07061844n37415M24729k21176p81861O26755l18222j934204o98548K61689
2764.9G03883591J01242l61252r26209m58374M03595q1329r42078r29946M12750J829910
2774.5G02931900K85950k519303k138443R07517N11398q11691M81033m84390j290360
2783.2F97873611q71124N0202P51724j46027R1019o943j92642j000824j493835j016922
2792.8F94038239j476288n78537q49991k02484J506500r03168k320709P47910J688842
2801.5F91650314j420364j533203p26471n03540K29339j044921l50571Q89511p74841
2810.2F86415253k127076q78219n21622j575699q89434l94974L76434R24072N45349
$$ plain form
2747.5 707203827 706564865 707807312 708396912 709159164 709412460 708528061 708125992 707854385 707061844
2756.2 707061844 706524429 706949158 706727982 705946121 706572876 706254654 704320450 703621902 703883591
2764.9 703883591 703984833 703623581 702697372 702238998 702642593 702561264 701619186 700689240 701101990 702931900
2774.5 702931900 703217850 700698547 698560104 699467621 699979019 699167328 699648361 699163971 697873611
2783.2 697873611 697002487 697052689 697804413 697658386 697749405 697742462 697549820 696548996 695055161 694038239
2792.8 694038239 692561951 691983414 691133423 690930939 692437439 691534271 689213562 689961472 691650314
2801.5 691650314 690229950 688696747 687970276 687466736 687696075 686651154 686300583 687190094 686415253
2810.2 686415253 684288177 683409958 682888336 681312637 680423203 680028229 680404663 681328735 681874084
2818.9F81874084l05252j292343j152954j367264o69326m11606j042938r70459q83637
2827.6F73778305J13754j96380q64868j79444k18200M1732N61219q46940k061767k500992
2837.2F67626419l290863j546478O8588J34964n75790k338715j476898p95365j120071
2845.9F56685791j902008m208374l651962j991349j218261m64402j157684j011352
2853.6F41080399R2620j259498j664581R27734J161613m93126q72726J34277Q95272
2862.3F40001984o2905m03099r78966j882400j251144j841736k901001j084366J476364
2870.9F31072731j54724k107926m51049m15078r91L51028j356583Q622R25903j134110
2880.6F26737823k426834p2326N21087k771301j65710J445198k485199j867638P32460
$$ plain form
2818.9 681874084 681568832 680276489 679123535 677756271 677086945 676675339 675632401 674661942 673778305
2827.6 673778305 673892059 673695679 672830811 672651367 672433167 672474899 673036118 672189178 670127411 667626419
2837.2 667626419 664335556 662789078 662857666 662992630 662416840 660078125 658601227 657805862 656685791
2845.9 656685791 654783783 650575409 646923447 644932098 643713837 643249435 642091751 641080399
2853.6 641080399 641173019 639913521 638248940 639176674 640338287 639845161 638972435 639106712 640001984
2862.3 640001984 639939079 639535980 638557014 636674614 635423470 633581734 630680733 629596367 631072731
2870.9 631072731 630918007 628810081 628359032 627943954 627942963 628293991 626937408 626946030 627871933 626737823
2880.6 626737823 624310989 624238663 624759750 621988449 621822739 623267937 620782738 618915100 619647560
2889.3F19647560k04239j356430l39622o07491n97229n52978j874428q80623j017723
2897.9F12216797j479874j99737j146088j248054J695289J223107j229706j520386
2905.7F08311348l027039j412811J467743K06642j126327q52280l21655j996842m34265
2914.3F00814514K098465m45022k155076k107963o86264P553o72379j705970k119713
2923E93028145r21898q49075N45158O1417o88248J981583R86747j513557j038933J12801
2932.7E91704140K98614P99904J84708Q21190K116584r71183n91698J414223M1618
2941.3E95818100m80843J020127K555618n71899j143074J94778j278267J64375p71751
2950E95507164q35876N74951J06277K486687N28984j426163n37033j462974o94580
$$ plain form
2889.3 619647560 619443321 618086891 617747269 617139778 616542549 615989571 614115143 613234520 612216797
2897.9 612216797 610736923 610537186 609391098 608143044 609838333 611061440 609831734 608311348
2905.7 608311348 605284309 603871498 605339241 605545883 604419556 603567276 603245621 601248779 600814514
2914.3 600814514 602912979 602467957 600312881 598204918 597518654 597526207 596853828 595147858 593028145
2923 593028145 592106247 591257172 591802330 591863747 591175499 593157082 594143829 592630272 591591339 591704140
2932.7 591704140 592002754 592802658 592987366 593808556 595925140 594953957 594362259 595776482 595818100
2941.3 595818100 595337257 596357384 598913002 598341103 597198029 597392807 596114540 596278915 595507164
2950 595507164 594671288 595246239 595352516 597839203 598368187 596942024 596404991 594942017 594247437
2958.7E94247437p29599R63859J561394n60951n06630L31497K217102M25148r93652
2967.4E96955605J693649K121658q3961n82733K384567P96509o73752J324653R88655
2976.1F04924850J814042J196212J329995J484336L92800J904526N21850m36668J077881
2984.7F14209824L10020r83353J802559L393784O9809J138153K142525L50914k33269
2993.4F22200966j556549P76901J967735j214142o10504J877480J512413q42056j481133
3002.1F22631111L51639j011009k475395J101646K729111J34887j307258l95241N34172
3010.8F22293663J469421J506577p95555k270279j440315N15937R80263K77977p50618
3019.5F21787071j811790q51631L23867Q92487k5711j109772j47667O63300M38766
$$ plain form
2958.7 594247437 593517838 594481697 596043091 595482140 594975510 595307007 597524109 597949257 596955605
2967.4 596955605 598649254 600770912 600686951 600104218 602488785 603285294 602611542 603936195 604924850
2976.1 604924850 606738892 607935104 609265099 610749435 611142235 613046761 613568611 613131943 614209824
2984.7 614209824 614519844 613536491 615339050 618732834 618802643 619940796 622083321 622434235 622200966
2993.4 622200966 620644417 621421318 623389053 622174911 621564407 623441887 624954300 624112244 622631111
3002.1 622631111 622982750 621971741 619496346 620597992 623327103 623461990 622154732 621759491 622293663
3010.8 622293663 623763084 625269661 624474106 622203827 620763512 621279449 622259712 622537689 621787071
3019.5 621787071 619975281 619123650 619447517 620340004 620314293 619204521 619056854 619720154 620158920
3028.1F20158920j004181j932869k012405j52168J548576l98102j152572l60642O6757
3036.8F14761314m36554q38737L17993k86102j455689j089821j29432M42734j6594
3045.5F11269112r44138j791153j187935K10915N569p87048j308594j235580J06888
3054.2F04338036j69602L22533J129494j436387j645355k081604k234993J874047K032318
3062.9F02128487p95212n09072m58107j478042p15332J65939J025963j18294k306289
3071.5E96940041n4932P29980p39669j657792k304611k96097O62156P51915O33163
3080.2E94664154j466103j535835l3569n59387j334877q06122o7978N15633M27665
3088.9E89803581l49159j474380j103020l57895J31531P49321j091652r43451M93126
$$ plain form
3028.1 620158920 619154739 617221870 615209465 615057297 616605873 616207771 615055199 614694557 614761314
3036.8 614761314 614324760 613486023 613804016 613517914 612062225 610972404 610842972 611285706 611269112
3045.5 611269112 610324974 608533821 607345886 607556801 607562370 606775322 605466728 604231148 604338036
3054.2 604338036 604168434 604490967 605620461 604184074 602538719 600457115 598222122 600096169 602128487
3062.9 602128487 601333275 600824203 600366096 598888054 598172722 598338661 599364624 599246330 596940041
3071.5 596940041 596885109 597615089 596875420 595217628 592913017 592616920 593279076 594030991 594664154
3080.2 594664154 593198051 591662216 591628647 591069260 589734383 588928261 588860283 589375916 589803581
3088.9 589803581 589454422 587980042 586877022 586519127 586650658 587399979 586308327 585364876 585858002
3097.6E85858002k4262q17337j916771l13453J649170q8883k814293k235985q77189
3106.2E78418999M5051R24111p15638n42907n58548j320496j196327q15544N33905
3114.9E74772606r90143r65462l33480j36834N54924r33761j560402k816239j282577
3123.6E66308632n6114N95817K725983J0223j731796k596931j522599Q5526j492729
3132.3E62326012q87223q55140m235Q7052j106987j95236p52564j741295k068062m49409
3141.9E54352913l51486j646576M19502N646j368141j55716O7978j000481k048416
3150.6E48275223j136437p50923j395988j211815k082939j121636q1062k35252O17790
3159.3E40876961k9946j59111j501388l120384k077294p01980N91507o78902j673393
$$ plain form
3097.6 585858002 585833740 585016403 583099632 582786179 584435349 584346466 581532173 579296188 578418999
3106.2 578418999 578464050 579388161 578672523 578129616 577571068 576250572 575054245 574238701 574772606
3114.9 574772606 573782463 572817001 572483521 572346687 572901611 571967850 570407448 567591209 566308632
3123.6 566308632 566252518 566848335 569574318 569584541 567852745 565255814 563733215 563818741 562326012
3132.3 562326012 561438789 560583649 560579414 560666466 559559479 559364243 558611679 556870384 554802322 554352913
3141.9 554352913 554001427 552354851 552774353 552779999 551411858 551256142 551324120 550323639 548275223
3150.6 548275223 547138786 546387863 544991875 543780060 541697121 540575485 540494423 540259171 540876961
3159.3 540876961 540847015 540687904 539186516 536066132 533988838 533286858 533878365 533199463 531526070
3168E31526070j338082n41420O11077L19404l91845j720391q34656j345329j549911
3176.6E24734917M23698k110596j882934k34680n45006Q392m95109r49440j901665
3185.3E17047577q13942K33765j134034j056518j299400j449433O26831L93334j568795
3194E10979385j005363k422218k353516J64375q77800o8092K11334j882858j163941
3202.7E01581306L61748l45840j734810m23927Q21724l7766j417999j676903n33676
3211.4D96593857l98178j397858k807617j513138N15900p23191l81736N20057q72154
3220D89535942o79626j106453j090432K84806j765061j986465m89922j118774r36585
3228.7D80647430o86531Q58231K063751p59353l196297j635361o25114P9422J322517
$$ plain form
3168 531526070 530187988 529646568 530257645 530577049 530185204 528464813 527630157 526284828 524734917
3176.6 524734917 525158615 523048019 521165085 520930405 520385399 520393791 519898682 518949242 517047577
3185.3 517047577 516233635 516467400 515333366 514276848 512977448 511528015 512154846 512548180 510979385
3194 510979385 509974022 507551804 505198288 505362663 504484863 504416771 504628105 502745247 501581306
3202.7 501581306 501943054 501597214 499862404 499438477 500260201 500222435 498804436 497127533 496593857
3211.4 496593857 496195679 494797821 491990204 490477066 490992966 490269775 489888039 490408096 489535942
3220 489535942 488856316 487749863 486659431 486944237 485179176 483192711 482702789 481584015 480647430
3228.7 480647430 479960899 480819130 482882881 482123528 478927231 477291870 476666756 476746178 478068695
3237.4D78068695r44214k149200j934166r32121j48697j524926M57879J305389l59993
3246.1D71838646j844788k380600j221199j513481P13997R13467j052780m21028o58607
3254.8D64373627M00200l91732j508445j016236j187782Q5869p92313k342872j473237
3263.4D56147079J181374K009392q96645j494560j253433j537171N04685P59735j842270
3272.1D53578186j179352J712265K23007j674499q09898q76084j305160r31588l99360
3280.8D48337517K0218n5657q95843n53780J61629j160240j738320j377639J63993
3289.5D42901878R87168j367417l21846J513901l53165j137466n70374o42204k035980
3298.2D38974495j586571O14853M86717p68737m07677J8387r52072o34766q05817n81894
$$ plain form
3237.4 478068695 477124481 474975281 473041115 472108994 471960297 470435371 470893250 472198639 471838646
3246.1 471838646 469993858 467613258 466392059 464878578 465592575 466506042 465453262 465032234 464373627
3254.8 464373627 464773827 464382095 462873650 461857414 460669632 460755501 459963188 457620316 456147079
3263.4 456147079 457328453 459337845 458441200 456946640 455693207 454156036 454660721 455420456 453578186
3272.1 453578186 452398834 454111099 454334106 452659607 451849709 450973625 449668465 448736877 448337517
3280.8 448337517 448357735 448302078 447406235 446852455 447014084 445853844 444115524 442737885 442901878
3289.5 442901878 443889046 442521629 442199783 443713684 443360519 442223053 441652679 441010475 438974495
3298.2 438974495 437387924 438002777 438489494 437720757 437313080 437331467 436379395 435744629 434938812 434356918
3307.8D34356918J679k117233j114083O60858L53203j07727q44383m05426j510887
3316.5D29272919j168022P19871o96983j961098j789284j553039j214562m33006j20125
3325.2D21056671L36151J360131N34362q42132j424408j515618j752967j375389J84097
3333.8D16560898n63698j505661M39644K47383k046089r82857K25868j545448j214409
3342.5D09615631M29192r64928j869659p90787q94509o63719P7286j273880k046585
3351.2D01618042j184540j169853o83670k47612k30026M69055j137772k110595p34673
3359.9C94588356M61121R78279j585007k259560q99658j276855r77249r13964l42331
3368.6C87773132j676063j998635N75219r68666n68924J973991r460j835061j637039
$$ plain form
3307.8 434356918 434358597 432241364 431127281 431788139 432141342 432033615 431189232 430783806 429272919
3316.5 429272919 428104897 428824768 428127785 426166687 424377403 422824364 421609802 421176796 421056671
3325.2 421056671 421392822 422752953 423287315 422445183 421020775 419505157 417752190 416376801 416560898
3333.8 416560898 415997200 414491539 414931183 415178566 413132477 412149620 412375488 410830040 409615631
3342.5 409615631 410044823 409079895 407210236 406419449 405524940 404861221 404938507 403664627 401618042
3351.2 401618042 400433502 399263649 398579979 398332367 398102341 398571396 397433624 395323029 394588356
3359.9 394588356 395049477 396027756 394442749 392183189 391283531 390006676 389029427 388115463 387773132
3368.6 387773132 386097069 384098434 384673653 383704987 383136063 385110054 385100594 383265533 381628494
3377.2C81628494j668663p42340m63524j978149o53381N82046l40729q32061j808472
3385.9C73723221j144867l11051J450j33133r25407J04255R5101k14119K0447o02494
3395.6C70613403l54004o2255j62163j561775k158318m85649l76015o3629P26700J56059
3405.2C66272354m39415j100731k86751L24326m72794p85560j160660r0103N78155
3413.9C62838821k60658r66720j071625Q76465Q97522q42095k19192R44404m67605
3422.6C61729317j515122J261826N40275q42170J594505l66669n81131J765633q46405
3431.2C62740059j032906J99547j115150k99836M52958O16493L87001j718140j354408
3439.9C58875618J218910J498184q9874K28577N66177P7934M70925m07829J068267
$$ plain form
3377.2 381628494 379959831 379217491 378753967 376775818 376122437 376704483 376363754 375531693 373723221
3385.9 373723221 372578354 372267303 372268753 372135620 371210213 371314468 371409569 371195450 371215897 370613403
3395.6 370613403 370259399 370197144 370034981 368473206 366314888 365829239 365453224 365389595 366116295 366272354
3405.2 366272354 365832939 364732208 364445457 364769783 364296989 363511429 362350769 362260666 362838821
3413.9 362838821 362578163 361611443 360539818 361416283 362313805 361471710 361252518 362196922 361729317
3422.6 361729317 360214195 361476021 362016296 361174126 362768631 362401962 361820831 363586464 362740059
3431.2 362740059 361707153 361906700 360791550 360491714 360944672 361561165 361948166 360230026 358875618
3439.9 358875618 360094528 361592712 361502838 361731415 362297592 362375526 362846451 362438622 363506889
3448.6C63506889K016793M46548K98996K5559Q83750Q11615n9585L59688o829P98836
3458.2C69082260Q06732k07367R7046K12937N21316J168404M12025O74858J521492
3466.9C74289703n26390n83381J07879l46260J175423K182197J583443N17960Q08868
3475.6C79209442P86820K5634l38554K16789J337433R26132J209297o93321r76524
3484.3C81703148Q73222O51169K746239J532783N56946K060051m81338l56293R15870
3493C90201797P76215J003494l51333j290055J816559L219605K19154R66263K626190
3501.6C99187889Q93822j31531J003227J446190l51906O2332K265511J193695j118812
3510.3D04450417J332588K188339p82204L3608J284179J183930J151733M0970N89218
$$ plain form
3448.6 363506889 365523682 365970230 366269226 366294785 367178535 367990150 367930565 368290253 368283424 369082260
3458.2 369082260 369888992 369681625 369778671 369991608 370512924 371681328 372093353 372768211 374289703
3466.9 374289703 373763313 373179932 373287811 372941551 374116974 376299171 377882614 378400574 379209442
3475.6 379209442 379996262 380021896 379683342 379900131 381237564 382163696 383372993 382679672 381703148
3484.3 381703148 382576370 383227539 385973778 387506561 388063507 390123558 389642220 389285927 390201797
3493 390201797 390978012 391981506 391630173 390340118 392156677 395376282 395595436 396561699 399187889
3501.6 399187889 400081711 399950180 400953407 402399597 402047691 402110023 404375534 405569229 404450417
3510.3 404450417 405783005 407971344 407189140 407222748 408506927 409690857 410842590 410883560 411472778
3519D11472778J414681J329269O57311l68386l08761K09579J521416K402534K077561
3527.7D20407982J596298J215477J531906k52456r76639J541404K423096K984772J217499
3536.4D31689339j840973m56810K026024K424621J66092J612015L113403j40991k318153
3545D36274567P32612M323807R23347J279908J632118p65038R49822J133041K615090
3553.7D49099274O77452j093979J716804K470627K038880k13852N16357J577606K504998
3562.4D59294167J802978r34410L929405M914818J191483J8234N76248K069244J37291
3571.1D72999458J641083J270104J241035K541924J471595K597504J547470K24800
3578.8D85534973j33247J657181K705268J671334J017112O38428K785607J73149p0191
$$ plain form
3519 411472778 412887459 414216728 414874039 414505653 414196892 414406471 415927887 418330421 420407982
3527.7 420407982 422004280 423219757 424751663 424499207 423522568 425063972 427487068 430471840 431689339
3536.4 431689339 429848366 429391556 431417580 433842201 434008293 435620308 438733711 438592720 436274567
3545 436274567 437007179 441330986 442254333 443534241 445166359 444401321 445351143 446484184 449099274
3553.7 449099274 449776726 448682747 450399551 452870178 454909058 454695206 455211563 456789169 459294167
3562.4 459294167 461097145 460162735 464092140 469006958 470198441 470216675 470792923 472862167 472999458
3571.1 472999458 474640541 475910645 477151680 479693604 481165199 483762703 485310173 485534973
3578.8 485534973 485401726 487058907 489764175 491435509 492452621 493091049 495876656 496049805 495979614
3587.5D95979614L533936R08508J984062L668099N046806J357803n09834J672096L45307
3596.1E13986397N516472L961525j689377R71451K194023L049354J935730K42386J465721
3604.8E31633682L245850M796676K180405K900047J624108r13391N893898M102859
3612.5E55464134l692322l00140K558403N467224K412071Q52662N093040J243172N70831
3621.2E69669075K727356O59294q49762L544121N671883L711814P390595L609428p885780
3629.9E88248024L341598L742600K750092K134323K149620M088859L478813P1831n60264
3638.6F09445496K194442L354531L057098q58955k83394M335441N704766P305336L324089
3647.3F37578850J482429P310639L11355o928062k855454M067116L871994N382004
$$ plain form
3587.5 495979614 499513550 500422058 502406120 506074219 511121025 512478828 511968994 513641090 513986397
3596.1 513986397 519502869 523464394 521775017 522746468 524940491 527989845 529925575 530167961 531633682
3604.8 531633682 534879532 539676208 541856613 544756660 546380768 545467377 551361275 555464134
3612.5 555464134 551771812 551471672 554030075 559497299 561909370 562762032 567855072 569098244 569669075
3621.2 569669075 572396431 573055725 572205963 575750084 581421967 585133781 592524376 596133804 588248024
3629.9 588248024 591589622 595332222 598082314 600216637 602366257 606455116 609933929 610005760 609445496
3638.6 609445496 611639938 614994469 618051567 617192612 616909218 621244659 626949425 634254761 637578850
3647.3 637578850 639061279 646371918 646683273 639755211 636899757 640966873 644838867 650220871
3655F50220871N939026n992813J266861K898864j80664L339997L571167L617096K12707
3663.6F64893112J4420J390533l36380M647217L728027K39029J514511o890640K582398
3672.3F71782227Q014679P425918J991425j1440354O23932M656449L043975p27844
3680F85370407M65241K426147K325363P32498j946182n2261N312958Q438110p127152
3688.7F95945129m577865R365234o367416m239273L048324O50711K984543k3804k106170
3697.4F94679413Q35800K180862K126236R12857l287277k84118M935150R54971m15497
3706.1G02638397L36533L655319O113968r688492Q12836R119491q735275N70984K898560
3714.8G07722321J471405J567764N41611J121368j440125l71398M984512n87540m609146
$$ plain form
3655 650220871 656159897 650167084 651433945 654332809 654152145 657492142 661063309 664680405 664893112
3663.6 664893112 664907532 666298065 665961685 670608902 674336929 674575958 676090469 669199829 671782227
3672.3 671782227 679796906 687222824 689214249 677773895 678397827 683054276 686098251 685370407
3680 685370407 685835648 688261795 690587158 691319656 689373474 689321213 694634171 703072281 695945129
3688.7 695945129 691367264 700732498 694365082 690125809 693174133 693824844 696809387 696785583 694679413
3697.4 694679413 695515213 697696075 699822311 700735168 697447891 697163773 702098923 703053894 702638397
3706.1 702638397 702974930 706630249 712744217 703055725 703868561 712988052 704252777 704823761 707722321
3714.8 707722321 709193726 710761490 711303101 712424469 710984344 710612946 715597458 715009918 710400772
3723.4G10400772L023834K09809m0818k477493j439972N301743K710113M538574j190185
3732.1G21036377o404419R783096L464127j2376404n680389K45514L021392L010102
3739.8G16099396K643814l424225J227264J2175751p092590j8244782R636307N922012
3747.5G18942947P798157J703110j0136795Q633117m093475j0330658N200196N205459
3755.3G22922058K116242o376191N69153P057800m202194l282165M023666J04141n35049
3763.9G22397461L957214l846893m504089N382919N598755R89609p178650j268845
3771.7G21527481K892609l0365k947083q46634J557541j03760K908402K145462n912705
3780.3G21190948M45099K864075Q54645j006546m216538k10495J809693j07346M87671
$$ plain form
3723.4 710400772 713424606 713634415 713593597 711116104 709676132 714977875 717687988 722226562 721036377
3732.1 721036377 714631958 724415054 727879181 715502777 709822388 710067902 713089294 716099396
3739.8 716099396 718743210 715318985 716546249 728722000 721629410 703384628 713020935 718942947
3747.5 718942947 726741104 728444214 718307419 726940536 722847061 712516403 717716599 722922058
3755.3 722922058 725038300 718662109 719231262 726289062 722086868 718804703 722828369 722932510 722397461
3763.9 722397461 726354675 722507782 718003693 723386612 728985367 729974976 722796326 721527481
3771.7 721527481 724420090 724389725 721442642 720596008 722153549 722049789 724958191 727103653 721190948
3780.3 721190948 721636047 724500122 725354767 724348221 720131683 719921188 721730881 721623535 722111206
3789G22111206K05460K79541J76391K98538K890931L197097J294022m840546m935226
3797.7G20677414L663711M757157J589966m779892p301712K460937K256165K213211
3805.4G25536957P934112m387512q327789L845978J817245j45950P4005o11649M4861
3814.1G25780258M447479K373658j3730469j54343L595124M382553K324829j5060120
3821.8G13958969J592789N662689L275070M067383J119537m521331k534485O71234
3829.5G23291855L284225K659684q001252P77970R380493k933884l443680N125504
3837.2G30140915j0759964l277054Q888626k114029K72675M801483k242889k177887
3844.9G23531876K367248j007004k727203L289642K021866K177582P375183r87244
$$ plain form
3789 722111206 722316666 722596207 722772598 723071136 725962067 729159164 730453186 725612640 720677414
3797.7 720677414 724341125 729098282 730688248 725908356 718606644 721067581 723323746 725536957
3805.4 725536957 733471069 729083557 720755768 724601746 726418991 726273041 726347046 725735397 725780258
3814.1 725780258 730227737 732601395 718870926 718716583 722311707 726694260 729019089 713958969
3821.8 713958969 715551758 721214447 724489517 728556900 729676437 725155106 722620621 723291855
3829.5 723291855 726576080 729235764 721234512 722012482 731392975 728459091 725015411 730140915
3837.2 730140915 719380951 716103897 724992523 722878494 723151169 727952652 725709763 723531876
3844.9 723531876 725899124 724892120 722164917 725454559 727476425 729654007 737029190 736041946
3852.7G36041946P115937j5423966j2400970O922455J074066j349106R97772J850052
3860.4G24828186L092117l472595N77774O208115o268006q214263K438964O477051
3868.1G25667343P257691q140488r742279L416900P768631M782563j0040055J199570
3875.8G22169876M394455j145172O25992M007263k526627o742172N755768J2054k490158
3884.5G24061279L770676r369965L60947K392960j440888K397309J019973l968506
3892.2G19223785O93436J953278j446381K160034K595368M560775L326798j0727005
3899.9G22340088L915787K432251n628586K386322k774582R12399l13644k693634j424179
3908.6G19152222j24588K454910p9193J245651K451706m90952j477584J116943j80969
$$ plain form
3852.7 736041946 743157883 727733917 715332947 722255402 723329468 721980362 722978134 724828186
3860.4 724828186 727920303 724447708 725025482 731233597 724965591 716751328 719190292 725667343
3868.1 725667343 732925034 724784546 715042267 718459167 726227798 731010361 720970306 722169876
3875.8 722169876 726564331 725419159 726045151 730052414 727525787 720783615 726539383 726551437 724061279
3884.5 724061279 727831955 718461990 718822937 721215897 719775009 722172318 723192291 719223785
3892.2 719223785 719917221 721870499 720424118 722584152 725179520 729740295 733067093 722340088
3899.9 722340088 726255875 728688126 723059540 725445862 722671280 723583679 723270035 720576401 719152222
3908.6 719152222 719027634 721482544 721403351 722649002 725100708 724609756 723132172 724249115 724068146
3917.3G24068146l412094K908249J045455k637405J331329J390076J101914k287369
3925G23508301k570648J775360K744369O91300k805405J99051J930084k536926j988449
3933.7G20947037P6r93271J81275J975555j57547j191254n10482J982040L153534m041596
3943.3G21345367k132034J441498L80020J529694p12815J429291Q05969k718277J438523
3952G22807236J299591j93711r64202j387635j052780o16608J172410M71267J739426
3960.7G23274994J238480k761078l141709o66961K663650J413422j063309n09949K64283
3969.3G20711823Q0108M54712O51779j48544j654739k222748K468796K209472j869507
3978G20681152K55280J025619n56488m53415J073304J461868R64127j606904k575073
$$ plain form
3917.3 724068146 720656052 723564301 724609756 721972351 723303680 724693756 725795670 723508301
3925 723508301 720937653 722713013 725457382 726148682 723343277 723542328 725472412 722935486 720947037
3933.7 720947037 720947113 719953842 720135117 722110672 721953125 720761871 720251389 722233429 725386963 721345367
3943.3 721345367 719213333 720654831 721034851 722564545 721851730 723281021 724086990 721368713 722807236
3952 722807236 724106827 723913116 722948914 721561279 720508499 719891891 721064301 721535568 723274994
3960.7 723274994 724513474 721752396 718610687 717943726 720607376 722020798 720957489 720447540 720711823
3969.3 720711823 720791931 721246643 721898422 721749878 720095139 717872391 720341187 722550659 720681152
3978 720681152 720936432 721962051 721405563 720952148 722025452 723487320 724451447 722844543 720269470
3986.7G20269470J066666M76913K61917l70407j783600Q70209p0190l87268m3640j294098
3996.3G18995972j12992J052323R33990M68979
4000.2G21338272
$$ plain form
3986.7 720269470 721336136 721813049 722074966 721704559 719920959 720791168 720720978 720333710 720290070 718995972
3996.3 718995972 718882980 719935303 720869293 721338272
4000.2 721338272
##END=$$ End of the data block
