##TITLE=$$ Begin of the data block
##JCAMP-DX=5.00 $$ ACD/SpecManager v 10.08
##SPECTROMETER/DATA SYSTEM=Varian
##DATE=07 Jan 2013 10:45:56
##DATA TYPE=INFRARED SPECTRUM
##DATA CLASS=XYDATA
##ORIGIN=
##OWNER=
##NPOINTS=3735
##FIRSTX=399.26403809
##LASTX=4000.35498047
##MAXX=4000.35498047
##MINX=399.26403809
##MAXY=96.77109528
##MINY=16.76446342
##XFACTOR=1.0000000000
##YFACTOR=0.000000100000000
##FIRSTY=30.27518082
##DELTAX=0.96440572
##XUNITS=1/CM
##YUNITS=TRANSMITTANCE
##XYDATA=(X++(Y..Y))
$$ plain form
399.3 302751808 369143372 964522247 967710953 759095001 603426895 564312859 621901093
406 621901093 605866356 633038368 657164536 589593353 557627220 571595535 567217751 530174866
413.7 530174866 488169060 430939751 440198975 484895363 433345337 476170425 600602913
420.5 600602913 629587669 670466156 648676529 504552307 396007309 534331436 709985962
427.2 709985962 615193062 512660713 522603912 513648911 564291229 606304474 540521469 480159264
434.9 480159264 527224236 616579285 598905029 543080482 492652817 425365562 439257584
441.7 439257584 500914230 513134346 591605835 664037933 643772278 545295563 509713097
448.4 509713097 507545052 513423653 577053566 611671066 555444641 489772110 517044868 611172371
$$ packed form
399.3C02751808O6391564N95378875L188706k08615952j55668106l9114036N7588234
406F21901093j6034737K7172012K4126168o7571183l1966133J3968315m377784l7042885
413.7E30174866m2005806n7229309R259224M4696388n1550026M2825088J24432488
420.5F00602913K8984756M0878487k1789627j44124222j08544998J38324127J75654526
427.2G09985962r4792900j02532349R943199q955001N0642318M2013245o5783005o0362205
434.9D80159264M7064972Q9355049j7674256n5824547n0427665o7287255J3892022
441.7D39257584O1656646J2220116P8471489P2432098k0265655r8476715l5582466
448.4E09713097k168045N878601O3629913L4617500n6226425o5672531K7272758R4127503
$$ plain form
456.2 611172371 625483742 609227104 549066772 496015663 510841675 517914391 525407028 514169159
463.9 514169159 494319229 453237076 437202759 531136894 614811401 647858276 597996178
470.6 597996178 537626762 548330879 566466827 556302986 532237396 510103607 511726303 564187355
478.3 564187355 597020493 592315063 590001221 521913414 448469315 504289856 612345085 585961914
486.1 585961914 528608284 501329117 446702080 453527565 493466911 495469933 527641830 580578766
493.8 580578766 610601158 573902664 509588776 503673706 553017960 568849602 542158394 512508354
501.5 512508354 472115517 488152542 530894699 526082916 507507935 511228523 518956871 511372719
509.2 511372719 510131340 516538467 523208694 567594337 615258217 595295525 545005722 502162514
$$ packed form
456.2F11172371J4311371j6256638o0160332n3051109J4826012P072716P492637j1237869
463.9E14169159j9849930m1082153j6034317R3934135Q3674507L3046875m9862098
470.6E97996178o0369416J0704117J8135948j0163841k4065590k2133789J622696N2461052
478.3E64187355L2833138m705430k313842o8087807p3444099N5820541J08055229k6383171
486.1E85961914n7353630k7279167n4627037O825485L9939346K003022L2171897N2936936
493.8E80578766L0022392l6698494o4313888n915070M9344254J5831642k6691208k9650040
501.5E12508354m0392837J6037025M2742157m811783j8574981L720588P728348p584152
509.2E11372719j241379O407127O670227M4385643M7663880j9962692n0289803m2843208
$$ plain form
516.9 502162514 504462891 541703796 580232735 583556404 518482704 460784683 481121407 530768738
524.6 530768738 530276909 522616844 558836670 541866531 504441528 505325775 490685692 496031418
532.4 496031418 514159203 510143814 533719330 548633881 506427193 470904350 459931602 459752617
540.1 459752617 474492683 495875969 507893677 501125259 507443390 535631332 553784027 543013687
547.8 543013687 505967293 491966362 523130074 554954147 548870430 535191841 548525581 546153870
555.5 546153870 526938095 512627640 505988083 514664268 516744652 518498344 534636345 540407333
563.2 540407333 521973076 506721954 515131302 528723412 528666992 518670273 526690903 549637032
570.9 549637032 559926453 565085602 563730278 547323189 528252907 510718384 505117722 511903572
$$ packed form
516.9E02162514K300377L7240905L8528939L323669o5073700n7698021K0336724M9647331
524.6E30768738m91829p660065L6219826j6970139l7425003Q84247j4640083N345726
532.4D96031418J8127785m015389K3575516J4914551m2206688l5522843j0972748j78985
540.1D59752617J4740066K1383286J2017708o768418O318131K8187942J8152695j0770340
547.8E43013687l7046394j4000931L1163712L1824073o083717j3678589J3333740k371711
555.5E46153870j9215775j4310455o639557Q676185K080384J753692J6138001N770988
563.2E40407333j8434257j5251122Q409348J3592110n6420r996719Q020630K2946129
570.9E49637032J0289421N159149j355324j6407089j9070282j7534523n600662O785850
$$ plain form
578.6 511903572 510358505 505186653 512331886 511809578 500302200 498192329 509864502 519511490
586.4 519511490 522476311 522689362 532164459 556152878 560697517 547604370 541222191 524876862
594.1 524876862 516346016 528431549 533505325 518094177 490223961 482308617 505281448 516834984
601.8 516834984 511286926 519900360 527774544 521626701 511220856 493464775 483454666 482099800
609.5 482099800 464070206 428868484 407986946 405295601 398125420 396190109 401761398 415512657
617.2 415512657 432517738 431850090 436728210 427291832 395828857 392239914 394971008 386329498
624.9 386329498 388791733 407206306 439011688 459447479 456974678 460433083 479756203 479409447
632.7 479409447 459947662 446405067 439586296 437205811 436032143 449105949 464936867 457655640
$$ packed form
578.6E11903572j545067n171852P145233n22308j1507378k109871J1672173R646988
586.4E19511490K964821K13051R475097K3988419M544639j3093147o382179j6345329
594.1E24876862q530846J2085533N073776j5411148k7870216p915344K2972831J1553536
601.8E16834984n548058Q613434P874184o147843j0405845j7756081j0010109j354866
609.5D82099800j8029594l5201722k0881538k691345p170181j935311N571289J3751259
617.2D15512657J7005081o67648M878120r436378l1462975l588943K731094q641510
624.9C86329498K462235J8414573L1805382K0435791k472801L458405J9323120l46756
632.7D79409447j9461785j3542595o818771k380485j173668J3073806J5830918p281227
$$ plain form
640.4 457655640 438814735 432638435 449897041 492896996 536308670 538717918 534916267 533711929
648.1 533711929 528345718 550984573 553259888 533792915 538017540 553818665 553837547 535640564
655.8 535640564 540036964 556838531 568129692 574589272 565619011 566666183 567296982 551727905
663.5 551727905 557383842 587798729 610931206 628043365 581532555 544399757 556753883 564010544
671.2 564010544 559816856 565770378 580010223 586725235 588730125 586024323 567011223 564213333
678.9 564213333 578229637 581988220 589730492 583316727 565603828 557551918 559193878 575319138
686.7 575319138 582170372 571698532 563926086 570932465 577654839 567132912 572220726 585572014
694.4 585572014 574516296 566749153 574208183 578453903 574443169 565314522 552786674 546121368
$$ packed form
640.4D57655640j8840905o176300J7258606M2999955M3411674K409248l801651j204338
648.1E33711929n366211K2638855K275315j9466973M224625J5801125J8882j8196983
655.8E35640564M396400J6801567J1291161O459580q970261J047172O30799j5569077
663.5E51727905N655937L0414887K3132477J7112159m6510810l7132798J2354126P256661
671.2E64010544m193688N953522J4239845O715012K004890k705802j9013100k797890
678.9E64213333J4016304L758583P742272o413765j7712899q051910J641960J6125260
686.7E75319138O851234j0471840p772446P006379O722374j0521927N087814J3351288
694.4E85572014j1055718p767143P459030M245720m010734r128647j2527848o665306
$$ plain form
702.1 546121368 554987030 557811584 547208824 540898590 537627907 541412773 550772667 560937920
709.8 560937920 571799812 576450844 571835175 564997253 578746719 593207626 582559357 578894234
717.5 578894234 594890327 607077522 602421265 599346237 599950638 590748100 585091248 579675102
725.2 579675102 571983414 576423798 583147278 584639130 599298744 612527237 602662315 590426292
733 590426292 583814430 580977058 571458817 565250816 578775864 587635536 590659180 596679344 600638962
741.6 600638962 595309792 588478050 591588020 589255447 582488365 583451538 602225571 614044304
749.3 614044304 606724739 613195190 616042671 612054214 620955009 633723640 635431938 624610710
757.1 624610710 620758286 624593620 631246414 633891907 629458771 623003426 621830254 632342377
$$ packed form
702.1E46121368Q865662K824554j0602760o310234l270683L784866R359894J0165253
709.8E60937920J0861892M651032m615669o837922J3749466J4460907j0648269l665123
717.5E78894234J5996093J2187195m656257l075028O04401r202538n656852n416146
725.2E79675102p691688M440384O723480J491852J4659614J3228493r864922j2236023
733E90426292o611862k837372r518241o208001J3525048Q859672L023644O020164L959618
741.6F00638962n329170o831742L109970k332573o767082R63173J8774033J1818733
749.3F14044304p319565O470451K847481l988457Q900795J2768631J708298j0821228
757.1F24610710l852424L835334O652794K645493m433136o455345j173172J0512123
$$ plain form
764.8 632342377 635331726 631263084 631174049 633090057 636116714 633335228 627448502 628031654 633205566
773.5 633205566 636284065 640408630 640149918 642233658 646999969 637254715 629781799 631943779 639644737
782.1 639644737 648523636 655338287 661445465 658875504 653465347 653564987 659496307 658627701 659857788
790.8 659857788 664489899 660166397 659123001 646428146 642894669 664621658 675565948 669192963
798.5 669192963 654585648 645874481 642494202 640927658 652637100 669377594 667214584 658017502
806.2 658017502 663157730 661506805 660961685 666538849 664222717 664809647 660785904 655205307 653172302
814.9 653172302 645316925 641759491 655502777 667342300 665248642 667492447 656817856 645368271
822.6 645368271 654126968 649030914 647936401 663727036 670089569 668023758 659999771 658133698
$$ packed form
764.8F32342377K989349m068642q9035J916008L026657k781486n886726N83152N173912
773.5F33205566L078499M124565k58712K083740M766311r745254p472916K161980P700958
782.1F39644737Q878899O814651O107178k569961n410157R9640N931320q68606J230087
790.8F59857788M632111m323502j043396j2694855l533477K1726989J0944290o372985
798.5F69192963j4607315q711167l380279j566544J1709442J6740494k163010r197082
806.2F58017502N140228j650925n45120N577164k316132N86930m023743n580597k033005
814.9F53172302p855377l557434J3743286J1839523k093658K243805j0674591j1449585
822.6F45368271Q758697n096054j094513J5790635O362533k065811q023987j866073
$$ plain form
830.4 658133698 658183441 644759750 636472168 636453285 632705536 622980156 618788872 622838058 620503769
839 620503769 613977089 609038811 604259148 592028351 585811005 594081688 593055611 592232170 588933029
847.7 588933029 578825378 585715370 596665573 608996620 611157265 596540222 595426750 597267189
855.4 597267189 605639191 622523766 623909264 628224525 638238792 637805290 638638000 643612900
863.1 643612900 642336502 643426437 651699982 653446045 651772766 652431641 652650604 648365479 640626373
871.8 640626373 638784866 635321159 638131294 650875244 653500366 653358383 654376450 651153946
879.5 651153946 647103348 643924103 642763748 641807785 638877182 635679398 638885918 642466049 638598061
888.2 638598061 630343056 629207306 636034012 636724129 634294014 630151443 626265907 622102547 620004730
$$ packed form
830.4F58133698M9743j3423691q287582j8883l747749r725380m191284M049186k334289
839F20503769o526680m938278m779663j2230797o217346Q270683j026077q23441l299141
847.7E88933029j0107651O889992J0950203J2331047K160645j4617043j113472J840439
855.4E97267189Q372002J6884575J385498M315261J0014267m33502Q32710M974900
863.1F43612900j276398J089935Q273545J746063j673279O58875K18963m285125p739106
871.8F40626373j841507l463707K810135J2743950K625122j41983J018067l222504
879.5F51153946m050598l179245j160355r55963k930603l197784L206520L580131l867988
888.2F38598061q255005j135750O826706O90117k430115m142571l885536m163360k097817
$$ plain form
896.9 620004730 627807236 634082222 637445526 633263359 628224411 628805084 623611526 624489326 625772171
905.6 625772171 625792007 631259727 626779099 616909142 617448997 619047699 610205727 607744408 607366295
914.3 607366295 598247299 594280701 596303406 593514557 581802521 575454521 573120079 566459770
922 566459770 564891510 565042381 565044594 565427704 564427872 561111755 557226067 558629303 560130196 562183456
931.6 562183456 563235130 559322243 555943489 553134346 555437431 563417740 570455246 574609489
939.3 574609489 575119209 578737907 587897263 591991386 589408455 594962769 610689735 617171211
947.1 617171211 612031784 606085052 603237152 609795952 616976967 617741737 619323921 624325790 629399414
955.7 629399414 623818779 612883453 609877243 611677628 608284683 604230804 606349030 606993332
$$ packed form
896.9F20004730P802506O274986L363304m182167n038948N80673n193558Q77800J282845
905.6F25772171J9836N467720m480628r869957N39855J598702q841972k461319l78113
914.3F07366295r118996l966598K022705k788849j1712036o348000k334442o660309
922E66459770j568260J50871K213L83110r99832l316117l885688J403236J500893K053260
931.6E62183456J051674l912887l378754k809143K303085P980309P037506M154243
939.3E74609489N09720L618698R159356M094123k582931N554314J5726966O481476
947.1F17171211n139427n946732k847900O558800P181015P64770J582184N001869N073624
955.7F29399414n580635j0935326l006210J800385l392945m053879K118226O44302
$$ plain form
963.4 606993332 605998192 600876274 596839409 597361603 590314674 586207619 586436577 582538834 579367943
972.1 579367943 574307861 570604706 572570877 573494873 572901917 575174713 575778656 574917641 570460968
980.8 570460968 560582504 561562881 565635262 564262657 568313904 566119652 559360466 560662155 558460388
989.5 558460388 546496468 537122116 536768494 533708458 522951126 512204628 505916901 506478653
997.2 506478653 514684334 524661751 525630569 521024513 520097809 519762611 517633820 517756920 519137421
1005.9 519137421 523391457 530345306 526701088 520701256 520836983 514783554 509671021 511681213
1013.6 511681213 512136421 510592422 512376175 510768623 504234390 503418922 499247780 492070580 489262581
1022.3 489262581 488196373 489434319 483104324 476333618 478453522 477664642 473177071 470129509
$$ packed form
963.4F06993332r95140n121918m036865N22194p046929m107055K28958l897743l170891
972.1E79367943n060082l703155J966171R23996n92956K272796O03943q61015m456673
980.8E70460968r878464R80377M072381j372605M051247k194252o759186J301689k201767
989.5E58460388j1963920r374352l53622l060036j0757332j0746498o287727N61752
997.2E06478653Q205681R977417R68818m606056r26704l35198k128791J23100J380501
1005.9E19137421M254036O953849l644218n999832J35727o053429n112533K010192
1013.6E11681213M55208j543999J783753j607552o534233q15468m171142p177200k807999
1022.3D89262581j066208J237946o329995o770706K119904p88880m487571l047562
$$ plain form
1030 470129509 466761284 464122696 463156815 460518646 459813957 456117439 448008308 443840485 442731628
1038.7 442731628 447266121 447100868 441844521 443800926 449039497 455313072 455962868 454765625 454275322
1047.4 454275322 450764427 449632530 444121666 438968430 440943947 447483749 457296219 464716797
1055.1 464716797 463822708 455976715 456938133 454923515 445073242 445452538 450067291 458371086 462400970
1063.7 462400970 455998993 448312531 444352150 443015938 441683578 449357185 451000977 444921722
1071.5 444921722 441521263 439087181 446731300 444155731 439661484 447780838 446627388 444558144
1079.2 444558144 444816513 438498192 434525146 441605034 443701286 433373985 428448143 427519875
1086.9 427519875 421507492 416380882 419742622 419779358 415507622 411566124 404594727 400742302 390731888
$$ packed form
1030D70129509l368225k638588r65881k638169p04689l696518q109131m167823j108857
1038.7D42731628M534493j65253n256347J956405N238571O273575O49796j197243m90303
1047.4D54275322l510895j131897n510864n153236J975517O539802R812470P420578
1055.1D64716797q94089p845993R61418k014618r850273L79296M614753Q303795M029884
1063.7D62400970o401977p686462l960381j336212j332360P673607J643792o079255
1071.5D44921722l400459k434082P644119k575569m494247Q119354j153450k069244
1079.2D44558144K58369o318321l973046P079888K096252j0327301m925842r28268
1086.9D27519875o012383n126610L361740L6736m271736l941498o971397l852425j0010414
$$ plain form
1095.6 390731888 383162994 380782890 368945312 355089149 344752693 337769165 320448532 306314163
1103.3 306314163 308589325 305364208 293952904 279917240 269069347 262309189 256035519 246539078
1111 246539078 237531643 232092876 224124851 217374573 213972969 211386147 206523762 205809212 208666172
1119.7 208666172 210953789 215147209 220722694 224175377 221733036 226023808 230063705 226379662
1127.4 226379662 222339306 221057682 225339050 221865082 217509766 218744450 220218315 221618977
1135.1 221618977 220371361 216600800 206775627 201174088 198937416 196273117 194203987 191412163
1142.8 191412163 190779953 187068806 186151695 182015953 175642815 174422436 172029476 169929619 167644634
1151.5 167644634 169461823 172538280 174185486 173165131 175584202 184825726 188468018 191457863
$$ packed form
1095.6C90731888p568894k380104j1837578j3856163j0336456o983528j7320633j4134369
1103.3C06314163K275162l225117j1411304j4035664j0847893o760158o273670r496441
1111B46539078r007435n438767p968025o750278l401604k586822m862385p14550K856960
1119.7B08666172K287617M193420N575485L452683k442341M290772M039897l684043
1127.4B26379662m040356j281624M281368l473968m355316J234684J473865J400662
1135.1B21618977j247616l770561r825173n601539k236672k664299k069130k791824
1142.8A91412163o32210l711147r17111m135742o373138j220379k392960k099857k284985
1151.5A67644634J817189L076457J647206j020355K419071R241524L642292K989845
$$ plain form
1159.2 191457863 195098095 196309261 197300892 201775932 210709553 216076927 217517185 221381874
1166.9 221381874 229963512 235871601 236997490 240504990 247712383 252151184 260718231 276533146
1174.6 276533146 286825924 292424030 295770245 305747967 318838024 323094826 327056351 334731140
1182.4 334731140 344567871 353563805 362796097 369990959 376645508 384329376 384374352 385373650 391806870
1191 391806870 398295212 402392235 403268890 406127434 411413994 417469940 423901176 432649384 441078377
1199.7 441078377 444869194 449332161 454742088 456487732 458036003 460180435 463148232 467474785
1207.4 467474785 468834801 472378540 475732269 472723846 473879852 480348244 484090881 485363350
1215.1 485363350 489860992 493500443 490392609 486825905 485333633 488336601 490638847 486075859
$$ packed form
1159.2A91457863L640232J211166R91631M475040Q933621N367374J440258L864689
1166.9B21381874Q581638N908089J125889L507500P207393M438801Q567047J5814915
1174.6B76533146J0292778N598106L346215R977722J3090057M256802L961525P674789
1182.4C34731140R836731Q995934R232292P194862O654549P683868M4976R99298O433220
1191C91806870O488342M097023Q76655K858544N286560O055946O431236Q748208Q428993
1199.7D41078377L790817M462967N409927J745644J548271K144432K967797M326553
1207.4D67474785J360016L543739L353729l008423J156006O468392L742637J272469
1215.1D85363350M497642L639451l107834l566704j492272L002968K302246m562988
$$ plain form
1222.9 486075859 485333557 487941933 488349876 487486458 486014214 488179474 490315666 488365097 488137321
1231.5 488137321 489975510 490408669 490421257 490983925 494515686 497477188 492886162 489449348 493055000
1240.2 493055000 495388260 496152878 496824265 495540924 495473366 496063843 498311272 501377373 500845833
1248.9 500845833 500919228 500451431 498273811 499174690 501342812 502068634 500304527 499864273 503749199
1257.6 503749199 506973495 505600433 503465729 505274200 505480957 503494453 505759048 510051460
1265.3 510051460 511403084 509774857 509984894 511458778 511755791 512660408 512313347 514036217 516790657
1274 516790657 517403412 520616989 523938713 527374573 530104866 530181465 531476936 530923195 531338158
1282.7 531338158 535041847 538020058 541725006 544706039 545650520 548895798 551993752 551654205 553695641
$$ packed form
1222.9D86075859p42302K608376M07943q63418j472244K165260K136192j950569k27776
1231.5D88137321J838189M33159J2588N62668L531761K961502m591026l436814L605652
1240.2D93055000K333260P64618O71387j283341o7558N90477K247429L066101n31540
1248.9E00845833P3395m67797k177620R00879K168122P25822j764107m40254L884926
1257.6E03749199L224296j373062k134704J808471K06757j986504K264595M292412
1265.3E10051460J351624j628227K10037J473884K97013R04617l47061J722870K754440
1274E16790657O12755L213577L321724L435860K730293P6599J295471n53741M14963
1282.7E31338158L703689K978211L704948K981033R44481L245278L097954l39547K041436
$$ plain form
1291.3 553695641 555490112 556718559 560411301 563287277 566681900 568727608 570632019 570978203
1299 570978203 570003319 573816833 575990219 574293365 574838867 578518715 581261482 583335953 584949875
1307.7 584949875 584567986 584451790 584388542 585360489 585610123 585198593 586208534 587986870 589769974
1316.4 589769974 590189018 592988434 596156387 596610069 596720734 597685776 597925606 597390060 599630585
1325.1 599630585 601100006 601894684 601698074 600595818 602635880 603969650 603935356 602378731 601307068
1333.8 601307068 602454605 602290382 602343216 603105431 604079514 604680672 605282173 606490593 603656883
1342.4 603656883 600010986 601071014 603208466 605665512 606078568 604923019 606587944 605179214
1350.2 605179214 603028526 602008018 598481827 595884552 597250900 600993576 601678391 601522255 601341553
$$ packed form
1291.3E53695641J794471J228447L692742K875976L394623K045708J904411L46184
1299E70978203r74884L813514K173386j696854N45502L679848K742767K074471J613922
1307.7E84949875l81889j16196o3248R71947K49634m11530J009941J778336J783104
1316.4E89769974M19044K799416L167953M53682J10665R65042K39830n35546K240525
1325.1E99630585J469421P94678j96610j102256K040062J333770l4294j556625j071663
1333.8F01307068J147537j64223N2834P62215R74083O01158O01501J208420k833710
1342.4F03656883l645897J060028K137452K457046M13056j155549J664925j408730
1350.2F05179214k150688j020508l526191k597275J366348L742676O84815j56136j80702
$$ plain form
1358.8 601341553 599566307 597110214 597591972 604023666 602034187 596772957 595511627 595303688 598057823
1367.5 598057823 596469574 594100304 595359383 595166512 594204102 594063873 594161415 590591774 586533852
1376.2 586533852 583559113 585609589 589892807 589384537 590295143 590142288 587041359 584973717 583502846
1384.9 583502846 582417755 582223091 584783363 586439400 587235565 588888893 590109329 588059311 585320435
1393.6 585320435 584919357 584150352 586081886 588443680 589743347 590138245 588457832 587791367 585655327
1402.2 585655327 583931961 584198799 584434166 583344383 580627823 578363190 576973915 577944984 582631378
1410.9 582631378 585249138 582710037 580926819 581762009 581807938 579750824 577526627 578975143 581214333
1419.6 581214333 581204834 582413979 583532295 584508743 582763252 581545029 582831345 583487854 583669701
$$ packed form
1358.8F01341553j775246k456093M81758O431694j989479n261230j261330k07939K754135
1367.5E98057823j588249k369270J259079j92871r62410j40229R7542l569641m057922
1376.2E86533852k974739K050476M283218n08270R10606j52855l100929k067642j470871
1384.9E83502846j085091j94664K560272J656037P96165J653328J220436k050018k738876
1393.6E85320435m01078p69005J931534K361794J299667L94898j680413o66465k136040
1402.2E85655327j723366K66838K35367j089783k716560k264633j389275R71069M686394
1410.9E82631378K617760k539101j783218Q35190M5929k057114k224197J448516K239190
1419.6E81214333r499J209145J118316R76448j745491j218223J286316O56509J81847
$$ plain form
1428.3 583669701 586129913 588398895 586457901 586332817 586985016 587012596 587741280 586089821 582253227
1437 582253227 587536736 593806267 595105591 593145981 593200150 593454056 593506050 594392815 597847633
1445.6 597847633 601784096 601320114 595617752 595402107 597476463 596566124 596731186 598140450 601946373
1454.3 601946373 608093491 607867813 601634521 601550636 603344269 604244232 606137314 609157333 610830193
1463 610830193 610402145 609284096 613960419 617788773 617896118 617778244 619807091 622290802 623836174
1471.7 623836174 622484741 623734856 629559669 633212166 635282555 637723389 638458328 638684692 641254349
1480.3 641254349 641890488 639018784 638793983 641840820 645277481 649530945 651512833 647184372 645671921
1489 645671921 641533966 640885773 644429703 643424149 640501633 637920761 636568031 636507034 639344406
$$ packed form
1428.3E83669701K460212K268982j940994j25084O52199K7580P28684j651459l836594
1437E82253227N283509O269531J299324j959610N4169K53906N1994Q86765L454818
1445.6E97847633L936463m63982n702362k15645K074356r10339J65062J409264L805923
1454.3F01946373O147118k25678o233292q3885J793633Q99963J893082L020019J672860
1463F10830193m28048j118049M676323L828354J07345j17874K028847K483711J545372
1471.7F23836174j351433J250115N824813L652497K070389K440834P34939K26364K569657
1480.3F41254349O36139k871704k24801L046837L436661M253464J981888m328461j512451
1489F45671921m137955o48193L543930j005554k922516k580872j352730o0997K837372
$$ plain form
1497.7 639344406 638910942 636515656 636740456 634407082 633633423 633185234 633301201 631679077 616121330
1506.4 616121330 624287071 623817596 617335358 615301323 614473381 612417717 613268318 613455849 610989952
1515.1 610989952 611185913 606741982 599810486 606197052 615078087 611942711 600631180 603333511
1522.8 603333511 603390617 602508774 599380569 598471527 597795334 597376518 598971481 599817085 599374924
1531.5 599374924 598515167 600790710 594858284 591256561 591930580 591282043 588646774 574554214 573481102
1540.1 573481102 589385872 596500931 589963150 590288963 591884651 583552589 584294777 588061600
1547.9 588061600 591721916 595475655 595401192 596679153 598198586 598738632 594579124 594262543 597488518
1556.5 597488518 598698769 598948288 584095688 590642586 601645584 604814606 603271980 600285492
$$ packed form
1497.7F39344406m33464k395286K24800k333374p73659m48189J15967j622124j5557747
1506.4F16121330Q165741m69475o482238k034035q27942k055664Q50601J87531k465897
1515.1F10989952J95961m443931o931496O386566Q881035l135376j1311531K702331
1522.8F03333511N7106q81843l128205r09042o76193m18816J594963Q45604m42161
1531.5E99374924q59757K275543n932426l601723O74019o48537k635269j4092560j073112
1540.1E73481102J5904770P115059o537781L25813J595688q332062P42188L766823
1547.9E88061600L660316L753739p4463J277961J519433N40046m159508l16581L225975
1556.5E97488518J210251K49519j4852600O546898J1002998L169022j542626k986488
$$ plain form
1564.2 600285492 602212753 607050323 609553032 610130196 608004074 604539337 607601776 608040810 606994667
1572.9 606994667 608566818 611165962 614292831 607087746 604934616 606152077 605953369 604496384
1580.6 604496384 603311424 603868828 601086922 597563286 594624634 593170738 592139969 590241013
1588.4 590241013 589051285 583874168 580696831 578908081 578361549 577061844 573161736 573436661 569314766
1597 569314766 563174515 559974594 557999115 555121803 552873802 552863312 551366425 547334557 541933975
1605.7 541933975 541325951 538661575 534725113 533949356 532317276 530520439 526365356 524481735 521277237
1614.4 521277237 521481247 524689369 514077835 511689415 508267784 505051346 502089539 503437424
1622.1 503437424 502833519 494059868 495792618 496913643 497670364 492274704 490212250 491652412 486886215
$$ packed form
1564.2F00285492J927261M837570K502709N77164k126122l464737L062439M39034j046143
1572.9F06994667J572151K599144L126869p205085k153130J217461j98708j456985
1580.6F04496384j184960N57404k781906l523636k938652j453896j030769j898956
1588.4E90241013j189728n177117l177337j788750n46532j299705l900108K74925m121895
1597E69314766o140251l199921j975479k877312k248001j0490j496887m031868n400582
1605.7E41933975o08024k664376l936462p75757j632080j796837m155083j883621l204498
1614.4E21277237K04010L208122j0611534k388420l421631l216438k961807J347885
1622.1E03437424o03905q773651J732750J121025P56721n395660k062454J440162m766197
$$ plain form
1630.8 486886215 483938332 483579445 484051514 483509636 477966385 473460121 475554123 477318802 477120590
1639.5 477120590 476854401 475172653 475509300 475135231 477799187 480497704 483895798 486767883 479598808
1648.1 479598808 480323143 481989784 486311417 490758514 478619576 473419304 483538475 490132828
1655.9 490132828 491213188 493391533 492783585 493943672 499093475 500834961 502176285 502057915 505033531
1664.5 505033531 507737465 510066719 512415314 514451675 515989494 516786308 520887451 521786194 525983658
1673.2 525983658 529929504 528647995 531005592 534360390 537635117 541268768 547221718 547747002
1680.9 547747002 546582413 550830536 563171501 569110451 558787956 560301056 564761276 569757500
1688.6 569757500 572389297 573964348 578285179 582237167 585382385 589236832 596079750 596000061 598412743
$$ packed form
1630.8D86886215k947883l58887M72069n41878n543251m506264K094002J764679j98212
1639.5D77120590k66189j681748L36647l74069K663956K698517L398094K872085p169075
1648.1D79598808P24335J666641M321633M447097j2138938n200272J0119171O594353
1655.9D90132828J080360K178345o07948J160087N149803J741486J341324j18370K975616
1664.5E05033531K703934K329254K348595K036361J537819P96814M101143Q98743M197464
1673.2E25983658L945846j281509K357597L354798L274727L633651N952950N25284
1680.9E47747002j164589M248123J2340965N938950j0322495J513100M460220M996224
1688.6E69757500K631797J575051M320831L951988L145218L854447O842918p9689K412682
$$ plain form
1697.3 598412743 602312088 602364159 611370811 622473907 623791351 627703209 630947380 634493790
1705 634493790 640328064 641847153 642877579 648133774 651958847 654414520 656455841 659084625 662641449
1713.7 662641449 662673111 665338745 671229477 675738068 672029877 672437744 675391617 676005402 676569138
1722.4 676569138 677042618 676971893 677898483 680191803 682333221 682549896 684894714 686732025 686392899
1731.1 686392899 690074768 695137100 694032898 683512802 687374039 693597946 696880798 697993622
1738.8 697993622 696523743 697199860 700132446 701880798 705625534 706494370 706298523 707281799 707112198
1747.5 707112198 710062866 712473068 713458099 715312500 718105850 722033081 723998032 727705841
1755.2 727705841 732246094 730659256 730654068 732876129 735220795 736691132 735620117 740109482 743920670
$$ packed form
1697.3E98412743L899345N2071R006652J1103096J317444L911858L244171L546410
1705F34493790N834274J519089J030426N256195L825073K455673K041321K628784L556824
1713.7F62641449L1662K665634N890732M508591l708191M07867K953873O13785N63736
1722.4F76569138M73480p0725R26590K293320K141418K16675K344818J837311l39126
1731.1F86392899L681869N062332j104202j0520096L861237O223907L282852J112824
1738.8F97993622j469879O76117K932586J748352L744736Q68836j95847R83276j69601
1747.5G07112198K950668K410202R85031J854401K793350L927231J964951L707809
1755.2G27705841M540253j586838n188K222061K344666J470337j071015M489365L811188
$$ plain form
1763.9 743920670 743006210 741459503 743020630 744169464 741164322 742837524 744342728 743013382
1771.6 743013382 741672516 741543350 746874390 750249634 749319305 748788452 748357391 749062958 749462433
1780.3 749462433 750442734 751321030 752071533 755405579 756001740 752632980 752559509 753723373 756025467
1788.9 756025467 758773117 756143951 753710785 754453735 754442368 756689758 758426971 758976059 760891418
1797.6 760891418 761759491 757848282 756969528 759765930 757633591 756314316 760645370 765187378 762848740
1806.3 762848740 759745178 760497665 762652435 763825684 759759293 760093536 762846222 763208389 763910065
1815 763910065 763453903 763414307 763575363 764969711 766910934 767918396 768774567 766906586 765043716
1823.7 765043716 765274124 763660202 764128876 768831406 772611237 773301392 770916748 770754166 772039719
$$ packed form
1763.9G43920670r14460j546707J561127J148834l005142J673202J505204j329346
1771.6G43013382j340866j29166N331040L375244r30329n30853m31061P05567L99475
1780.3G49462433R80301Q78296P50503L334046N96161l368760p3471J163864K302094
1788.9G56025467K747650k629166k433166P42950j1367K247390J737213N49088J915359
1797.6G60891418Q68073l911209q78754K796402k132339j319275M331054M542008k338638
1806.3G62848740l103562P52487K154770J173249m066391L34243K752686L62167P01676
1815G63910065m56162l9596J61056J394348J941223J007462Q56171j867981j862870
1823.7G65043716K30408j613922M68674M702530L779831O90155k384644j62582J285553
$$ plain form
1832.3 772039719 770696945 769773407 769159317 769648666 769152908 768583450 771836929 771865005 771279297
1841 771279297 772109070 774120102 773628159 766536942 769195480 770221939 770009537 772691803 773691635
1849.7 773691635 773200912 772001419 772073135 772613297 774286957 776192627 776772079 775396500 773387756
1858.4 773387756 773475800 772200241 770587158 770737686 772123566 773997345 776064148 776410751 774011078
1867.1 774011078 773876419 774729004 774234543 774217758 774637146 773729553 773716049 775078430 774096298 774153366
1876.7 774153366 775444183 778260422 777520599 773338394 774521790 775978165 776429214 775607452 775274277
1885.4 775274277 776433105 775518036 776224060 777123489 776768494 775933456 774398727 772908783 774967957
1894.1 774967957 778426666 776942825 778096542 780265961 778933411 776422958 774663773 774448776
$$ packed form
1832.3G72039719j342774r23538o14090M89349m95758n69458L253479K8076n85708
1841G71279297Q29773K011032m91943p091217K658538J026459k12402K682266R99832
1849.7G73691635m90723j199493P1716N40162J673660J905670N79452j375579k008744
1858.4G73387756Q8044j275559j613083J50528J385880J873779K066803L46603k399673
1867.1G74011078j34659Q52585m94461j6785M19388r07593j3504J362381r82132N7068
1876.7G74153366J290817K816239p39823m182205J183396J456375M51049q21762l33175
1885.4G75274277J158828r15069P06024Q99429l54995q35038j534729j489944K059174
1894.1G74967957L458709j483841J153717K169419j332550k510453j759185k14997
$$ plain form
1901.8 774448776 774962387 776409531 775328369 775620804 776477203 775522461 777424011 777083359 775496597
1910.4 775496597 776330566 777177124 776683197 776417160 777152863 777910995 779437866 777746277 775481720
1919.1 775481720 775007629 775161209 776827469 777625504 778094559 777063751 776097946 775829620 774959488
1927.8 774959488 775173569 775446625 775685425 775002747 774584885 775662308 775193939 774104309 774184341
1936.5 774184341 774364700 774610596 774442368 774331894 775313110 774487686 773974228 775584564 775614243 774857712
1946.1 774857712 774102325 774262924 775999374 777233276 776470413 775029984 774340668 774806671 775370178
1954.8 775370178 775206757 775915222 775458984 774828262 775979004 775662766 774865799 775383148 775214920
1963.5 775214920 773376236 772812271 773034744 772118912 772074814 773126526 775038757 775120239 773585739
$$ packed form
1901.8G74448776N13611J447144j081162K92435Q56399r54742J901550l40652j586762
1910.4G75496597Q33969Q46558m93927k66037P35703P58132J526871j691589k264557
1919.1G75481720m74091J53580J666260P98035M69055j030808r65805k68326q70132
1927.8G74959488K14081K73056K38800o82678m17862J077423m68369j089630Q0032
1936.5G74184341J80359K45896j68228j10474R81216q25424n13458J610336K9679p56531
1946.1G74857712p55387J60599J736450J233902p62863j440429o89316M66003N63507
1954.8G75370178j63421P08465m56238o30722J150742l16238p96967N17349j68228
1963.5G75214920j838684n63965K22473r15832m4098J051712J912231Q1482j534500
$$ plain form
1972.2 773585739 772842331 773093033 773821869 772780762 772153397 773684692 774931564 774184723 773216782
1980.8 773216782 773460999 773225632 772835922 772127686 771262817 770777512 770566406 770985794 770162811 769578781
1990.5 769578781 771016464 771178513 771572800 772326965 769455872 769054489 770491562 767858734 767568512
1999.2 767568512 771041565 772765732 771998978 772019806 770728531 768680878 769992447 769371872 768019028
2007.8 768019028 769008331 770832825 772129745 770568008 769602814 770439987 771180878 769710083 766852264
2016.5 766852264 766300583 767389755 767945938 766678772 766162338 766921310 767860260 769047089 768860779
2025.2 768860779 767113647 765173798 764930191 765586090 767715683 768373566 765739441 765519333 765620575
2033.9 765620575 765878067 767249680 766511765 767030106 767241211 764619141 763960037 762968216 760400620
$$ packed form
1972.2G73585739p43408K50702P28836j041107o27365J531295J246872p46841r67941
1980.8G73216782K44217k35367l89710p08236q64869m85305k11106M19388q22983n84030
1990.5G69578781J437683J62049L94287P54165k871093m01383J437073k632828k90222
1999.2G67568512L473053J724167p66754K0828j291275k047653J311569o20575j352844
2007.8G68019028R89303J824494J296920j561737r65194Q37173P40891j470795k857819
2016.5G66852264n51681J089172N56183j267166n16434P58972R38950J186829j86310
2025.2G68860779j747132j939849k43607O55899K129593O57883k634125k20108J01242
2033.9G65620575K57492J371613p37915N18341K11105k622070o59104r91821k567596
$$ plain form
2042.6 760400620 762225418 764665222 764640045 765445480 765359497 764799271 764364166 762534485 760631256
2051.2 760631256 761362076 764270325 765366669 765205917 764396286 762148209 762007446 763013992 762792816
2059.9 762792816 762780914 762306824 762443314 762994919 763159409 764497986 764481430 763404312 762831573 762255173
2069.6 762255173 761344376 758973694 757801285 759737778 761499634 760807724 760213928 759834442 758542938
2078.2 758542938 757700653 756764908 757344208 758447952 758588562 758250885 756323547 755810165 756851959
2086.9 756851959 757500763 757355881 756730881 756871643 756379318 755432434 755437317 756321945 755830460 754465027
2096.6 754465027 755292969 757010117 756749039 754832001 755458069 756609955 755341721 755989609 758081207
2105.2 758081207 758664169 759067688 759644241 758594360 758638611 759865799 758379211 757113266 758000412
$$ packed form
2042.6G60400620J824798K439804k5177Q05435q5983n60226m35105j829681j903229
2051.2G60631256P30820K908249J096344j60752q09631k248077j40763J006546k21176
2059.9G62792816j1902m74090J36490N51605J64490J338577j6556j077118n72739n76400
2069.6G62255173r10797k370682j172409J936493J761856o91910n93796l79486j291504
2078.2G58542938q42285r35745N79300J103744J40610l37677j927338n13382J041794
2086.9G56851959O48804j44882o25000J40762m92325r46884M883Q84628m91485j365433
2096.6G54465027Q27942J717148k61078j917038O26068J151886j268234O47888K091598
2105.2G58081207N82962M03519N76553j049881M4251J227188j486588j265945Q87146
$$ plain form
2113.9 758000412 759362717 759402618 759435959 760930786 760097504 758660278 759417191 759453201 758484879 758741226
2123.6 758741226 758444595 756425095 756764221 758013763 758162460 758112793 755665817 754433517 757038879
2132.3 757038879 759536743 759824066 758196411 757371521 758159790 757777786 755846634 754922562 756460876
2140.9 756460876 758910522 761030045 761800156 759653397 758217773 758868637 758329468 759047089 759856644
2149.6 759856644 759781952 761980972 761795654 759979324 760718460 762102127 762279968 760001144 758943329
2158.3 758943329 760175171 760238647 759381714 759870987 762333221 763683395 763292694 761640778 759717712
2167 759717712 760738754 762509613 762364655 761986923 761080017 759434052 760037231 762118225 762295761
2175.6 762295761 760077515 758345337 759138870 760028229 760938797 761760101 761912613 762120667 761125717
$$ packed form
2113.9G58000412J362305L9901L3341J494827q33282j437226P56913L6010r68322K56347
2123.6G58741226k96631k019500L39126J249542J48697m9667k446976j232300K605362
2132.3G57038879K497864K87323j627655q24890P88269l82004j931152r24072J538314
2140.9G56460876K449646K119523P70111k146759j435624O50864n39169P17621Q09555
2149.6G59856644p4692K199020j85318j816330P39136J383667J77841k278824j057815
2158.3G58943329J231842O3476q56933M89273K462234J350174l90701j651916j923066
2167G59717712J021042J770859j44958l77732r06906j645965O03179K080994J77536
2175.6G62295761k218246j732178P93533Q89359R10568Q21304J52512K08054r94950
$$ plain form
2184.3 761125717 760433807 760968323 761736526 762071609 763117142 764947815 763988953 762393112 762833633
2193 762833633 764142456 765430527 763957062 761601105 763197021 764215317 762618179 763275146 763634186
2201.7 763634186 763757477 765607834 767361679 767956848 766198425 764774933 764183502 764973373 766016846
2210.4 766016846 765080414 765150452 764772873 765252304 766592102 766416092 766521835 765272598 764168015
2219 764168015 764273529 764326553 765018158 765486298 766060410 767396622 767965164 767100372 767186813 767692719
2228.7 767692719 766279907 765969391 766988144 765070724 763743820 765890274 767051315 766196136 764619064
2237.4 764619064 764757690 766342087 766213379 765775528 766673965 767127991 766006241 765384445 765227127
2246 765227127 765573273 766325684 766916733 767951813 767394485 766430054 764786606 764321136 766795731
$$ packed form
2184.3G61125717o91910N34516P68203L35083J045533J830673r58862j595841M40521
2193G62833633J308823J288071j473465k355957J595916J018296j597138O56967L59040
2201.7G63634186J23291J850357J753845N95169j758423j423492n91431P89871J043473
2210.4G66016846r36432P0038l77579M79431J339798j76010J05743j249237j104583
2219G64168015J05514N3024O91605M68140N74112J336212N68542q64792Q6441N05906
2228.7G67692719j412812l10516J018753j917420j326904K146454J161041q55179j577072
2237.4G64619064J38626J584397j28708m37851Q98437M54026j121750o21796j57318
2246G65227127L46146P52411N91049J035080n57328r64431j643448m65470K474595
$$ plain form
2254.7 766795731 766882324 765779572 765569687 766284256 766728134 766014023 765622177 764771805 763989029 763638916
2264.4 763638916 765036545 767106018 767558289 765994415 764841156 766480713 766671906 766316681 766045380
2273 766045380 765487747 766049347 765624161 765677643 766328888 767517700 767468796 766036377 765926895 765669861
2282.7 765669861 766287766 766719055 766452713 766604691 766122742 765615921 765473557 765746460 765671997 766062012
2292.3 766062012 768028870 768571548 766426773 766403580 766946869 765499344 765836716 765699387 765955429
2301 765955429 766357956 766372757 768411865 767404099 765713730 765621948 765586090 766786575 766404572 765425568
2310.7 765425568 766219711 767389755 767072067 766280670 765760727 765477448 766375351 766578140 765910187
2319.3 765910187 765778198 765761795 764464569 763738022 765424728 764588394 761747437 764419403 767586060
$$ packed form
2254.7G66795731Q6593j102752k09885P14569M43878p14111l91846q50372p82776l50113
2264.4G63638916J397629K069473M52271j563874j153259J639557J91193l55225k71301
2273G66045380n57633N61600m25186N3482O51245J188812m8904j432419j09482k57034
2282.7G65669861O17905M31289k66342J51978m81949n06821j42364K72903p4463L90015
2292.3G66062012J966858N42678k144775k3193N43289j447525L37372j37329K56042
2301G65955429M02527J4801K039108j007766j690369r1782l5858J200485l82003r79004
2310.7G65425568P94143J170044l17688p91397n19943k83279Q97903K02789o67953
2319.3G65910187j31989j6403j297226p26547J686706q36334k840957K671966L166657
$$ plain form
2328 767586060 765272141 764577942 764382401 765516205 767471848 765262299 764510193 764938278 766689987
2336.7 766689987 768696671 769356842 771768875 773616791 771731415 769409256 771200790 769775085
2344.4 769775085 767995987 770363312 769539948 768922501 769389572 767889862 766151886 766411209 766817627
2353.1 766817627 770447159 772562027 764360733 760510788 762044983 763778381 768359833 765094528
2360.8 765094528 759883118 763756561 769152679 771151886 771399689 771319046 769893265 763868408 760900879
2369.5 760900879 762579193 765680618 770177231 769557571 767252502 768505020 770568848 769029846
2377.2 769029846 766659775 767949219 769568939 771924210 773599091 773352432 771399612 768732452
2384.9 768732452 769781952 770286179 768428879 767602997 769018631 771537781 772375870 772740555 771784286
$$ packed form
2328G67586060k313919o94199j95541J133804J955643k209549p52106M28085J751709
2336.7G66689987K006684O60171K412033J847916j885376k322159J791534j425705
2344.4G69775085j779098K367325q23364o17447M67071j499710j737976K59323M06418
2353.1G66817627L629532K114868q201294l849945J534195J733398M581452l265305
2360.8G65094528n211410L873443N396118J999207K47803q0643j425781o024857k967529
2369.5G60900879J678314L101425M496613o19660k305069J252518K063828j539002
2377.2G69029846k370071J289444J619720K355271J674881k46659j952820k667160
2384.9G68732452J049500N04227j857300q25882J415634K519150Q38089L64685r56269
$$ plain form
2393.6 771784286 770647125 771120148 770913010 769892120 770141983 770986557 769176636 767391205 767306595
2402.3 767306595 767202225 767277756 767292633 766896667 766912689 767752380 767826767 768476181 769182129 769744568
2411.9 769744568 770365067 769426651 770015106 769438629 767800980 768540039 768582535 768650894 768711700 768096619
2421.6 768096619 768532562 768821411 767790527 766753998 765799561 765966568 767837219 769166031 770054474
2430.2 770054474 770186768 769239273 766844330 765736923 766540756 766222305 767851334 767958069 765319214
2438.9 765319214 765064545 766184235 766090698 764564514 764967194 765405045 765530090 765446548 763568878
2447.6 763568878 764092484 764805069 764530334 764555664 764318008 765021210 764861526 763463821 762570419 762401962
2457.2 762401962 762801208 764503784 765294647 764903030 764797668 763543320 763812103 765126724 764636459
$$ packed form
2393.6G71784286j137161M73023k07138j020890K49863Q44574j809921j785431q4610
2402.3G67306595j04370P5531J4877l95966J6022Q39691P4387O49414P05948N62439
2411.9G69744568O20499r38416N88455n76477j637649P39059M2496O8359O0806o15081
2421.6G68096619M35943K88849j030884j036529r54437J67007J870651J328812Q88443
2430.2G70054474J32294r47495k394943j107407Q03833l18451J629029J06735k638855
2438.9G65319214k54669J119690r3537j526184M02680M37851J25045q3542j877670
2447.6G63568878N23606P12585k74735K5330k37656P03202j59684j397705q93402j68457
2457.2G62401962L99246J702576P90863l91617j05362j254348K68783J314621m90265
$$ plain form
2465.9 764636459 763457108 762660217 763177185 764531937 764611969 763128662 761893082 761147308 762440720
2474.6 762440720 763737793 761922150 760407028 759978485 760234070 760138092 759291153 760318985 761856461
2483.3 761856461 761221008 760587006 762136002 762672653 761113129 760119629 760764313 759603806 757389679
2492 757389679 758352432 758670807 758085861 757966537 758187714 758003082 756042938 755844727 755439301 755493393
2501.6 755493393 757089310 758191833 760018539 760448608 760575409 758950500 756203613 756395645 756910172
2510.3 756910172 756732712 756242599 756505814 756360397 756350098 757042007 755663376 754882202 754748840 753962173
2519.9 753962173 754341965 756245193 756932068 755212860 754822540 755559311 755436859 754814835 754858780
2528.6 754858780 755357590 754863129 753777847 753501358 755129623 755628586 754324265 753817291 753866806
$$ packed form
2465.9G64636459j179351p96891N16968J354752Q0032j483307j235580p45774J293412
2474.6G62440720J297073j815643j515122m28543K55585r5978q46939J027832J537476
2483.3G61856461o35453o34002J548996N36651j559524r93500O44684j160507k214127
2492G57389679R62753L18375n84946j19324K21177j84632j960144j98211m05426N4092
2501.6G55493393J595917J102523J826706M30069J26801j624909k746887J92032N14527
2510.3G56910172j77460m90113K63215j45417j0299O91909j378631p81174j33362p86667
2519.9G53962173L79792J903228O86875j719208l90320P36771j22452o22024M3945
2528.6G54858780M98810m94461j085282k76489J628265M98963j304321n06974M9515
$$ plain form
2537.3 753866806 752817688 750208740 750627060 753152161 753516235 752710876 751701584 752181244 752673950
2546 752673950 752244568 751585007 751390457 753906097 754577255 752543335 752412567 753090515 753131027 752638702
2555.6 752638702 752889481 752035294 749281693 749661255 751909027 752143555 751176834 750721664 751224442
2564.3 751224442 751679153 752281265 751917191 749760666 748124390 748131638 748733139 749083176 749417114 748829727
2573.9 748829727 748723526 750009995 749740677 749026718 748972168 748313675 747581024 746675568 745405731
2582.6 745405731 746424026 749205322 748450241 746524277 747054749 747409286 746446228 746081772 747260056
2591.3 747260056 745909653 744048157 745492554 746138687 745861969 745734940 745110779 744307327 743884659
2600 743884659 744872513 746354599 746709595 744863434 742913818 742933350 743363190 742642441 741678772 742338257
$$ packed form
2537.3G53866806j049118k608948M18320K525101L64074q05359j009292M79660M92706
2546G52673950m29382o59561j94550K515640O71158k033920j30768O77948M0512m92325
2555.6G52638702K50779q54187k753601L79562K247772K34528r66721m55170N02778
2564.3G51224442M54711O02112l64074k156525j636276P248O01501L50037L33938n87387
2573.9G48829727j06201J286469k69318p13959n4550o58493p32651r05456j269837
2582.6G45405731J018295K781296p55081j925964N30472L54537r63058l64456J178284
2591.3G47260056j350403j861496J444397O46133k76718j27029o24161q03452m22668
2600G43884659R87854J482086L54996j846161j949616J9532M29840p20749r63669O59485
$$ plain form
2609.6 742338257 743287277 743462296 743428574 743184738 743250427 742231522 740141373 740875244 742240753
2618.3 742240753 741075058 740466080 739212112 738120651 739334564 739964066 740070267 740199127 740492554
2627 740492554 739307404 738112411 739262009 739363098 738572464 737076340 735849533 735675735 735686798
2635.6 735686798 736593094 736709900 737009811 737251511 737397919 738453903 737245865 735425949 734878693
2644.3 734878693 732961960 732562561 735687943 736013870 733932724 732470932 731553192 732433243 732410736
2653 732410736 732926788 734021835 733673019 733250885 732690887 733097839 732397766 731638336 731188965 730108948
2662.6 730108948 730781708 730999298 731118698 730462265 729326477 728943863 727525787 727034836 727613068
2671.3 727613068 729007187 728738022 727073975 727704010 727471542 726330261 726126862 727094193 729136124
$$ packed form
2609.6G42338257R49020J75019l3722k43836O5689j018905k090149P33871J365509
2618.3G42240753j165695o08978j253968j091461J213913O29502J06201J28860K93427
2627G40492554j185150j194993J149598J01089p90634j496124j226807j73798J1063
2635.6G35686798R06296J16806K99911K41700J46408J055984j208038j819916n47256
2644.3G34878693j916733l99399L125382L25927k081146j461792r17740Q80051k2507
2653G32410736N16052J095047l48816m22134n59998M06952p00073p59430m49371j080017
2662.6G30108948O72760K17590J19400o56433j135788l82614j418076m90951N78232
2671.3G27613068J394119k69165j664047O30035k32468j141281k03399R67331K041931
$$ plain form
2680 729136124 728517990 726350327 726376953 726107635 725223694 725494385 725572510 725755157 725263062 724326401
2689.6 724326401 724533463 724667664 724112320 722899780 723167038 724764252 724093246 722929001 723460999
2698.3 723460999 723377762 723503418 724048996 722676086 722510834 723517685 722330551 720948639 721027298
2707 721027298 721218948 721580887 722405777 721908417 721631927 721133728 719101410 718609848 719267502 719821320
2716.6 719821320 718330383 715839691 716151810 717557144 718421249 718727188 718585358 717952805 716987534
2725.3 716987534 716278610 716099930 715479279 714746475 715004730 714206772 715235596 716490707 714461441
2734 714461441 714780655 715374603 714895172 715165482 713517380 712217026 712507553 712832718 712741623 712397995
2743.7 712397995 712286911 712649689 712603989 709992142 708041763 709692001 711131516 711026230 710077667
$$ packed form
2680G29136124o18134k167663K6626k69318q83941K70691P8125J82647m92095r36661
2689.6G24326401K07062J34201n55344j212540K67258J597214o71006j164245N31998
2698.3G23460999q3237J25656N45578j372910j65252J006851j187134j381912P8659
2707G21027298J91650L61939Q24890m97360k76490m98199k032318m91562O57654N53818
2716.6G19821320j490937k490692L12119J405334Q64105L05939j41830o32553r65271
2725.3G16987534p08924j78680o20651p32804K58255p97958J028824J255111k029266
2734G14461441L19214N93948m79431K70310j648102j300354K90527L25165r1095l43628
2743.7G12397995j11084L62778m5700k611847j950379J650238J439515j05286r48563
$$ plain form
2752.3 710077667 709489746 710816422 710348282 708193588 708881302 709764404 708256989 708074875 709135056
2761 709135056 707422333 705151215 705061874 706141815 706582031 705093689 704760284 705503235 704987869
2769.7 704987869 704681320 704511642 703718567 703010254 703230362 703003845 701394501 700724106 701781769
2778.4 701781769 701650772 700906296 702286530 701451950 698358841 697575607 697018585 696611710 697896042
2787 697896042 698706665 698145142 696856155 695672531 696086655 696560516 695409241 694637909 694450302
2795.7 694450302 694252014 694412308 693549881 691484528 691137466 691968994 691430740 690349350 689847183
2804.4 689847183 690711975 690956726 689479370 688014297 687836075 688480453 686863022 685665512 686296310
2813.1 686296310 685779953 684146500 682108383 682573395 684766388 685470734 684834366 683948135 681739044
$$ packed form
2752.3G10077667n87921J326676m68140k154694O87714Q83102j507415j82114J060181
2761G09135056j712723k271118q9341J079941M40216j488342l33405P42951n15366
2769.7G04987869l06549j69678p93075p08313K20108k26517j609344o70395J057663
2778.4G01781769j30997p44476J380234q34580l093109p83234n57022m06875J284332
2787F97896042Q10623n61523j288987j183624M14124M73861j151275p71332j87607
2795.7F94450302j98288J60294q62427k065353l47062Q31528n38254j081390n02167
2804.4F89847183Q64792K44751j477356j465073j78222O44378j617431j197510O30798
2813.1F86296310n16357j633453k038117M65012K192993P04346o36368q86231k209091
$$ plain form
2821.8 681739044 678617477 678203125 678670578 679081345 678576889 676998062 676371384 674517822 674668884
2830.4 674668884 675264587 673358002 672801514 671649170 671019135 670358353 667079544 665793457 665881805
2839.1 665881805 664151382 662964935 662698517 661572037 660708313 659596939 658211899 657365265 653564606
2847.8 653564606 648142319 646307526 647053146 647095184 645834808 644395447 643260803 642526550 642540436
2856.5 642540436 641984940 640547028 639567413 639658966 640819626 640711288 639196014 638207626 637799187
2865.2 637799187 637737465 636232567 635053902 635899734 636250648 636444855 635217018 631958771 630378685
2873.8 630378685 630370178 629378967 628703423 629398956 629323807 628005066 625809288 625439873 627274055 626824150
2883.5 626824150 626089439 625356026 623011818 622552872 623050194 623114014 622205048 620689545 619932938
$$ packed form
2821.8F81739044l121567m14352M67453M10767n04456j578827o26678j853562J51062
2830.4F74668884N95703j906585n56488j152344o30035o60782l278809j286087Q8348
2839.1F65881805j730423j186447k66418j126480q63724j111374j385040q46634l800659
2847.8F53564606n422287j834793P45620M2038j260376j439361j134644p34253J3886
2856.5F42540436n55496j437912r79615R1553J160660j08338j515274r88388m08439
2865.2F37799187o1722j504898j178665Q45832L50914J94207j227837l258247j580086
2873.8F30378685q507r91211o75544O95533p5149j318741k195778l69415J834182m49905
2883.5F26824150p34711p33413k344208m58946M97322O3820r08966j515503p56607
$$ plain form
2892.2 619932938 618415413 617603531 617356300 616330299 614917336 612788925 612586746 614020157 614278259
2900.8 614278259 613970299 613423920 610953712 608864555 609337158 609026871 609158096 609031029 606433716
2909.5 606433716 605739403 606789474 606781425 604445457 601754951 601613426 601209068 599364815 598852158
2918.2 598852158 598890800 597790260 598455391 598562813 595694733 593769531 592495575 592041092 592424583
2926.9 592424583 593317108 595421257 597054977 596679039 594342880 593809700 594445915 594715881 595381432
2935.6 595381432 595368271 596306953 596536407 596537399 597502708 598189926 600648956 601258583 600019150 600242424
2945.2 600242424 599785500 599733849 600130119 599655762 599322319 599710693 599276962 597914848 598894958 599730606
2954.8 599730606 597904015 597197762 598715096 599326553 597450638 595752602 595901680 597486115 598126030
$$ packed form
2892.2F19932938j517525q11882k47231j026001j412963k128411k02179J433411K58102
2900.8F14278259l07960n46379k470208k089157M72603l10287J31225j27067k597313
2909.5F06433716o94313J050071q049k335968k690506j41525m04358j844253n12657
2918.2E98852158L8642j100540O65131J07422k868080j925202j273956m54483L83491
2926.9E92424583Q92525K104149J633720l75938k336159n33180O36215K69966O65551
2935.6E95381432j3161R38682K29454R92R65309O87218K459030O09627j239433K23274
2945.2F00242424m56924n1651L96270m74357l33443L88374m33731j362114R80110Q35648
2954.8E99730606j826591p06253J517334O11457j875915j698036J49078J584435O39915
$$ plain form
2963.5 598126030 598030472 600099564 599817238 597851334 598790779 599006462 598751297 600453796 603205338
2972.2 603205338 605806236 606795006 606754303 607729912 608863525 609612427 612475243 614451942 614352303
2980.9 614352303 615165443 615532227 616435242 617461510 617022629 617176628 619049110 621417847 621226425
2989.6 621226425 620108795 621655731 624343033 624622917 623191872 623948555 624833717 623408279 623000450
2998.2 623000450 624290390 624752426 624540024 624941521 625319099 624710045 623411942 624001732 625717659
3006.9 625717659 625070229 624806900 625197639 625027924 626555061 626272049 624835052 625478821 625370903
3015.6 625370903 624471397 624621773 626234856 626228981 624091301 623040657 622633057 622151413 621401749
3024.3 621401749 620806847 619908600 619901047 620895958 619525871 617502136 616501312 617070198 617617264
$$ packed form
2963.5E98126030r5558K069092k82326j965904R39445K15683k55165J702499K751542
2972.2F03205338K600898R88770m0703R75609J133613P48902K862816J976699r9639
2980.9F14352303Q13140L66784R03015J026268m38881J53999J872482K368737j91422
2989.6F21226425j117630J546936K687302K79884j431045P56683Q85162j425438m07829
2998.2F23000450J289940M62036k12402M01497L77578o09054j298103N89790J715927
3006.9F25717659o47430k63329L90739j69715J527137k83012j436997O43769j07918
3015.6F25370903q99506J50376J613083n875k137680j050644m07600m81644p49664
3024.3F21401749n94902q98247p553R94911j370087k023735j000824N68886N47066
$$ plain form
3033 617617264 617053871 616927452 615614471 615045547 615596275 615932541 615944710 614920616 614840126 614724808
3042.6 614724808 614169121 613791161 613660660 613171387 610800171 608853073 607904282 609081879 611682854
3051.3 611682854 610423546 608380241 609079247 607883644 606622429 608487625 608159714 606083794 604771042
3060 604771042 603697701 604052200 604605179 604183578 602123528 599408379 599205704 600471535 600572243
3068.6 600572243 599974403 598687553 596926422 596678200 598202629 598990440 597535286 597815323 598697662
3077.3 598697662 597436218 598251839 598016090 595225868 594028587 594442062 594388390 592424812 591682777
3086 591682777 592443314 592714500 592014351 591145134 591082802 589911461 589300385 589189911 588269997 588243713
3095.6 588243713 588742142 590051842 590937920 589445343 587395248 585787773 583586273 582004051 582489243
$$ packed form
3033F17617264n63393j26419j312981n68924N50728L36266J2169j024094q0490j15318
3042.6F14724808n55687l77960j30501m89273k371216j947098r48791J177597K600975
3051.3F11682854j259308k043305O99006j195603j261215J865196l27911k075920j312752
3060F04771042j073341L54499N52979m21601k060050k715149k02675J265831J00708
3068.6F00572243n97840j286850j761131k48222J524429P87811j455154K80037Q82339
3077.3E98697662j261444Q15621k35749k790222j197281M13475n3672j963578p42035
3086E91682777P60537K71186p00149q69217o2332j171341o11076j10474r19914k6284
3095.6E88243713M98429J309700Q86078j492577k050095j607475k201500j582222M85192
$$ plain form
3104.3 582489243 583683205 582276115 580254173 581402092 581669769 581043663 580304184 578373260 578035316
3113 578035316 577558975 577331963 578247299 578304367 578158035 577484550 576220818 575709686 574733696 571792412
3122.6 571792412 570373726 570256691 569563751 569721756 569690781 568793144 567302628 566934853 566659737
3131.3 566659737 565347061 564278755 563506279 563465233 562561073 563397522 564416695 562476959 561462250
3140 561462250 558974648 556928368 557121849 556012840 554687042 551942558 550682144 552720566 552414627
3148.7 552414627 550706444 549888649 548829041 548558922 547984924 546274071 545240593 545380936 546345406
3157.4 546345406 545865364 543256264 541147194 540286980 539843483 539820671 539056664 537483788 537140312
3166 537140312 535981407 533621483 533491592 534205627 533050957 532579842 532592697 529401855 526946106
$$ packed form
3104.3E82489243J193962j407090k021942J147919K67677o26106p39479j930924l37944
3113E78035316m76341k27012R15336N7068j46332o73485j263732n11132r75990k941284
3122.6E71792412j418686j17035o92940J58005l0975q97637j490516l67775k75116
3131.3E66659737j312676j068306p72476m1046r04160Q36449J019173j939736j014709
3140E61462250k487602k046280J93481j109009j325798k744484j260414K038422l05939
3148.7E52414627j708183q17795j059608k70119n73998j710853j033478J40343R64470
3157.4E46345406m80042k609100k109070q60214m43497k2812p64007j572876l43476
3166E37140312j158905k359924j29891P14035j154670m71115J2855l190842k455749
$$ plain form
3174.7 526946106 526602821 525671082 525737419 526626358 525772438 523181763 522161140 521597328 520898666
3183.4 520898666 520541382 518879318 518544044 518806267 519319572 519038925 516821480 515321159 514029274
3192.1 514029274 513334351 511673126 509957199 509495659 508611984 507876854 506732178 506824989 507048302
3200.8 507048302 506537552 505702133 504584503 504128609 502771950 502708893 501827698 500069466 500843887
3209.4 500843887 500482216 498784180 496710434 495380478 494814034 494716377 494884872 492756119 491398926
3218.1 491398926 491349602 490479851 489670181 488535767 487357979 486851616 486959381 486880226 486145859 484695282
3227.8 484695282 483542252 483540955 483575363 483012009 482192268 481363106 480707970 479999504 478259506 477827225
3237.4 477827225 478295898 475851898 474346695 475075836 475219345 475565643 475022316 473170700 471931114
$$ packed form
3174.7E26946106l43285r31739O6337Q88939q53920k590675j020623n63812o98662
3183.4E20898666l57284j662064l35274K62223N13305k80647k217445j500321j291885
3192.1E14029274o94923j661225j715927m61540q83675p35130j144676R2811K23313
3200.8E07048302n10750q35419j117630m55894j356659o3057q81195j758232P74421
3209.4E00843887l61671j698036k073746j329956n66444r7657J68495k128753j357193
3218.1D91398926m9324q69751q09670j134414j177788n06363J07765p9155p34367j450577
3227.8D84695282j153030j297L4408n63354q19741q29162o55136p08466j739998m32281
3237.4D77827225M68673k444000j505203P29141J43509L46298n43327j851616j239586
$$ plain form
3246.1 471931114 472006340 471871414 469541054 466822205 466705170 467445717 466251297 465442924 465995522
3254.8 465995522 465819511 466834793 467978973 465375404 462405815 462185631 462808952 462267609 461098366
3263.4 461098366 461200905 461266785 460831337 460969658 459626656 456863899 456060448 456821175 455192871
3272.1 455192871 453206863 453948936 454764061 455331879 454609985 452563934 451996155 451494904 451412048
3280.8 451412048 450985909 448658257 447761955 447782249 446617661 446383324 447309952 446530304 445241318
3289.5 445241318 445549355 445562706 444675636 443366737 442851143 443439331 443944664 443042946 441393776
3298.2 441393776 442117500 442601051 441244316 440389519 440243454 439547920 437832108 437628670 437510529
3306.8 437510529 436973114 435914001 434096565 434427528 433673477 433842239 435231400 433443031 432387810
$$ packed form
3246.1D71931114P5226j34926k330360k718849j17035P40547j194420q08373N52598
3254.8D65995522j76011J015282J144180k603569k969589k20184O23321n41343j169243
3263.4D61098366J02539O5880m35448J38321j343002k762757q03451P60727j628304
3272.1D55192871j986008P42073Q15125N67818p21894k046051n67779n01251q2856
3280.8D51412048m26139k327652q96302K0294j164588k34337R26628p79648j288986
3289.5D45241318L08037J3351q87070j308899n15594N88188N05333r01718j649170
3298.2D41393776P23724M83551j356735q54797j46065o95534j715812k03438j18141
3306.8D37510529n37415j059113j817436L30963p54051J68762J389161j788369j055221
$$ plain form
3315.5 432387810 431833801 431167488 431557503 431542358 430136566 427958488 427047462 426344032 425260086
3324.2 425260086 424220085 423591118 423387947 422239838 420947266 420684395 421063118 420982399 418942680
3332.9 418942680 416487579 417618103 418772278 416909981 414977798 413739471 415126457 414728889
3340.6 414728889 410664902 409897041 410951347 409941101 406544189 404315720 405774765 407186928
3348.3 407186928 406756516 404991302 403414040 403347397 403177109 401814575 400322914 399226875 399274445
3357 399274445 398962708 396151810 394190903 394463348 395510788 395375328 393189392 392297363 392532082
3365.7 392532082 392462387 390919952 386693611 384487114 386084976 387545853 386512299 383499718 381318169
3374.3 381318169 381868629 383246231 381856728 379117546 378918190 378907509 377937508 377781906 377856102
$$ packed form
3315.5D32387810n54009o66313L90015j5145j405792k178078r11026p03430j083946
3324.2D25260086j040001o28967k03171j148109j292572k62871L78723q0719k039719
3332.9D18942680k455101J130524J154175j862297j932183j238327J386986l97568
3340.6D14728889m063987p67861J054306j010246l396912k228469J459045J412163
3348.3D07186928m30412j765214j577262o6643j70288j362534j491661j096039M7570
3357C99274445l11737k810898j960907K72445J047440j35460k185936q92029K34719
3365.7C92532082o9695j542435m226341k206497J597862J460877j033554l012581k181549
3374.3C81318169N50460J377602j389503k739182j99356j0681r70001j55602P4196
$$ plain form
3383 377856102 378192558 378413124 378402481 376774483 374247093 373760300 373839607 373396530 372319221 371628151
3392.7 371628151 371794739 371978722 372220268 370812531 368895836 368650475 369861603 370332375 368506546
3401.3 368506546 365968056 364817505 366335106 366616592 364773750 364281349 364811935 365773201 366266174
3410 366266174 366215591 365553894 364330978 364266853 363689041 362096100 363536835 365240059 363831329
3418.7 363831329 362947617 361960564 361672516 360660515 357913971 360195541 362770042 362014580 362245827
3427.4 362245827 362032013 362008667 362819138 362153778 361878014 363165779 362313690 361098251 362188644
3436.1 362188644 363472214 364203377 363388023 363074875 363946304 364085236 364119835 363641243 363270416 363637238
3445.7 363637238 364306259 364854431 364912071 364191475 362723198 363613396 366682320 367652893 367439728
$$ packed form
3383C77856102L36456K20566j0643j627998k527390m86793P9307m43077j077309o91070
3392.7C71628151J66588J83983K41546j407737j916695k45361J211128M70772j825829
3401.3C68506546k538490j150551J517601K81486j842842m92401N30586R61266M92973
3410C66266174n0583o61697j222916o4125n77812j592941J440735J703224j408730
3418.7C63831329q83712r87053k88048j012001k746544K281570K574501p55462K31247
3427.4C62245827k13814k3346Q10471o65360k75764J287765q52089j215439J090393
3436.1C62188644J283570P31163q15354l13148Q71429J38932L4599m78592l70827L66822
3445.7C63637238O69021N48172N7640p20596j468277Q90198L068924R70573k13165
$$ plain form
3454.4 367439728 368377304 368806572 367855072 367243919 368946495 371209946 371941872 371706009 370920296
3463.1 370920296 372299538 373860779 372770424 373019333 374502907 375346222 375510521 375201111 377370682
3471.7 377370682 379622269 379411736 380094719 380552750 380921173 382022362 381892700 383335342 384710693
3480.4 384710693 383885460 383395729 384224052 385819321 385414009 385319633 387567139 389927292 391246185
3489.1 391246185 391670876 391268959 389312820 388815269 389652023 391623192 394699707 394954720 394997978
3497.8 394997978 395858574 395940132 396803780 399054756 400380592 400157661 400393829 400993195 402153397
3506.5 402153397 402254219 402883987 405377045 407086449 407149391 407248001 409664040 409977455 408871346
3515.1 408871346 409404526 411206551 413431015 413158836 414136124 415414658 416064758 417284889 418078041
$$ packed form
3454.4C67439728R37576M29268r51500o11153J702576K263451P31926k35863p85713
3463.1C70920296J379242J561241j090355K48909J483574Q43315J64299l09410K169571
3471.7C77370682K251587k10533O82983M58031L68423J101189j29662J442642J375351
3480.4C84710693q25233m89731Q28323J595269m05312r4376K247506K360153J318893
3489.1C91246185M24691m01917j956139m97551Q36754J971169L076515K55013M3258
3497.8C94997978Q60596Q1558Q63648K250976J325836k22931K36168N99366J160202
3506.5D02153397J00822O29768K493058J709404O2942R8610K416039L13415j106109
3515.1D08871346N33180J802025K224464k72179R77288J278534O50100J220131P93152
$$ plain form
3523.8 418078041 420140915 420286598 420217857 421734200 423134918 422955093 423934937 427164230 427667351
3532.5 427667351 429209595 429917946 429937286 432431679 432159081 431978073 432734833 433993111 434926414
3541.2 434926414 435669594 437559814 439365692 441134987 441587219 444322243 445742378 444714088 445800209
3549.9 445800209 447973824 450562019 449631615 450186539 452503433 453287735 454718819 454616814 456173210
3558.5 456173210 459039650 459545708 459545593 461253090 462511902 462164421 464215775 466711044 469515266
3567.2 469515266 470912399 470620613 473183975 475897636 478296814 478146019 477378464 479293175 481374550
3575.9 481374550 484583778 487010345 487841759 488154640 489059181 491344643 493634186 496590729 498867836
3584.6 498867836 502028465 503256264 499195900 499666290 501714592 505389862 510391121 513832626
$$ packed form
3523.8D18078041K062874J45683o8741J516343J400718j79825R79844L229293N03121
3532.5D27667351J542244P08351J9340K494393k72598j81008P56760J258278R33303
3541.2D34926414P43180J890220J805878J769295M52232K735024J420135j028290J086121
3549.9D45800209K173615K588195r30404N54924K316894P84302J431084j02005J556396
3558.5D56173210K866440N06058j15J707497J258812l47481K051354K495269K804222
3567.2D69515266J397133k91786K563362K713661K399178j50795p67555J914711K081375
3575.9D81374550L209228K426567Q31414L12881R04541K285462K289543K956543K277107
3584.6D98867836L160629J227799m060364M70390K048302L675270N001259L441505
$$ plain form
3592.3 513832626 514991188 516097565 519107132 519722214 522457581 524942436 524117813 527081566 529559097
3601 529559097 531134834 534969635 538083725 537659340 538058319 542589149 543958321 545550842 546084900
3609.6 546084900 548359680 554996910 554329033 552579193 556294098 558626328 563264160 565899582
3617.4 565899582 565957451 570193443 572854080 572895851 573965149 574085464 576592827 581816597 585558472
3626 585558472 589602127 596564484 599358406 589511986 592171516 598267479 603366814 605127907 604418869
3634.7 604418869 608105392 610811729 611740265 613608665 615583725 619150810 623319511 624846458
3642.4 624846458 625733109 628364944 631280518 636407700 638333397 639336853 645679550 643517151
3650.1 643517151 641259842 641757202 645839996 649302063 653543549 659800186 653708420 655356598
$$ packed form
3592.3E13832626J158562J106377L009567O15082K735367K484855q24623K963753K477531
3601E29559097J575737L834801L114090m24385L98979M530830J369172J592521N34058
3609.6E46084900K274780O637230o67877j749840L714905K332230M637832K635422
3617.4E65899582N7869M235992K660637M1771J069298J20315K507363N223770L741875
3626E85558472M043655O962357K793922r846420K659530O095963N099335J761093p09038
3634.7F04418869L686523K706337R28536J868400J975060L567085M168701J526947
3642.4F24846458Q86651K631835K915574N127182J925697J003456O342697k162399
3650.1F43517151k257309M97360M082794L462067M241486O256637o091766J648178
$$ plain form
3657.9 655356598 659902725 661441956 663306427 664476547 668298950 666874237 666930237 670868225 671934586
3666.5 671934586 675974579 676959915 678006363 682273712 675390167 676067200 682782669 691369629 697414780
3675.2 697414780 685910263 683515930 686618500 688591766 687897644 687698441 690307999 692101898
3682.9 692101898 691309967 692630005 694208450 696272888 701775513 697685318 695253067 702262497
3690.6 702262497 696923904 693352509 697017288 698510971 700763245 700183563 698331833 701348267
3698.4 701348267 702700348 702344055 705459900 704725647 702341003 706024475 708015366 708458405 708611679
3707 708611679 711845245 716166687 707261047 710692368 715775604 704576797 708415375 711707458
3714.8 711707458 712052231 713136597 716710510 718796234 714898834 714179306 716805420 716612167 714540634
$$ packed form
3657.9F55356598M546127J539231J864471J170120L822403j424713N6000L937988J066361
3666.5F71934586M039993R85336J046448M267349o883545O77033O715469Q586960O045151
3675.2F97414780j1504517k394333L102570J973266o94122j99203K609558J793899
3682.9F92101898p91931J320038J578445K064438N502625m090195k432251P009430
3690.6G02262497n338593l571395L664779J493683K252274n79682j851730L016434
3698.4G01348267J352081l56293L115845p34253k384644L683472J990891M43039J53274
3707G08611679L233566M321442q905640L431321N083236j1198807L838578L292083
3714.8G11707458L44773J084366L573913K085724l897400p19528K626114j93253k071533
$$ plain form
3723.4 714540634 718039474 721162491 722537384 718605957 715217972 718105850 718703003 724174728
3731.2 724174728 723733673 716952744 724081421 720952530 715973740 714934845 714218445 717209167 720058746
3739.8 720058746 723935089 720200653 720847855 731555710 727869339 712961655 718398437 722995300
3747.5 722995300 729695740 729017868 719572220 730070343 727418213 718375092 723239136 725340118
3755.3 725340118 727397003 723607864 723976288 729194412 724007568 721925049 724547958 723479538
3763 723479538 724207077 730482941 729296494 724125671 726986084 731415253 732028122 724500351 724420319
3771.7 724420319 726580963 727513428 727392502 726266556 727600632 726276703 728093719 730642319 723075867
3780.3 723075867 723384628 725922623 726776581 726877365 723789978 723969650 724805908 725365601 726995239
$$ packed form
3723.4G14540634L498840L123017J374893l931427l387985K887878N97153N471725
3731.2G24174728m41055o780929P128677l128891m978790j038895p16400K990722K849579
3739.8G20058746L876343l734436O47202J0707855l686371j4907684N436782M596863
3747.5G22995300O700440o77872r445648J0498123k652130r043121M864044K100982
3755.3G25340118K056885l789139L68424N218124n186844k082519K622909j068420
3763G23479538P27539O275864j186447n170823K860413M429169O12869p527771q0032
3771.7G24420319K160644R32465j20926j125946J334076j323929J817016K548600p566452
3780.3G23075867L08761K537995Q53958J00784l087387J79672Q36258N59693J629638
$$ plain form
3789 726995239 727417755 728579483 729222412 728485107 727163467 728978195 735186539 733269882 725454636
3797.7 725454636 723940735 728206558 738442841 738320923 725401382 725396805 726039581 728678360 736580276
3806.4 736580276 733462906 725830231 728089523 729058228 729670258 730443039 729639740 729687195 734417648
3815.1 734417648 735590134 720421295 723151855 727938156 730771332 732930069 716684113 721065826
3822.8 721065826 728972015 729933701 730531693 731766205 729994125 726366653 727429657 731152039 729807053
3831.4 729807053 723577271 726776810 733171310 727896194 726436539 734800262 728656235 724977875
3839.2 724977875 732273178 727274475 724716797 728875504 727517853 724030914 725634689 728792038
3846.9 728792038 730412598 732001648 730119019 730284348 734958344 733877945 741338654 727159958
$$ packed form
3789G26995239M22516J161728O42929p37305j321640J814728O208344j916657p815246
3797.7G25454636j513901M265823J0236283j21918j2919541m577O42776K638779P901916
3806.4G36580276l117370p632675K259292R68705O12030P72781q03299M7455M730453
3815.1G34417648J172486j5168839K730560M786301K833176K158737j6245956M381713
3822.8G21065826P906189R61686N97992J234512j772080l627472J063004L722382j344986
3831.4G29807053o229782L199539O394500n275116j459655Q363723o144027l678360
3839.2G24977875P295303m998703k557678M158707j357651l486939J603775L157349
3846.9G28792038J620560J589050j882629J65329M673996j080399P460709j4178696
$$ plain form
3854.6 727159958 720038605 726839218 727370605 726740494 727685471 729274979 731845627 728078766 728423615
3863.3 728423615 737687225 733528214 721646576 724104614 728855209 734115829 727962646 718926086
3871 718926086 722649002 730098953 736091080 724843903 723585129 727808228 726528854 729107895
3878.7 729107895 735017776 731152573 725003662 730762100 730014191 731163559 739704056 727396774
3886.4 727396774 724318542 725752487 725855484 730157547 729813080 722284393 723001938 728841019 728088303
3895.1 728088303 726902924 726593170 730236893 734919434 722648468 725580978 729955368 725208359
3902.8 725208359 727945404 726937714 727474442 725683060 724136658 724553070 723840561 725432587 726500473
3911.5 726500473 727118301 726670074 726376801 727143631 727592239 725953522 724249878 727621841 728097763
$$ packed form
3854.6G27159958p121353O800613N31387o30111R44977J589508K570648l766861L44849
3863.3G28423615R263610m159011j1881638K458038M750595N260620o153183r036560
3871G18926086L722916P449951N992127j1247177j258774M223099j279374K579041
3878.7G29107895N909881l865203o148911N758438p47909J149368Q540497j2307282
3886.4G27396774l078232J433945J02997M302063l44467p528687P17545N839081p52716
3895.1G28088303j185379l09754L643723M682541j2270966K932510M374390m747009
3902.8G25208359K737045j007690N36728j791382j546402M16412p12509J592026J067886
3911.5G26500473O17828m48227k93273P66830M48608j638717j703644L371963M75922
$$ plain form
3920.2 728097763 724832535 724622574 725440216 727372894 726371918 724248352 725876541 728184357 729733505
3928.8 729733505 729135895 727575226 726257782 722161942 722827148 727380981 727164917 727158203 728053207
3937.5 728053207 726167374 725019226 724490128 727323074 729677429 725700989 725424957 725316238 725255737
3946.2 725255737 727095642 725125732 726071930 727175293 725523834 725461655 724138718 724936447 726284943
3954.9 726284943 726515884 725691681 722489014 721702957 723957214 728545914 730572662 726707382 723840408
3963.6 723840408 723568192 724153519 725624466 727110291 726297379 724145813 724255905 726046524 725416031
3972.2 725416031 723045654 721456070 722370682 726609802 726444855 724160461 725231934 725368347 724869308
3980.9 724869308 725620117 726558914 724096527 723582840 726467209 725095520 723565674 723706207 724382477
$$ packed form
3920.2G28097763l265228k09961Q17642J932678j000976k123566J628189K307816J549148
3928.8G29733505n97610j560669j317444m095840O65206M553833k16064o714Q95004
3937.5G28053207j885833j148148n29098K832946K354355l976440k76032j08719o0501
3946.2G25255737J839905j969910R46198J103363j651459o2179j322937P97729J348496
3954.9G26284943K30941q24203l202667p86057K254257M588700K026748l865280k866974
3963.6G23840408k72216N85327J470947J485825q12912k151566J10092J790619o30493
3972.2G25416031k370377j589584R14612M239120j64947k284394J071473J36413m99039
3980.9G24869308P50809R38797k462387n13687K884369j371689j529846J40533O76270
$$ plain form
3989.6 724382477 724844666 724227982 724783249 724979324 724925613 724884033 724679413 723968735 723958588 725158386
3999.2 725158386 725198975
4000.2 725198975
$$ packed form
3989.6G24382477M62189o16684N55267J96075n3711m1580k04620p10678j0147J199798
3999.2G25158386M0589
4000.2G25198975
##END=$$ End of the data block
