##TITLE=$$ Begin of the data block
##JCAMP-DX=5.00 $$ ACD/SpecManager v 10.08
##SPECTROMETER/DATA SYSTEM=Varian
##DATE=07 Jan 2013 10:56:46
##DATA TYPE=INFRARED SPECTRUM
##DATA CLASS=XYDATA
##ORIGIN=
##OWNER=
##NPOINTS=3735
##FIRSTX=399.26403809
##LASTX=4000.35498047
##MAXX=4000.35498047
##MINX=399.26403809
##MAXY=94.05345154
##MINY=9.40110779
##XFACTOR=1.0000000000
##YFACTOR=0.000000100000000
##FIRSTY=94.05345154
##DELTAX=0.96440572
##XUNITS=1/CM
##YUNITS=TRANSMITTANCE
##XYDATA=(X++(Y..Y))
399.3I40534515k9251480l41986351j78470192l0385055J13169250J94883576k7798920
$$ 940534515 911283035 569296684 390826492 360441437 473610687 668494263 640695343
406F40695343j77942696j1766891L6864471J3850899O0661507P8832130P0294419m8164368
$$ 640695343 462752647 450985756 487850227 501701126 562362633 641194763 711489182 663324814
413.7F63324814j30246201q6613121O910248R1902695L35416298p7949601l23136177
$$ 663324814 533078613 446465492 453375740 545278435 880694733 802745132 479608955
420.5D79608955m8428840P7590446J39756127r2056923j64647827M4906044Q3177871
$$ 479608955 431180115 508770561 648526688 556469765 391821938 436727982 519905853
427.2E19905853O3690567J3496628o2019386n2277603j3117867J2124901r487534M6163865
$$ 519905853 583596420 597093048 535073662 482796059 469678192 481803093 472315559 518479424
434.9E18479424K2082862m5705261m354782K7674828K5557861o524391l4439316j5339737
$$ 518479424 540562286 494857025 490502243 518177071 543734932 537210541 502771225 487431488
442.7D87431488J8225784K1531639P6034966j1299744j04373321L9528236N8855553
$$ 487431488 505657272 527188911 603223877 591924133 487550812 527079048 585934601
449.4E85934601P442741j3238067K3181228l5179481p7399597N2329521k2744637j33365822
$$ 585934601 593377342 580139275 603320503 568141022 490741425 543070946 520326309 386960487
457.1C86960487l7887802J07155113M9348259K6253319Q0224152l9627533m0824242
$$ 386960487 349072685 456227798 505576057 531829376 612053528 572425995 531601753
463.9E31601753M1183815M4232559m7268333n2565804J19273034J2058525j33871422
$$ 531601753 572785568 617018127 569749794 517183990 636457024 648515549 514644127
470.6E14644127j03244400k7576065M7069206J8723068L7812691K1794014N2612228
$$ 514644127 411399727 383823662 430892868 449615936 487428627 509222641 561834869
477.4E61834869L6217232n2440262j9130974K0439873o661300k7799035N2487793N624733
$$ 561834869 598052101 545611839 526480865 546920738 540259438 512460403 564948196 570572929
485.1E70572929p3689270l7597885N1815071O4035263q8776893k3869438K7257194
$$ 570572929 496883659 459285774 511100845 575136108 486359215 462489777 489746971
491.8D89746971O66771N588455l0823478J9621467j2512932J8131676P9616623Q91113
$$ 489746971 490413742 496002197 465178719 484800186 472287254 490418930 570035553 570926666
499.6E70926666j7905349k4179001K0770454J199074o2617607k6826973M2453613N9561653
$$ 570926666 553021317 528842316 549612770 550811844 488194237 461367264 503820877 563382530
507.3E63382530J3560257R153557j3510132j8987121k4524880l0489387q001213n32036
$$ 563382530 576942787 586096344 572586212 553599091 529074211 498584824 490583611 490051575
515D90051575P387047k0562935J1698112K7395439n611953L5611000L2769355j6522865
$$ 490051575 497438622 476875687 488573799 515969238 510357285 545968285 578737640 562214775
522.7E62214775l5740318r140854J955185l5788117k0684127k3141594j8257752K0040169
$$ 562214775 526474457 517333603 519288788 483500671 462816544 439674950 421417198 441457367
530.4D41457367M0854149L8616180n895767k6672859J0276336J7979622j1635513k1528473
$$ 441457367 482311516 520927696 515031929 488359070 498635406 516615028 504979515 483451042
538.1D83451042q658943J3852348J3020172l441276Q559036K0307045n921020m2472840
$$ 483451042 474792099 488644447 501664619 498223343 506782379 527089424 521168404 478695564
545.9D78695564k4376907J9503555K6181069J9688034N449867k2811203j1491509R749642
$$ 478695564 454318657 473822212 500003281 519691315 525141182 502329979 490838470 500588112
553.6E00588112j4058190j9965858J1358261J7544480k468224j251450R776421N425301
$$ 500588112 486529922 466564064 477922325 495466805 492998581 491747131 501523552 506948853
561.3E06948853K755088r013099l002816L736191r982338q09784m89578o535034j462860
$$ 506948853 509703941 500690842 497688026 501424217 491441879 490632095 490142517 483607483 482144623
570D82144623j1260987j6456909J0383950K9357223N290222M530335J4857063Q457718
$$ 482144623 470883636 454426727 464810677 494167900 499458122 503988457 518845520 527303238
577.7E27303238n695839k9200211k4329948p442360J4509316P695312j4686203Q764114
$$ 527303238 521607399 492407188 468077240 460634880 475144196 482839508 468153305 476917419
585.4D76917419J0074997p787628m429626J0527038J4244042l61519q056450j31454
$$ 476917419 486992416 479204788 474775162 485302200 499546242 499184723 491128273 490996819
593.1D90996819J9756202J0801811j0955772j2825012p177963M531517o835251r896775
$$ 490996819 510753021 521554832 510599060 497774048 490596085 495127602 488292351 478395576
600.8D78395576N251999o097602j4793778J538200J3240357o293945k0004692q313981
$$ 478395576 483647575 477549973 462756195 464294395 477534752 471240807 451236115 442922134
608.5D42922134p547187j9158631j7531242p168732j2099686j6209564K9297J9695320
$$ 442922134 435374947 416216316 398685074 391516342 379416656 363207092 363236389 382931709
616.3C82931709J0135575j1314621j5473671j2765999L216057o067047k7418900j1279678
$$ 382931709 393067284 381752663 366278992 353512993 356729050 350662003 323243103 311963425
624C11963425K877617J0234069J3670311Q624039K8439522M6112976J2966194r485817
$$ 311963425 314841042 325075111 338745422 347369461 375808983 421921959 434888153 425402336
631.7D25402336p263222q713646j0651245j6252670l330803N211868k970924j1218643
$$ 425402336 418139114 409425468 398774223 382521553 379190750 384402618 381431694 370213051
639.4C70213051o593208J7354965K5648689K7361832J9339828J974716J0019646J8143883
$$ 370213051 363619843 380974808 406623497 433985329 453325157 455299873 465319519 483463402
647.1D83463402L858261j116371N537719K901650L22990O735535R440765P41272M599495
$$ 483463402 487321663 486205292 491743011 494644661 494967651 501703186 511143951 511885223 516484718
655.8E16484718J440087r952660R125862Q822479R92203N854874r646721n456276K62871
$$ 516484718 517924805 507972145 517098007 525920486 526912689 532767563 523120842 517664566 517927437
664.5E17927437J74446P556000P551269K4030037n21316q041687j1597100q546600
$$ 517927437 518101883 525657883 533209152 557239189 556717873 548676186 537079086 528532486
672.2E28532486L873482R074745J757698j1901207j739502P312279M890632R107285
$$ 528532486 532405968 541480713 543238411 531337204 529597702 536909981 541800613 550907898
679.9E50907898l384628o641388M803734M57534o124611j627883r717026j0757637
$$ 550907898 547523270 540881882 545685616 546143150 540018539 538390656 528673630 517915993
687.6E17915993P262001K053680m9362l348122j1989593L580818P882042M389839l996734
$$ 517915993 525177994 527231674 527182312 523834190 511844597 515425415 523307457 527697296 523700562
696.3E23700562j0014992m328842K298507Q869934L55530L155441j237945j4328766
$$ 523700562 513685570 509356728 511655235 520525169 520880699 524036140 522798195 508469429
704E08469429K769356N833816N64881O593933J0333366J0259972N995827p51229r064941
$$ 508469429 511238785 517072601 517637482 524231415 534564781 544824753 550820580 550069351 541004410
712.7E41004410K86751M693298l046303k377968j809005M742240R996491L549919j0114517
$$ 541004410 541291161 545984459 542938156 540560188 538751183 543493423 553489914 557039833 546925316
721.4E46925316m966660O453133l192177r43832O830330J989708j532593O039047M227181
$$ 546925316 541958656 548411789 545219612 544275780 551106110 553095818 551563225 557602272 561829453
730.1E61829453j8350945q854980J947631l267593J6619644J0948715r908218q733177
$$ 561829453 543478508 534623528 536571159 533303566 549923210 560871925 550963707 542230530
737.8E42230530p537728l323745J10206O877785P984962l219413m905396O470223J3825416
$$ 542230530 534692802 531369057 531479263 538357048 546342010 543122597 538217201 544687424 558512840
746.5E58512840j059456j1373214N06019Q487702Q210869K177238m538002L696938
$$ 558512840 557453384 546080170 546586189 555073891 563284760 565461998 560923996 564620934
754.2E64620934P321128J323891J1928520P174073r108773j373176j436310j267395
$$ 564620934 571942062 573265953 585194473 592368546 583259773 581886597 580450287 579182892
761.9E79182892J022301k780076N188942M395638m63448m320335n672874k369843k228127
$$ 579182892 580205193 577425117 582614059 587009697 586546249 582225914 576553040 574183197 571955070
770.6E71955070O407052M667282j160164L328819J865959j443062l487663L268089
$$ 571955070 578362122 583029404 581869240 585198059 587064018 585620956 582133293 585401382
778.3E85401382P689209k78968l865586N03769Q103714P365608j230201q61435L760757
$$ 585401382 593090591 592811623 588946037 589449806 597553520 604919128 603688927 602827492 606588249
787F06588249K58484j918220k152214m272004J952401K799835m883232K286071O129837
$$ 606588249 606846733 604928513 602776299 598504295 600456696 603256531 598373299 600659370 606789207
795.6F06789207k189407L596230M909744j159706L621940j899032r368706l856735
$$ 606789207 604599800 608196030 613105774 611946068 615568008 613668976 604300270 600443535
803.4F00443535K838363N496254N409317M412003K515564k140961o684036l8490J537094
$$ 600443535 603281898 608778152 614187469 618599472 621115036 618974075 612290039 612251549 613788643
812F13788643l117066L854065J397438J011887P975655k950287k551537O750756k919999
$$ 613788643 610671577 614525642 615923080 616934967 624910622 621960335 619408798 626159554 623239555
820.7F23239555l946914m98886m723893K351151N295753o423263q573418k260818o546822
$$ 623239555 619292641 618793755 614069862 616421013 621716766 615293503 606720085 604459267 597912445
829.4E97912445o203270J618118K113457K384644J70555l329964p103882r010658o228333
$$ 597912445 591709175 593327293 595440750 597825394 597995949 594665985 587562103 578551445 572323112
838.1E72323112q36677K84042n286178J565284n595550j2247124N632096O095809J658135
$$ 572323112 571486435 571770477 566484299 568049583 562454033 550206909 555839005 561934814 563592949
846.8E63592949K12364K819519M003372j268348J803512n155716j948852K881126O371231
$$ 563592949 563805313 566624832 570628204 569359856 571163368 566007652 564058800 566939926 573311157
855.4E73311157J1737175k025680j55945J772842J417237L725395L48358O971931L50113
$$ 573311157 585048332 583022652 582866707 584639549 586056786 589782181 590130539 597102470 597452583
864.1E97452583J788483R729881J049538J063499N335350k171363m010430N001946
$$ 597452583 599241066 608970947 610020485 611083984 616419334 614247971 610237541 615239487
871.8F15239487m241371p603302O090393J222457o428337k84233J875000J173325N508804
$$ 615239487 610998116 603394814 609485207 610707664 604279327 603995094 605870094 607043419 612552223
880.5F12552223j480522k360687P199974K372589q401871j4904709q30345O167259
$$ 612552223 611071701 608711014 615910988 618283577 609881706 594976997 594146652 600313911
888.2F00313911m579734k906456l812027R43718Q834381L177948p170868o902313K352638
$$ 600313911 595734177 592827721 589015694 589959412 598793793 601971741 594800873 587898560 590251198
896.9E90251198M879989P058983r13772o208954L130264l16276n004807J769562N269661
$$ 590251198 595131187 602190170 601276398 595067444 598197708 597881432 592876625 594646187 599915848
905.6E99915848k319679p945252k264786J478920n897064j1616173o241836k172356
$$ 599915848 597596169 589650917 587386131 588865051 582967987 571351814 565109978 562937622
913.3E62937622P69234k650566m251061J522408o387177r031524j025506M971161n36003
$$ 562937622 563706856 561056290 556805229 558327637 551940460 542908936 541883430 546854591 546318588
922E46318588r727096L87535L331833m680367k259788K557563Q15087k671204j748504
$$ 546318588 536591492 536979027 540310860 535630493 533370705 535928268 536743355 534072151 532323647
930.7E32323647k656861j215133N672798N509491k455101j714135K468071M018174
$$ 532323647 529666786 528451653 534124451 539633942 537178841 535464706 537932777 541950951
938.4E41950951O853637J829605K787056O970559M593238O766434O825180K339478
$$ 541950951 548804588 550634193 553421249 560391808 564985046 571751480 578576660 580916138
946.1E80916138j562538J074218k279167o946335M708710P400780Q60824J904641K275466
$$ 580916138 579353600 580427818 578148651 571202316 575911026 583311806 584172630 586077271 588352737
954.8E88352737j553344K94876m78211q786010l526764N64460r75456k371216n425529
$$ 588352737 586799393 587094269 586616058 577830048 574303284 574867744 573892288 571521072 566095543
963.4E66095543l230019o195907l584824K158737L99590j869126k092895r11598m856682
$$ 566095543 562865524 556669617 553084793 555243530 555643120 553773994 551681099 550769501 545912819
972.1E45912819j658707Q34732l050613j036377j82762J476021j793824o069259m025193
$$ 545912819 544254112 545088844 542038231 541001854 540819092 542295113 540501289 534432030 530406837
980.8E30406837k861747k115860l226662M007530P287178p552528j0258713k755852
$$ 530406837 527545090 525429230 522202568 526210098 533497276 525944748 515686035 512930183
988.5E12930183m209098n590630m187088k954941q901710j6860276j8081016j5826798
$$ 512930183 508721085 503130455 498943367 495988426 487086716 470226440 452145424 436318626
996.2D36318626k004737J2738685J4893379J1051484P456588L513603k706794n656510
$$ 436318626 434313889 447052574 461945953 472997437 480454025 483967628 481260834 475604324
1004D75604324p47795M467011q12950o270409J910934O619149o2256n020600p869072
$$ 475604324 474856529 479323540 478510590 472240181 474151115 480770264 480708008 475687408 467818336
1012.6D67818336o639747J686859K072258j922722k420502p142486m238434j698914
$$ 467818336 461178589 462865448 464937706 463014984 460594482 453451996 449213562 447514648
1020.3D47514648m236793J243896l166p799148p121544L02543m31366l320159J846275
$$ 447514648 443277855 444521751 444518585 436719437 429597893 429900436 429469070 426148911 427995186
1029D27995186l39928n12352o53267o773376k270470j300697p86896K630882k957039
$$ 427995186 427655258 427142906 426489639 419716263 417445793 416145096 415358200 417989082 415032043
1037.7D15032043o191825o313744J436157N023995j648789M863816O158676l058358
$$ 415032043 408840218 402526474 403962631 408986626 407337837 412201653 418360329 415301971
1045.4D15301971l090515j388550j763839J049385M232292J874084k323112m964752
$$ 415301971 412211456 410822906 409059067 410108452 414340744 416214828 413891716 408926964
1053.1D08926964l611984K595100O052475M335251j576653k812652L524322p99599
$$ 408926964 405314980 407910080 413962555 418297806 416721153 413908501 417432823 416633224
1060.9D16633224l602104N503044P89261n526848m493408m229469K263832L827019
$$ 416633224 413031120 418534164 419323425 413796577 409303169 405073700 407337532 411164551
1068.6D11164551k390709j0183716o969414Q489838J0147629P591l967590j311608
$$ 411164551 408773842 398590126 391620712 400110550 410258179 410265770 406298180 404986572
1076.3D04986572o39343j212997l579789n867271l823166j5068L789787k381935j345138
$$ 404986572 404347229 403134232 399554443 393687172 389864006 389848938 393638725 391256790 389911652
1085C89911652M095459j421433J148224j410675o165199l983574o492310r797897j2107964
$$ 389911652 394007111 392585678 393733902 392323227 386158028 382174454 375682144 365884247 353776283
1093.6C53776283o520996k572670r103775j4255333j0311336n114250r878045j3320503
$$ 353776283 347255287 344682617 335578842 321323509 311012173 305897923 296019878 282699375
1101.4B82699375p720928l439484j1640949j5189304j0257893j0254860j1703491j3213596
$$ 282699375 274978447 271538963 259898014 244708710 234450817 224195957 212492466 199278870
1109.1A99278870p140255j974087n199165j1151505p430115j794758m911098m021339
$$ 199278870 192138615 190164528 184965363 173813858 166383743 164588985 159677887 155656548
1116.8A55656548m101677P90643J166239M46215J155290m015464J681175O574220M404307
$$ 155656548 151554871 152345514 153511753 153957968 155113258 151097794 152778969 159353189 163757496
1125.5A63757496j836167K572041N475483q63991j877060o05907L772125n491352k773762
$$ 163757496 161921329 164493370 169968853 169104862 167227802 166621895 170394020 164902668 162128906
1134.1A62128906R5940j2270975p632094j330299K666960m738970p633686o251774
$$ 162128906 162224846 149953871 142321777 140991478 143658438 138919468 131285782 125034008
1141.9A25034008p657652o4621l654480k103472j690712l559951k903748l591585j608019
$$ 125034008 117376356 117311735 113657255 111553783 109863071 106303120 103399372 99807787 98199768
1150.5I8199768m188690O74190K061510J305914n73844J18026L718424K358284K655792
$$ 98199768 94011078 94685268 96746778 98052692 97478848 97596874 101315298 103673582 106329374
1159.2A06329374k447433J144981K940245K281380O494302N036431L875799L421259
$$ 106329374 103881941 105026922 107967167 110248547 116742849 121779280 125655079 129076338
1166.9A29076338N977936K881946M796801P116594M384604Q234253R911136Q611202
$$ 129076338 135054274 137936220 142733021 149849615 154234219 162468472 172379608 180990810
1174.6A80990810P151986J0985984R109784Q329010Q441391O190185J1823044J0617371
$$ 180990810 188142796 199128780 208238564 216567574 225008965 231199150 243022194 253639565
1182.4B53639565Q819160P849750Q070832Q958130P736396O111031K901726P015819
$$ 253639565 262458725 270308475 278379307 287337437 295073833 301184864 304086590 311102409
1190.1C11102409Q037892L798580o6414M904137J1105423Q680839P363625Q02154L740082
$$ 311102409 319140301 322938881 322872467 327776604 338882027 347562866 354926491 355728645 359468727
1198.8C59468727Q952942L993683K781181M076462P262878P811699N629692J473351
$$ 359468727 368421669 372415352 375196533 379272995 386535873 394347572 399977264 401450615
1206.5D01450615K523270N247039L460617M880372L068313K752686L304710K651939
$$ 401450615 403973885 409220924 412681541 417561913 420630226 423382912 426687622 429339561
1214.2D29339561L376198N64690j139221m93851L008423N557289J965294l498383n53322
$$ 429339561 432715759 433280449 432141228 431647377 434655800 440213089 442178383 438680000 438126678
1222.9D38126678M098397L63083k10266J456871R35363J797905M475556J138916l412400
$$ 438126678 442225075 442588158 442377892 443834763 444770126 446568031 451043587 452182503 448770103
1231.5D48770103J305962J361771j403694J25312K168770J758461r35631P88880J910400
$$ 448770103 450076065 451437836 450034142 450159454 452328224 454086685 453151054 453939934 455850334
1240.2D55850334K064858K584495o12068k220535R16099L21198j849938O64826N34286
$$ 455850334 457915192 460499687 459887619 457667084 458583183 458904381 457054443 457719269 458253555
1248.9D58253555K039872K385749p10601P34024K691078J553039m890785m636269L378029
$$ 458253555 460293427 462679176 461968575 462702599 465393677 466946716 462055931 457419662 460797691
1257.6D60797691N174256J821594j189652j62544J32103O80199K745705K197532K93121
$$ 460797691 465971947 467793541 466603889 466441345 466573448 467253647 469999352 472196884 472490005
1266.3D72490005p0190K537270J756324k41050J721382K173462N87272M19960L68920
$$ 472490005 472419815 474957085 476713409 476472359 478193741 480367203 480954475 481374435 481743355
1274.9D81743355R57985K599563K549706L326835M186326K190551Q32901K336617K434692
$$ 481743355 482701340 485300903 487850609 491177444 495363770 497554321 498387222 500723839 503158531
1283.6E03158531J042671J17188r55391J328354L212051M306603O142540J677398r67445
$$ 503158531 504201202 504318390 503362999 504691353 507903404 512210007 518352547 520029945 519062500
1292.3E19062500K147331J069756M50706L243408J610795K042541L611488L16353R77898
$$ 519062500 521209831 522279587 522730293 525973701 527584496 529627037 533238525 533554878 534532776
1301E34532776J944351j132431k124710P00645K068367R14078L025246K784881P30401
$$ 534532776 536477127 535344696 533219986 533920631 535988998 536903076 539928322 542713203 543443604
1309.7E43443604R39140m11339m96139p83463m88586K233848J676369L78914J975746
$$ 543443604 544382744 543971405 543475266 542691803 542203217 544437065 546113434 546492348 548468094
1318.3E48468094J995964j483879j542053R00116J590309J730842N88227J899109J923828
$$ 548468094 550464058 548980179 547438126 548338242 549928551 551659393 552247620 554146729 556070557
1327E56070557j462098o0615J105347k83509k056160n94291K746353Q34694Q06350
$$ 556070557 554608459 554547844 555653191 555369682 553313522 552719231 555465584 556300278 557106628
1335.7E57106628J456910j335679j356697O69899O50292J75667J756858P32041j981621
$$ 557106628 558563538 557227859 555871162 556541061 557191353 557367020 559123878 559855919 557874298
1344.4E57874298j703186J935272J761132q87490Q13866j174393k250595M80614J624145
$$ 557874298 556171112 558106384 559867516 558980026 559793892 558619499 556368904 556849518 558473663
1353.1E58473663L58277j19019L424912Q36258k088280j932526k953796j477013K261849
$$ 558473663 558831940 558712921 562137833 562974091 560885811 558953285 555999489 554522476 556784325
1361.7E56784325K874717k480201j025353r91211j916542J698761j120872l308220
$$ 556784325 559659042 557178841 556153488 555162277 553245735 554944496 553823624 550515404
1369.4E50515404j098252J198006k61154k779961R07593m75578k048035j070900L49960
$$ 550515404 549417152 550615158 550354004 547574043 548481636 548006058 545958023 544887123 545237083
1378.1E45237083O67077j019631J69983j377907k124290M36439K258835J437836m3221
$$ 545237083 545904160 544884529 545054512 543676605 541552315 541988754 544247589 545685425 545642204
1386.8E45642204O00815R56192K365112n25741j313324K71072j328315q96378j419487
$$ 545642204 546243019 547199211 549564323 549038582 547725258 547996330 546668015 545771637 544352150
1395.5E44352150K064743K558746j418113l262825j592980P33948k68402j839295l386955
$$ 544352150 546416893 548975639 547557526 544294701 542701721 543435669 543167267 541327972 537941017
1404.2E37941017k018699K601318J121483P4730j123238j186752p19033j191520k24533
$$ 537941017 535922318 538523636 539645119 539719849 538596611 537409859 536690826 535499306 535274773
1412.8E35274773o08750j54876K128982J494942j371918k267075m278984K157784L337707
$$ 535274773 534666023 534511147 536640129 538135071 536763153 534496078 530217094 532374878 535712585
1421.5E35712585J272240R71298j718826P62863L605232k68135j896400j170502j197967
$$ 535712585 536984825 537956123 536237297 537000160 540605392 540337257 538440857 537270355 536072388
1430.2E36072388K705154L593598Q92181Q42857J504937L152465L15895l613319K617416
$$ 536072388 538777542 542371140 543263321 544106178 545611115 548763580 549079475 545466156 548083572
1438.9E48083572K106972K520523J565399j915741j023025q74176K935295M143257
$$ 548083572 550190544 552711067 554276466 552360725 551337700 550463524 553398819 557542076
1446.6E57542076K230911j110687j477623K630043J018410N67207O82984j381035o47583
$$ 557542076 559772987 558662300 557184677 559814720 560833130 561400337 562083321 560702286 560054703
1455.3E60054703O84051J107292j793975L273048L144875J388397J405716L52211L90243
$$ 560054703 560738754 561846046 560052071 563325119 566469994 567858391 569264107 569616318 570006561
1464E70006561q19549J470413L071289J860580K43035P79609J562157J90315K546120
$$ 570006561 569187012 570657425 573728714 575589294 575832329 576611938 578174095 578364410 580910530
1472.6E80910530M208717J956749R85337J874199L603134K256088J931343K005768
$$ 580910530 585119247 587075996 588061333 589935532 593538666 595794754 597726097 599731865
1480.3E99731865K099800K030067J814118K816200J093025q23097p0953n85556L095245
$$ 599731865 601831665 603861732 605675850 608492050 609585075 608761978 608691025 608105469 611200714
1489F11200714J088905o683616J481705J978797j002807o04668J006470k143364k249870
$$ 611200714 612289619 605606003 607087708 609066505 608063698 607459030 608465500 606322136 604072266
1497.7F04072266k742997j463852J464959r85070j779174J52778J13793l412018r873238
$$ 604072266 601329269 599865417 601330376 600345306 598566132 598718910 598832703 595420685 585547447
1506.4E85547447m24461M086609J912079L67584q89931m680519l312721k39296j866303
$$ 585547447 585122986 589209595 591121674 591489258 590599327 585918808 582606087 582366791 580500488
1515.1E80500488n089531o918640L732834J413498k05727j539154p049370Q42858O990471
$$ 580500488 575410957 568492317 572225151 573638649 573432922 571893768 564844398 565687256 572677727
1523.7E72677727N563278n569725l062096J619339k032470k15722m06227j513862k16408
$$ 572677727 578241005 572671280 569609184 571228523 569196053 568980331 568574104 567060242 566843834
1532.4E66843834k915115p054291K771263M12941k433701K019921k351303j3025704
$$ 566843834 563928719 556874428 559645691 560058632 557624931 559644852 557293549 544267845
1540.1E44267845L502770M077682J613312L025398L721771k772674k780457q62846
$$ 544267845 547770615 551848297 553461609 556487007 560208778 557436104 554655647 553792801
1547.9E53792801J961555j413154k240792K363854J355362L996124m88586l070183
$$ 553792801 555754356 554341202 552100410 554464264 555819626 559815750 559327164 556256981
1555.6E56256981K920494N391083M266205p895470m049568J524353L850479K441254
$$ 556256981 559177475 564568558 568834763 560939293 556889725 558414078 562264557 564705811
1563.3E64705811P92160j66626L33595J796913k40860J74179m405784m70047L417587
$$ 564705811 565497971 565331345 565664940 567461853 567220993 567395172 562989388 562519341 565936928
1572E65936928R17625J02043L94478l72162p574768J302376J672707q86765J11656
$$ 565936928 566854553 566956596 567351074 566978912 559404144 560706520 562379227 561492462 561604118
1580.6E61604118j656646j388779j252670p53365k001648l655891k754822k425118
$$ 561604118 559947472 558558693 557306023 556552658 554551010 550895119 548140297 545715179
1588.4E45715179J026154j219978l513604j910896k652855m615669l197861n98030
$$ 545715179 546741333 545521355 542007751 540096855 537444000 532828331 529630470 529032440
1596.1E29032440k363930j131744j453400k668304l461533j666679j314201l875733
$$ 529032440 526668510 525536766 524083366 521415062 517953529 516286850 514972649 511096916
1603.8E11096916n91659j512261k403068l870316k881508n52902l388405k615089k543106
$$ 511096916 510505257 508992996 506589928 502719612 499838104 499285202 495896797 493281708 490738602
1612.5D90738602r55010k004509j614685q81195o367531j181678j801339J27907j2588
$$ 490738602 489783592 487779083 486164398 485283203 478915672 477733994 475932655 476060562 476047974
1621.1D76047974j976395m419174j094399Q86307j174278o2561o099701k817955J229782
$$ 476047974 474071579 469652405 468558006 469444313 468270035 468207474 462107773 459289818 460519600
1629.8D60519600o55365k198792k762222J737709Q64678p106514k610894J229248k84729
$$ 460519600 459864235 457665443 454903221 456640930 457505608 450399094 447788200 449017448 448732719
1638.5D48732719K327576K657395r59282L23219j309967K141456J630555k747269j106186
$$ 448732719 451060295 453717690 452758408 453081627 451771660 453913116 455543671 452796402 451690216
1647.2D51690216j560516M113273o30035L079605R018784J4314918j7166748n441818
$$ 451690216 450129700 454242973 453612938 456692543 465711327 480026245 462859497 457417679
1654.9D57417679L337936J769028K971649n44433n68848L316688J996956K526284J225776
$$ 457417679 460755615 462524643 465496292 464951859 464383011 467699699 469696655 472222939 473448715
1663.6D73448715J648369N91126L291130M369316n57366l292083M265937P050553J497841
$$ 473448715 475097084 475688210 478979340 483348656 482791290 479499207 483765144 490815697 492313538
1672.3D92313538J482048L829994M030495l489266J069756N649528K929001K553940
$$ 492313538 493795586 497625580 501656075 498166809 499236565 504886093 507815094 510369034
1680E10369034J739425K254029K471733L315277M524994j992149N564003L653297L346062
$$ 510369034 512108459 514362488 516834221 520149498 524674492 522682343 528246346 531899643 535245705
1688.6E35245705L885574J253510L309974L491860L116188L461799K657585m906311
$$ 535245705 539131279 540384789 543694763 547186623 550302811 553764610 556422195 551515884
1696.4E51515884Q194161Q881569J159439o827507Q300323R128075L092155K800713
$$ 551515884 559710045 568591614 569751053 562923546 571223869 580351944 583444099 586244812
1704.1E86244812O590576M154320L686333J204605P88116J062279J822128L383942
$$ 586244812 592835388 596989708 600676041 601880646 602668762 603731041 605553169 608937111
1711.8F08937111K503395K816544L417205J789513J850433O24314k670441M531860
$$ 608937111 611440506 614257050 617674255 619463768 621314201 621938515 619268074 623799934
1719.5F23799934M456902J314163P07245O22406Q60367K247467J808243O36940J123275
$$ 623799934 628256836 629570999 630278244 630900650 631761017 634008484 635816727 636453667 637576942
1728.2F37576942J607132k441787l64685M567833N198822K006378j0553589K961578
$$ 637576942 639184074 636742287 636377602 640945435 646144257 648150635 637597046 640558624
1735.9F40558624M469757P13272J931916j694107j772843N520478K767181J89209L107681
$$ 640558624 645028381 645741653 647673569 645979462 644206619 649727097 652494278 652683487 655791168
1744.6F55791168L346634K123490J593322K158966K107849L190155Q03910j71051M505310
$$ 655791168 659137802 661261292 662854614 665013580 667121429 670311584 671115494 670944443 675449753
1753.3F75449753L776016J607895k06680j316071M274521M294586J352997N08041o20880
$$ 675449753 679225769 680833664 680626984 679310913 683585434 687880020 689233017 689741058 689120178
1761.9F89120178K751389K863922O8817j236572l90778P68128N14450K107544M02526
$$ 689120178 691871567 694735489 694804306 693567734 693176956 693945084 694459534 696567078 696969604
1770.6F96969604k845687j723862J471100L670273K136993L69034K28882K769851L070679
$$ 696969604 694123917 692400055 693871155 697541428 699678421 700047455 700276337 703046188 706116867
1779.3G06116867k343140j121139L196640K879333k72064l368225j247330O69785J079025
$$ 706116867 703773727 702652588 705849228 708728561 708456497 705088272 703840942 704510727 705589752
1788G05589752J969986K585144m64554o61621N06821L58047K702942l27682j647568
$$ 705589752 707559738 710144882 709680328 709018707 709525528 709883575 712586517 712258835 710611267
1796.7G10611267J922989J222305n803451l070908N667572L212509J704560j18180
$$ 710611267 712534256 713756561 707953110 704882202 710549774 713762283 715466843 715348663
1804.4G15348663o67572R78852m13361J49689P35702M71192j172181n70907L47977
$$ 715348663 714681091 715659943 715246582 715396271 716131973 716603165 715430984 714860077 715208054
1813G15208054J545105K662353K2354r3002k41470j85471P37610P7667k55203M33349
$$ 715208054 716753159 719415512 719437866 719344864 719103394 718917923 719655533 719733200 719477997 719911346
1822.7G19911346J483536j679992j973420K027436J104202j17493k606811j675797
$$ 719911346 721394882 719714890 717741470 719768906 720873108 720755615 718148804 716473007
1830.4G16473007K589264K174378Q10775p6980q55408J408463K163391l83683K09732
$$ 716473007 719062271 721236649 722047424 721970444 721115036 722523499 724686890 724303207 724512939
1839.1G24512939m33425N17578K96554P83615J130829n347900N66864J254043L76740
$$ 724512939 724079514 724597092 724893646 725677261 726808090 721460190 722027054 723281097 723657837
1847.8G23657837Q09936K83967J602706M77677l47519N0201J497040M50363j490402
$$ 723657837 724467773 724751740 726354446 726832123 726484604 726534805 728031845 728482208 726991806
1856.4G26991806j188812q72727J084061M78592J67007j23977j327286n70831J189575
$$ 726991806 725802994 724930267 726014328 726492920 726659927 726535950 725208664 724637833 725827408
1865.1G25827408J752243n00336L48587j426162r03550L436890J255646Q34808K91061
$$ 725827408 727579651 727079315 727427902 726001740 725098190 728535080 729790726 730625534 730916595
1873.8G30916595j512222j298523o18896l27759L26462J686554Q40301k58407o08673
$$ 730916595 729404373 728105850 727486954 727159195 727485657 729172211 730012512 729754105 729145432
1882.5G29145432j087418O485K163010R77096j974716p81632M17099q37326J12915
$$ 729145432 728058014 728064499 730227509 731204605 729229889 728448257 728865356 728028030 728140945
1891.2G28140945j5258j235428N65109J504517K37503J285553J896591l66593k072906
$$ 728140945 728125687 726890259 727455368 728959885 729197388 730482941 732379532 732012939 729940033
1899.8G29940033k18506k78091l8300K043228K39258J60904L75671j280593j567765
$$ 729940033 729721527 729443436 729405136 731448364 731687622 731848526 732224197 730943604 729375839
1908.5G29375839J15128Q56399j082763L98178K07901j353226j068497m82406J462021
$$ 729375839 729490967 730347366 729264603 729662781 729870682 728517456 727448959 726966553 728428574
1917.2G28428574k85569j39236Q69903r34982R71222R1782j890335J063156N84717
$$ 728428574 728143005 728003769 728873672 727938690 728909912 729001694 727111359 728174515 728759232
1925.9G28759232p11518j26114J205674K217636J37939k34299k97470j004715K74125
$$ 728759232 728047714 727921600 729127274 731344910 731482849 731248550 730951080 729946365 730220490
1934.6G30220490P5302N13992l81241j451416p80182K6932P36313j781769p99713J584244
$$ 730220490 730295792 730809784 730428543 728977127 728196945 728223877 728960190 727178421 726378708 727962952
1944.2G27962952P37762L27454l63388l11737M24194J197815n85938q39004q17871
$$ 727962952 728700714 729028168 728664780 728353043 728777237 729975052 729389114 728550110 727732239
1952.9G27732239j863709l0212L87878J078797j62888r66797J805954J157913k61612
$$ 727732239 725868530 725838318 726226196 727304993 727142105 726175308 727981262 729139175 728877563
1961.6G28877563p78961k38647K81372k40936N5999p47451o77414J083679Q163j171646
$$ 728877563 728098602 727859955 728141327 727900391 727956390 727208939 726531525 727615204 727623367 726451721
1971.2G26451721P36237M53033j07651N05143P16858O36978j886368j549683Q85926
$$ 726451721 727187958 727640991 727533340 728038483 728755341 729392319 727505951 725956268 726842194
1979.9G26842194J116485q76007k526474l30047J134948j7471n79681J224288J319581
$$ 726842194 727958679 727082672 724556198 724226151 725361099 725343628 724763947 725988235 727307816
1988.6G27307816m12446j25503j343308l106994j457749J253128J312256M61808K44293
$$ 727307816 726895370 726769867 725426559 722319565 720861816 722114944 723427200 723889008 724133301
1997.2G24133301j318512o82373J818542K053452m52881n15747J53198j544037m95071
$$ 724133301 722814789 722132416 723950958 726004410 725551529 725035782 725188980 723644943 723149872
2005.9G23149872Q40835J58463r83963k26669O64978q46253o21643j69906q34656M33807
$$ 723149872 723990707 724149170 723165207 722938538 723603516 722757263 722135620 721965714 721131058 721564865
2015.6G21564865J922531r9869j775894p28912J066513J460419j419754j146469O78024
$$ 721564865 723487396 723387527 721611633 720882721 721949234 723409653 721989899 720843430 721521454
2024.2G21521454l57742p10679j35803L20664j53122Q74862Q26950j504135q59604
$$ 721521454 721163712 720453033 720317230 720637894 720484772 721359634 722186584 720682449 719822845
2032.9G19822845M91181J04675j95999j93787j020355j523514j507492o94961J608429
$$ 719822845 720314026 720418701 720222702 720028915 719008560 717485046 715977554 715282593 716891022
2041.6G16891022K329101N51148j001663j603165j436157R61914J490631R30328J216736
$$ 716891022 719220123 719771271 718769608 717166443 715730286 716692200 718182831 719113159 720329895
2050.3G20329895j350784j431580K33536k58255k069168j403580K266083P39212p43256
$$ 720329895 718979111 717547531 717781067 717522812 715453644 714050064 716316147 717055359 716312103
2059G16312103m66003k113266M19998L240509R56345k300797k098541n64041o11O80695
$$ 716312103 715846100 713732834 714152832 717393341 718349686 716048889 713950348 713386307 713385696 714066391
2068.6G14066391K36893j021805j137924p11975n89371l22876K6474O7215j176911
$$ 714066391 714303284 713281479 712143555 711431580 710842209 710519333 710545807 710613022 709436111
2077.3G09436111q86001K64664j342469q66623J375809J414337K78168p47604j043473
$$ 709436111 708550110 708814774 707472305 706605682 707981491 709395828 709673996 708926392 707882919
2086G07882919k23312P05109n341L2578K24456k8305L82309j075439j760712P38602
$$ 707882919 707659607 708364716 708359375 708391953 708616409 708588104 708970413 707894974 706134262 706872864
2095.6G06872864K123642K06070p52869k7695L25928M18091M71954P86591m59824o44836
$$ 706872864 708996506 709202576 708449707 708422012 708747940 709166031 709637985 710424576 709964752 709319916
2105.2G09319916K87933L09754N50460l01971L89557J898269J902924O01730j960373
$$ 709319916 709607849 709917603 710468063 710166092 710555649 712453918 714356842 714958572 712998199
2113.9G12998199k441406j46408J914902j58844k080383Q81271J360321j827087j373978
$$ 712998199 710556793 710410385 712325287 712166443 710086060 710967331 712327652 710500565 709126587
2122.6G09126587J366730J353836k15149j173249j055297j41220M76455N27497L6392
$$ 709126587 710493317 711847153 711632004 710458755 709403458 709262238 709738693 710266190 710302582
2131.3G10302582j25122O19278j22605m48532R83505p29217j344528O75735O49338
$$ 710302582 710177460 710796738 710674133 710225601 711209106 710479889 709135361 709811096 710460434
2140G10460434k13776o50253P56912M48151k27203J056365J63498p16476k72522J203690
$$ 710460434 710246658 709596405 710353317 710801468 710574265 711630630 711794128 711077652 710805130 712008820
2149.6G12008820Q04977o58417l28140r75342o50863J200103J572800J93100o82144
$$ 712008820 712813797 712155380 711827240 710851898 710201035 711401138 712973938 713167038 712484894
2158.3G12484894r90753N73120J169128n56259J012344J70212j515579r63135j202774
$$ 712484894 711494141 712067261 713236389 712680130 713692474 713862686 712347107 711383972 710181198
2167G10181198p73392n86471J504059J297836n98907J15203O05011p24487k017059
$$ 710181198 709407806 708821335 710325394 711623230 711024323 711139526 711744537 711020050 709002991
2175.6G09002991J70593M19388J147842K253342j035233k054901j14364K038879J303711
$$ 709002991 709173584 709592972 710740814 712994156 711958923 709904022 709789658 711828537 713132248
2184.3G13132248o14243j753845r51309J301727M16794R2926N69000J115113L70178
$$ 713132248 712518005 710764160 709812851 711114578 711531372 711624298 712193298 713308411 713678589
2193G13678589o50482N00335p54089j204987L19367N72128o9046K05841R52606R87473
$$ 713678589 713028107 713528442 712774353 711569366 711888733 712460861 712391815 712597656 713550262 714537735
2202.6G14537735q4305p90253Q65479o02951n12619J845245J097336P16095n50537
$$ 714537735 714453430 713663177 714528656 713925705 713413086 715258331 716355667 717071762 716521225
2211.3G16521225L49274j43891j328506Q94394p69882j284714Q77228J310501O55899
$$ 716521225 716870499 716726608 715398102 716292496 715522614 714237900 715115128 716425629 717081528
2220G17081528k56653k46735m1656L2959r46579q1787K053833Q0261j800766n71289
$$ 717081528 716824875 716578140 716536484 716569443 715622864 715541077 717594910 717675171 715874405 715303116
2229.7G15303116k15607j78757L60413K56805j177978r23843K510986Q94928j987991
$$ 715303116 715087509 714908752 715269165 715525970 714347992 713424149 715935135 716830063 714842072
2238.3G14842072o00739N15366J78375k031174r98764P69272Q55026J363220m99954
$$ 714842072 714241333 714756699 714935074 712903900 711905136 712674408 713529434 714892654 714392700
2247G14392700j54495J573334J59759j980438r09958J258392J649781Q76083j018982
$$ 714392700 714238205 715811539 715971298 713990860 713080902 714339294 715989075 716865158 715846176
2255.7G15846176o81686k43454o8436j1597k49710J265793N73960p08771j450653n79682
$$ 715846176 715164490 714921036 714852600 714841003 714591293 715857086 716431046 715722275 714271622 713691940
2265.3G13691940Q21228Q17948O53915p47986j21383j64948k17895N64575J72195K96250
$$ 713691940 714513168 715331116 715985031 715237045 715115662 714950714 714732819 715297394 715469589 715765839
2275G15765839r23767k67640p9651J24665J187134L77807Q77762j029892k086410J21002
$$ 715765839 714842072 714574432 714494781 714619446 715806580 716184387 717062149 716032257 713945847 714066849
2284.6G14066849Q69827Q1329K60086J410523l2044l69110n76629j648789n8822K34985
$$ 714066849 714936676 715018005 715278091 716688614 716656570 716287460 715710831 714062042 714003220 714238205
2294.3G14238205j21536J266021J782456K4185l88412R66873p28455j906433K27966
$$ 714238205 714116669 715382690 717165146 717189331 716800919 717767792 717039337 715132904 715360870
2302.9G15360870Q96759P68814P11289j097107o35147k96478j341858R89456J455765
$$ 715360870 716257629 717026443 717737732 716640625 716005478 715709000 714367142 715356598 716812363
2311.6G16812363k38114j329269k484741l36609K220764J490097j66016j015167K75726
$$ 716812363 716574249 715244980 712760239 712423630 714644394 716134491 715968475 714953308 715229034
2320.3G15229034J364365j21384J11390K66418j141434j58691J89438L28750L503876
$$ 715229034 716593399 716472015 716583405 716849823 715708389 715549698 715739136 716067886 719571762
2329G19571762L594055p1258q12455k771911l726273J492157L338623r43908j292420
$$ 719571762 723165817 723094559 722282104 719510193 715783920 717276077 720614700 719670792 718378372
2337.7G18378372J419068p08161r43222K196045M97818k896805k886810q74405J960983
$$ 718378372 719797440 719089279 718146057 720342102 720839920 717943115 715056305 714181900 716142883
2346.3G16142883K347184k70539O29425Q61969j069336J838990L225021P53097j631317
$$ 716142883 718490067 718219528 718848953 719710922 718641586 720480576 723705597 724458694 722827377
2355G22827377l56140R85413J163940K074433o104203m530945L773346L239212J633301
$$ 722827377 722471237 723456650 724620590 726695023 720590820 716059875 719833221 723072433 724705734
2363.7G24705734J689911p36236n102616j317901J900787K815094J111069l836823
$$ 724705734 726395645 725659409 720556793 719238892 721139679 723954773 725065842 721229019
2371.4G21229019k918091R29184K78397k196961J040879L43323l35618J020890k089463
$$ 721229019 718310928 719240112 719518509 717321548 718362427 718705750 718370132 719391022 717301559
2380.1G17301559o25457O78177R99145J10931j614532r2316o35528L66287K77710j05591
$$ 717301559 716676102 717354279 718353424 718464355 716849823 716757507 716121979 716488266 716765976 716660385
2389.7G16660385Q95615N8059Q38700L5858L8834k59934k53982J029663p24411j94703
$$ 716660385 717556000 717614059 718452759 718488617 718527451 718267517 718013535 719043198 718318787 718124084
2399.4G18124084M40827l81928K88620J239472n99137k119903r0485L44239R92508
$$ 718124084 718564911 718182983 718471603 719711075 719111938 716992035 716901550 717245789 718238297
2408.1G18238297K30026j902542o00891J016082J352463N28870q40226j300201k31094
$$ 718238297 718468323 716565781 715964890 716980972 718333435 718862305 718022079 716721878 716490784
2416.7G16490784j23368p35550k51464P63626R35745j236496j467438J36566P55234
$$ 716490784 716367416 715631866 715380402 716144028 717079773 715843277 714375839 714512405 715267639
2425.4G15267639M79965J02845J43127J67236J454621Q5754k116165q51364k97089
$$ 715267639 715747604 715850449 715993576 716160812 717615433 717701187 715585022 714733658 714436569
2434.1G14436569j329880o15234O85577L3265J199035J075592l32565L59421j140671
$$ 714436569 713106689 712491455 713177032 713210297 714409332 715484924 715152359 715511780 714371109
2442.8G14371109p93915N99518r2926l16849J38703M21524r95789p31201L13797J95541
$$ 714371109 713577194 714176712 714083786 713766937 713905640 714327164 713331375 712600174 712913971 713109512
2452.4G13109512L34244j054382j404419J64413N33066o1722j015091j00631K492981
$$ 713109512 713443756 712389374 710984955 711149368 711682434 711620712 710605621 710504990 712997971
2461.1G12997971J364364j334381j454697n18417J32065Q5907k90222j018296M2344
$$ 712997971 714362335 713027954 711573257 711054840 711186905 711272812 710982590 709964294 710006638
2469.8G10006638Q12912l55378K86332N78231q52279j635208n47486q6593J5487O62995
$$ 710006638 710819550 710464172 710750504 711328735 710476456 708841248 708293762 708207169 708222656 708885651
2479.4G08885651q01697m07944Q19321L91693N26581M58145k90909k360077j483993
$$ 708885651 708083954 707676010 708495331 708887024 709413605 709871750 709580841 707220764 705736771
2488.1G05736771J847152J619110o44378j937180r93347M05121K89307n73960j108017
$$ 705736771 707583923 709203033 708558655 706621475 705628128 706033249 706322556 705748596 704640579
2496.8G04640579L48740J327057m76761j215286n4932P39517M29611l70864j98746
$$ 704640579 704989319 706316376 705839615 704624329 704569397 705308914 705738525 705367661 705168915
2505.5G05168915q30231j397858M77372J933746J197052j22604j152420j143265K64816
$$ 705168915 704338684 702940826 703418198 705351944 706548996 706426392 705273972 704130707 704395523
2514.1G04395523J65024J29242O06308j220474q25501J078110K6626j150055m83017
$$ 704395523 704560547 704689789 705296097 704075623 703250122 704328232 704354858 703204803 702721786
2522.8G02721786n42297M42047J894226r31396j956864j74408L96653J226730J196213
$$ 702721786 702179489 702621536 704515762 703584366 701627502 701453094 701849747 703076477 704272690
2531.5G04272690L21960n31234k13471r16290k772370j638031J034165J858215Q6365
$$ 704272690 704594650 704063416 703849945 702933655 700161285 698523254 699557419 701415634 701501999
2540.2G01501999p65991q6899p8812m48532M22135R69619r81445p03506O29653n6381
$$ 701501999 700736008 700649109 700570297 700121765 700543900 701513519 700532074 699828568 700458221 700401840
2549.8G00401840o47049K99759J311112j401978k073059R60083J092072l90473l27148
$$ 700401840 699754791 700054550 701365662 699963684 697890625 698850708 699942780 699552307 699225159
2558.5F99225159J58081j055603j389542n6534P39212R58710k2964l38746M46091J36795
$$ 699225159 699383240 698327637 696938095 696881561 697620773 698579483 698556519 698217773 698663864 698800659
2568.1F98800659o35528m33731M6539q28400n30014Q63571q61816j478806O19202K14386
$$ 698800659 698165131 697731400 697777939 696949539 696419525 697283096 696421280 694942474 695561676 695776062
2577.8F95776062R3155J636047R5520j534195o59942r92813N73043J593247j266632
$$ 695776062 695869217 697505264 697600784 696066589 695406647 694413834 694986877 696580124 695313492
2586.5F95313492r57108q4610l10821k47040j74255P65457L03268M48837q21456r26514
$$ 695313492 694356384 694271774 693960953 693713913 693539658 694305115 694608383 695057220 694235764 693309250
2596.1F93309250L15323j479950l98865j9455l66058O37359k41928p82852o90155N82581
$$ 693309250 693624573 692144623 691745758 691726303 691360245 691997604 691755676 690972824 690282669 690865250
2605.7F90865250N02166K67411j77918j825943l24325Q78524q1787j853180j455154
$$ 690865250 691367416 691634827 691456909 689630966 689306641 690185165 690103378 688250198 686795044
2614.4F86795044O59409L18298o85043o89087J079940Q95920o53305P29447P73315
$$ 686795044 687454453 687772751 687087708 686398621 687478561 688374481 687721176 688450623 689223938
2623.1F89223938r11560j275406n89752k37427o96106k61001N31463j60904m73099
$$ 689223938 688312378 687036972 686447220 686209793 685513687 685252686 685784149 685623245 685150146
2631.8F85150146M42048k45362j202392J57394J42441q56934J162415J134109j782608
$$ 685150146 685592194 685346832 684144440 684301834 684444275 683587341 684749756 685883865 684101257
2640.5F84101257k025451n49622K77557k07595p20368n15137N01862J217957n9967
$$ 684101257 682075806 681526184 681803741 681596146 680875778 680360641 680862503 682080460 682020493
2649.1F82020493j033860r96170n67322j024169j294861P40432Q95005l08991L02506
$$ 682020493 680986633 679990463 679423141 678398972 677104111 677844543 678739548 678430557 678733063
2657.8F78733063J62582N87311Q87527j812744j341171j07880k230682j470795M20075
$$ 678733063 678895645 679482956 680370483 678557739 677216568 677108688 674878006 673407211 673827286
2666.5F73827286R90600L59955r0332P87354j64337j157685m56390M97818r4300l63235
$$ 673827286 674817886 675177841 675087509 675874863 675710526 674552841 674096451 674594269 674499969 674136734
2676.1F74136734o06461j522293M7684M71878N76935J60065j457749k49405M41132
$$ 674136734 673530273 672007980 672055664 672527542 673104477 673264542 671806793 671557388 671998520
2684.8F71998520L77502l42331l57589Q81271m49829q49838k17972j38016K61154j062698
$$ 671998520 672376022 672033691 671676102 672557373 672107544 671257706 671039734 670901718 671162872 670100174
2694.5F70100174j881409J54877J794586q5449k436447r61533P66144O15768K93885
$$ 670100174 668218765 668373642 670168228 670082779 667646332 666684799 667450943 668066711 668360596
2703.1F68360596j006546j015778L23639R41620p0419j238862j9149p50122j060639
$$ 668360596 667354050 666338272 666661911 667603531 667533112 666294250 666275101 665524979 664464340
2711.8F64464340J470337J211014r06448j720429j320496r35134N6915K83661R155
$$ 664464340 665934677 667145691 666239243 664518814 663198318 662263184 662320099 662603760 662612915
2720.5F62612915L16849j079254j350098j14059J053619R20563q43506m13284K91290
$$ 662612915 662929764 661850510 660500412 660386353 661439972 662360535 661517029 661103745 661395035
2729.2F61395035l42331j81122r46121j573105N77850J016617j165848j637497n22995
$$ 661395035 661052704 660871582 659925461 658352356 658930206 659946823 658780975 657143478 656620483
2737.9F56620483q6517L43628J337051j248779k704620K01263R68399M9134L25317
$$ 656620483 656533966 656877594 658214645 656965866 654261246 654462509 655430908 655480042 655805359
2746.5F55805359J518555j71814k155228j528931m19845J404495L03039q55331P20368
$$ 655805359 657323914 657152100 654996872 653467941 653048096 654452591 654755630 653900299 654620667
2755.2F54620667Q14208p44552k94342J44729j782608j370010p07321N38101R95178
$$ 654620667 655434875 654690323 654395981 654540710 652758102 651388092 650680771 651218872 652214050
2763.9F52214050m28695J99203o44836o82144l09906j002884j550370m86297R56726
$$ 652214050 651785355 651984558 651339722 650657578 650347672 649344788 647794418 647308121 648264847
2772.6F48264847r32465N27954J894989R18732p63550l030853o86646P72553j86844
$$ 648264847 647332382 647860336 649755325 650674057 649910507 646879654 646193008 646965561 646778717
2781.3F46778717j485290o90842J57165k02942P98111j447753o27366J222916k80991
$$ 646778717 645293427 644602585 644759750 644556808 645354919 643907166 643279800 644502716 644221725
2789.9F44221725n56716j325989p55768l41873r18656j293373j289291o74286l46947
$$ 644221725 643665009 642339020 641583252 641241379 640322723 639029350 637740059 637065773 636718826
2798.6F36718826r68628p29446K082214N38979j783447o9046R5710o13021J24893m66805
$$ 636718826 635750198 635020752 637102966 637641945 635858498 635789452 635885162 635272141 635397034 634930229
2808.3F34930229k909889k47612J658707q95005j109962q97064q59375k045861p34481
$$ 634930229 632020340 631772728 633431435 632536430 631426468 630529404 629670029 627624168 626889687
2816.9F26889687K395820Q88443j384811j349793l42064n84220p36046q68721k49863
$$ 626889687 629285507 630173950 628789139 627439346 627097282 626513062 625777016 624908295 624658432
2825.6F24658432j39732k668915j302834P16362P4845p44171k295075k223053p63512
$$ 624658432 624518700 621849785 620546951 621263313 621338158 620593987 618298912 616075859 615312347
2834.3F15312347r8304m11949J55830r08165k457085j79748j111794m447937k459183
$$ 615312347 615214043 614802094 614957924 614049759 611592674 611412926 610301132 605853195 603394012
2843F03394012J08872j475830k366181j783332l153496k644539m85344p58286r59968
$$ 603394012 603502884 602027054 599660873 597877541 594724045 592079506 591594162 590835876 589875908
2851.7E89875908o35948m66576l68652j622925j263657P19414J87874m50440J162301
$$ 589875908 589239960 588773384 588404732 586781807 585518150 586237564 586425438 585974998 587137299
2860.3E87137299J006736j314315j561814l85284n1995q96377k315827j986579J80587
$$ 587137299 588144035 586829720 585267906 584882622 584830627 583934250 581618423 579631844 579812431
2869E79812431O51665r62028j167107j118965j588783j211052j16349K42424j294098
$$ 579812431 580464096 579502068 578334961 577215996 575627213 574416161 574299812 574542236 573248138
2877.7E73248138j076850k43607P50694J533509k09084j415977k857552j060867Q65211
$$ 573248138 572171288 571927681 572678375 574211884 574002800 572586823 569729271 568668404 569533615
2886.4E69533615l53775M69170k033005l884621j271972J17721k91939o65779J52397
$$ 569533615 569179840 569649010 567616005 563731384 562459412 562577133 562285194 561619415 561771812
2895.1E61771812o0806p26242k532883l217735j276893n37987j61858P68013J901245
$$ 561771812 561711006 560984764 558451881 555234146 553957253 553419266 553257408 554025421 555926666
2903.7E55926666j52702j987114p34329p02210j112442j196937J05896j99204j325950
$$ 555926666 555773964 553786850 553052521 552350311 551237869 550040932 550146828 549947624 548621674
2912.4E48621674r27201j456108q10127j720162k936134p48863P06444J75094m46548
$$ 548621674 547694473 546238365 545428238 543708076 540771942 540023079 540729523 540904617 540458069
2921.1E40458069m99497l97110l53775q04824r04694l60870M37889K77519l81203K10495
$$ 540458069 539958572 539561462 539207687 538402863 537498169 537137299 537575188 537852707 537471504 537681999
2930.7E37681999J208878J235161j049271q84514M33693J82266J849709J165161N2414
$$ 537681999 538890877 540126038 539076767 538192253 538625946 538808212 540657921 541823082 541875496
2939.4E41875496J454811J704941J02844n17807O58722J8730J39160Q34122J84174
$$ 541875496 543330307 545035248 545138092 544620285 545279007 545297737 545436897 546271019 546455193
2948.1E46455193p05224j426734m34685r71985o05888J779174R58710r11522j265831
$$ 546455193 545749969 544323235 543888550 542916565 542310677 544089851 545048561 544137039 542871208
2956.8E42871208j74026Q27446N80787J83182K39105m16374J412K273445Q13446j163941
$$ 542871208 542697182 543524628 544105415 544288597 544527702 544111328 544112740 546386185 547199631 546035690
2966.4E46035690J02578J67350P88575J779899J062965J627274J326370k89917J072579
$$ 546035690 546138268 546305618 547094193 548874092 549937057 551564331 552890701 552600784 553673363
2975.1E53673363J715278n61485k61993K258491K604981P33680l13339R89494J187020
$$ 553673363 555388641 554827156 554565163 556823654 559428635 560162315 559848976 560838470 562025490
2983.8E62025490J094131J700630r9716Q00553L095321J672440j640K87437J619339
$$ 562025490 563119621 564820251 564720535 565521088 568616409 570288849 570287209 570574646 572193985
2992.5E72193985r05151j702538K383423J817436j190529j614608L62739J072502L05977
$$ 572193985 571288834 569586296 571969719 573787155 572596626 570982018 571344757 572417259 572723236
3001.1E72723236J375389K62604q28285J031646M34494j271896l967M77714m87480
$$ 572723236 574098625 574361229 573532944 574564590 574999084 573727188 573723221 574200935 573713455
3009.8E73713455o21490m69170J53771j366845j612091j77345o30493O65359L98827
$$ 573713455 573091965 572622795 572776566 571409721 569797630 569620285 568989792 569655151 570053978
3018.5E70053978j64108N22575j111679n85251P28951N65185J30730p26204j356545
$$ 570053978 569889870 570412445 569300766 568715515 569444466 570009651 570140381 569414177 568057632
3027.2E68057632j262092L38135Q06083K17781o61544j853371j311874r94301j153603
$$ 568057632 566795540 567133675 567939758 568157539 567495995 565642624 564330750 563336449 562182846
3035.9E62182846j032715J18180Q99162n79758l56636p10373j486168L57628l22380
$$ 562182846 561150131 561268311 562167473 561587715 561231079 560520706 559034538 559392166 559069786
3044.5E59069786j099892n96428j441497j91880K04049q87566N84907M39454p94373
$$ 559069786 557969894 557373466 555931969 555740089 555944138 555056572 555641479 556080933 555286560
3053.2E55286560r30939k053527j003342Q87718j48544j572838o70471M30984j544685
$$ 555286560 554355621 552302094 551298752 552186470 552037926 550465088 549794617 550225601 548680916
3061.9E48680916j763306Q39K55051j44730j856651j558914P5874J09291L86238n31692
$$ 548680916 546917610 546918449 547173500 547028770 545172119 543613205 543689079 543798370 544184608 543652916
3071.5E43652916j731186l09372Q83293j54953k51846k70386j746254j797104N28908
$$ 543652916 541921730 541612358 542495651 542340698 542088852 541818466 540072212 538275108 538804016
3080.2E38804016R00726j861267j617355N86243J160011o01807j929474n0392O47354
$$ 538804016 539704742 537843475 536226120 536812363 537972374 537370567 535441093 535390701 536038055
3088.9E36038055Q99926m02565j805077o85234j396370j810417q13980K46811p59735
$$ 536038055 536937981 536535416 534730339 534045105 532648735 530838318 530024338 530271149 529511414
3097.6E29511414j8235J934395l19633j464348k087403j115188n06172j389962j33209
$$ 529511414 529493179 531427574 531107941 529643593 527556190 526441002 525934830 524544868 524411659
3106.2E24411659n45883M01764m45366j779442m21066o57921P9842j225090j510392
$$ 524411659 523865776 524267540 523822174 522042732 521621666 520963745 521043587 519818497 518308105
3114.9E18308105j35650n54581K30293m98809j546402l49007J102295m34952k079086
$$ 518308105 518172455 517617874 517848167 517349358 515802956 515453949 516556244 516121292 514042206
3123.6E14042206m60167n69801k182198j536102Q36410J215210n23949j605949j495094
$$ 514042206 513582039 513012238 510830040 509293938 510130348 511345558 510821609 509215660 507720566
3132.3E07720566j237335n90592k57149j485939p26394m92668j374817j39389l49465
$$ 507720566 506483231 505892639 505635490 504149551 503423157 502930489 501555672 501416283 501066818
3141E01066818q80546q20961n61295o76002r46961m86946k361183j961746R47265P46727
$$ 501066818 500186272 499365311 498804016 498128014 497181053 496694107 494332924 492371178 493318443 494065170
3150.6D94065170l13949j114350n81512o70166l018570r68170J602249j211891k351876
$$ 494065170 493751221 492636871 492055359 491385193 488366623 487398453 489000702 487788811 485436935
3159.3D85436935n22918M55551l14179j139984j262512j939773p84722n87730k324181
$$ 485436935 484914017 485369568 485055389 483915405 482652893 480713120 479928398 479340668 477016487
3168D77016487m50516J277657p80144r99527k20032j679878j417083j165429r64203
$$ 477016487 476565971 477843628 477063484 476063957 475843925 474164047 472746964 471581535 470617332
3176.6D70617332j82571j133842k13128L54805n55572j140633r91592j200562k698288
$$ 470617332 470434761 469300919 469087791 469442596 468887024 467746391 466754799 465554237 462855949
3185.3D62855949n85708P95936q61549j359901r50547m41131j257439q54607l18069
$$ 462855949 462270241 463066177 462204628 460844727 459894180 459453049 458195610 457341003 457022934
3194D57022934r53560r29260o26297O0730n16243j062432r16137k57225J4648j601028
$$ 457022934 456069374 455140114 454513817 454574547 454058304 452995872 452079735 451822510 451837158 450236130
3203.6D50236130j827317q10546n89142r15222j421853j736526o82602j47896j153145
$$ 450236130 448408813 447598267 447009125 446093903 444672050 442935524 442252922 442105026 440951881
3212.3D40951881Q3657N37033q16193r9335R1362p95784p68547r60159j647186j115914
$$ 440951881 441035538 441572571 440756378 440657043 440748405 439952621 439184074 438223915 436576729 435460815
3222D35460815k45552q76655j519852K66762J589546k47116j738396k511406k462349
$$ 435460815 435215263 434338608 432818756 433085518 434675064 434427948 432689552 430178146 427715797
3230.7D27715797l76129K98233j368789j069413Q65441p62024k416306j126518K48909
$$ 427715797 427339668 427637901 426269112 425199699 426065140 425303116 422886810 421760292 422009201
3239.3D22009201J261330p47528k429200L19977J583481n64384k306137k459221j037674
$$ 422009201 423270531 422523003 420093803 420413780 421997261 421432877 419126740 416667519 415629845
3248D15629845L51295j21231k64778k32887j116486j329460l02849M9400k010803k160682
$$ 415629845 415981140 415859909 415595131 415362244 414245758 412916298 412613449 412662849 410652046 408491364
3257.7D08491364O2599L7880j28441J5182j9111P53364Q9722j06659N23338j860084
$$ 408491364 408553963 408591843 408463402 408478584 408459473 409212837 409302559 409195900 409719238 407859154
3267.3D07859154l309555j96457J464844j193314k154236M0131K44484k002907j978302
$$ 407859154 404549599 404353142 405817986 404624672 402470436 402510567 402755051 400752144 398773842
3276C98773842k90489l61863j03263J220092R73282j450615j798744M22936o23055
$$ 398773842 398483353 398121490 398018227 399238319 400211601 398760986 396962242 397385178 396762123
3284.7C96762123o35033N51491r74808q33053j138496j370202Q6594J35193p50465
$$ 396762123 396127090 396678581 395703773 394870720 393732224 392362022 392448616 392583809 391833344
3293.3C91833344j036377j17913j33781o57120o72188j88064P6027k77558N71709p5531
$$ 391833344 390796967 390679054 390545273 389888153 389215965 389027901 389103928 388826370 389398079 389322548
3303C89322548j164322j431198j825829n47027o0272R994O07338J63879r22889j484795
$$ 389322548 388158226 386727028 384901199 384354172 384293900 384303894 384911232 385075111 384152222 382667427
3312.6C82667427j58768j60331k727547k489281k50244r51805q10280J095009l45764
$$ 382667427 382508659 382348328 379620781 377131500 376881256 375929451 375119171 376214180 375868416
3321.3C75868416k071152p39632Q94547Q11691m99954j304817j302529q25538L43551
$$ 375868416 373797264 373057632 373952179 374763870 374263916 372959099 371656570 370831032 371174583
3330C71174583n62820j977386r25980o12755l64609l13377K11410N82886k459602k753601
$$ 371174583 370611763 368634377 367708397 367095642 366731033 366417656 366629066 367211952 364752350 361998749
3339.6C61998749l11623N15976n67970j588593j167526j589737q10852K31094R9678
$$ 361998749 361687126 362203102 361635132 360046539 358879013 357289276 356478424 356709518 356809196
3348.3C56809196j179657j957817j258506j326790P16514R95942L64570o68030k911682
$$ 356809196 355629539 353671722 352413216 351086426 351802940 352798882 353163452 352495422 349583740
3357C49583740L1739j085206k708931Q16956J742744J423951k230950m175415j838722
$$ 349583740 349615479 348530273 345821342 346638298 348381042 349804993 347574043 343398628 341559906
3365.7C41559906m63829J452522J558724p05147k796059k524185K8420M23278j200485
$$ 341559906 341096077 342548599 344107323 343402176 340606117 338081932 338110352 338533630 337333145
3374.3C37333145j526718n59196O8626o48804j445122j141090p64313P78923O35376
$$ 337333145 335806427 335247231 335315857 334667053 333221931 332080841 331316528 332095451 332730827
3383C32730827j929435j174279L02735K35100M50897j69449j333771q41827Q16650
$$ 332730827 330801392 329627113 329929848 330164948 330615845 330446396 329112625 328270798 329087448
3391.7C29087448p4501j293754m93241q52051j039695r49707j424103l97110K46620
$$ 329087448 329012947 327719193 327225952 326373901 325334206 324384499 322960396 322563286 322809906
3400.4C22809906l07655j72272K76565j63345j453400r16404O23245M62379k35176
$$ 322809906 322502251 322329979 322606544 322443199 320989799 320073395 320696640 321159019 320923843
3409.1C20923843m00467n96370o48804O13651J2074j088638L86009N09243O2942q99410
$$ 320923843 320523376 319927006 319278202 319891853 319903927 318815289 319201298 319710541 319773483 318874073
3418.7C18874073q75149M22211o51016P59887K605591J15509k239799l69950J118317
$$ 318874073 317998924 318421135 317770119 318530006 321135597 321251106 319011307 318641357 319759674
3427.4C19759674j498070n71079K220726Q42648j146317j102085J80893P3204k24209
$$ 319759674 318261604 317690525 319911251 320753899 319607582 318505497 318686390 318759594 318535385
3436.1C18535385k48089j167297N5180P64446j41411Q6899N94368J886806J461563
$$ 318535385 318287296 317119999 317175179 317939625 317798214 317885113 318479481 320366287 321827850
3444.7C21827850k44751m10957o22330Q7090M64668R30977P18651j087799k57149J268196
$$ 321827850 321583099 321172142 320549812 320636902 321101570 322032547 322751198 321663399 321406250 322674446
3454.4C22674446K333183J348763j080933M57955J529121P68318j28021j845512k55051
$$ 322674446 325007629 326356392 325275459 325733414 327262535 328030853 327902832 326057320 325802269
3463.1C25802269J657104N73082N62172R2316j46179J379280R10950J071701J434326
$$ 325802269 327459373 328032455 328594627 328686943 328540764 329920044 330830994 331902695 333337021
3471.7C33337021J088524M11186j212540P67517J371842K46734R17054M05235J143913
$$ 333337021 334425545 334836731 333624191 334391708 335763550 336010284 336927338 337332573 338476486
3480.4C38476486N12085q51364J19286N72319J023216R18541J072578N15328j139450
$$ 338476486 338988571 338137207 338256493 338828812 339852028 340770569 341843147 342358475 341219025
3489.1C41219025L10974K032013J004829k05536K060K473869L676110K80075k083054
$$ 341219025 341529999 343562012 344566841 344361305 344363365 346837234 350513344 350793419 348710365
3497.8C48710365j554260L65219J352463Q71048J508598J55182k82783J445541J109657
$$ 348710365 347156105 347521324 348873787 349744835 351253433 351408615 351125832 352571373 353681030
3506.5C53681030R68361J645432O56357o06843N99709J393967J673927J121368K4453
$$ 353681030 354649391 356294823 356951180 356344337 356944046 358338013 360011940 361133308 361157761
3515.1C61157761j31150J48316J259613O24771J064415K988319J893273o63262o15806
$$ 361157761 361026611 361174927 362434540 363059311 364123726 367112045 369005318 368342056 367726250
3523.8C67726250K815017J884613m65126L46222j25007m39453J038513J886825J429749
$$ 367726250 370541267 372425880 371960754 372306976 372181969 371742516 372781029 374667854 376097603
3532.5C76097603N67741l11737J348572J339111j05476K112846J189881J051330N19791
$$ 376097603 376665344 376353607 377702179 379041290 378935814 381048660 382238541 383289871 383809662
3541.2C83809662p39021L408317K970696p79305Q05359K711563J08528n95703K011223
$$ 383809662 383070641 386478958 389449654 388670349 389475708 392187271 392295799 391700096 393711319
3549.9C93711319K594604J706810k9220N86700l13492l58695L200721K357064n5733
$$ 393711319 396305923 398012733 397983513 398570213 398256721 397898026 401098747 403455811 403400078
3558.5D03400078L47290P38983J115265M837723K403526l058052K479629J949616k388458
$$ 403400078 403747368 404486351 405601616 410439339 412842865 409784813 412264442 414214058 411825600
3567.2D11825600J294403K794265K477570L04947J200256K296601K158241J486816
$$ 411825600 413120003 415914268 418391838 418696785 419897041 422193642 424351883 425838699
3574.9D25838699J124268R59473K72331L085403R16672p91168K127342K415695Q54721
$$ 425838699 426962967 427922440 428194771 431280174 432196846 431405678 433533020 435948715 436803436
3583.6D36803436R89495O201362K637291k753296K966385q22105N81627K888870K993698
$$ 436803436 437792931 443994293 446631584 443878288 446844673 446022568 446604195 449493065 452486763
3592.3D52486763R68704J269341L589859q89054J601868L953438K677574K502136Q7548
$$ 452486763 453455467 454724808 458314667 457425613 459027481 462980919 465658493 468160629 468248177
3601D68248177j41259P83043J632118J933175M614601N182991l82271K372589Q93593
$$ 468248177 468106918 468889961 470522079 472455254 477069855 482252846 481870575 484243164 485136757
3609.6D85136757l22495N835305K500763l281365J802559J275520K094498L933830
$$ 485136757 484814262 490649567 493150330 489868965 491671524 492947044 495041542 498975372
3617.4D98975372J761589K252846r59625l95088L559456K055702K609520M221039L880844
$$ 498975372 500736961 502989807 502030182 501635094 505194550 507250252 509859772 514080811 517961655
3626E17961655K773628M378586N78003p755967N384789M855347M379692J225471j531524
$$ 517961655 520735283 525113869 525691872 517935905 523320694 528176041 532555733 533781204 532249680
3634.7E32249680M418144K286224K107964L406448J599350K473793K295189J940918
$$ 532249680 536667824 538954048 541062012 544468460 546067810 548541603 550836792 552777710
3642.4E52777710l67394O3973M239159P753830J773529m216919O193962K451935l546830
$$ 552777710 552410316 552474289 556713448 564467278 566240807 562023888 568217850 570669785 567122955
3651.1E67122955q35838M308929M819222M471283O105499n032272l07770M342728K476921
$$ 567122955 566287117 570596046 575415268 579886551 585992050 580959778 580652008 584994736 587471657
3659.8E87471657K908439P60537K417831M96330j002731N95283K228928O370278J545639
$$ 587471657 590380096 591140633 593558464 594054794 593052063 593647346 595876274 602246552 603792191
3668.5F03792191J87950L148651p478295L358422P607383N840111J522484j2847595
$$ 603792191 603980141 607128792 599650497 603008919 610616302 616456413 617978897 605131302
3676.2F05131302K326202O786766K062149j219787J473694K158737R65690Q9760M26750
$$ 605131302 607457504 614244270 616306419 615086632 616560326 618719063 619684753 619774513 620201263
3684.9F20201263J228753K503814M909096n430031n700760N629349k616844R63211
$$ 620201263 621430016 623933830 628842926 623412895 617712135 623341484 620724640 621687851
3692.6F21687851O112289j02119k33727M56963N67856J831245K88086L177300M281082
$$ 621687851 627800140 627698021 627464294 627921257 628489113 630320358 630608444 633785744 638066826
3701.3F38066826n385361m128265M230308K649842J07269K69890M022751P526969l763046
$$ 638066826 632681465 628553200 632783508 635433350 635540619 635810509 639833260 647360229 643597183
3709.9F43597183J999665N172271j4996910k9144M478569J677399O91604N55573P64389
$$ 643597183 645596848 650769119 635772209 635743065 640221634 641899033 642590637 643146210 643910599
3718.6F43910599l76663K31246K206803j632080l793564K067261J201400K520829j90125
$$ 643910599 643533936 643765182 645971985 644339905 640546341 642613602 643815002 646335831 646145706
3727.3F46145706j627350K314911J359711P388153j085663j1789703P276153N184937
$$ 646145706 644518356 646833267 648192978 655581131 654495468 642705765 649981918 655166855
3735F55166855o901932n053329J428299L014755K093658J613312m059219J504669R803390
$$ 655166855 648264923 643211594 644639893 647654648 649748306 651361618 647302399 648807068 658610458
3743.7F58610458l430404j6992874N932617N168380P309189k73437j3539734J2588882
$$ 658610458 655180054 638187180 644119797 649288177 656597366 656323929 642784195 655373077
3751.4F55373077J361237j2120514N067291L591690J526947n020675K113571O739807
$$ 655373077 656734314 644613800 649681091 653272781 654799728 649779053 651892624 658632431
3759.1F58632431p396469k694016N785218J558838j823197L351364j584091n090408
$$ 658632431 651235962 648541946 654327164 655886002 654062805 657414169 655830078 650739670
3766.8F50739670K799377L130188M82636o547470J4495K891007J432877K771835K49405
$$ 650739670 653539047 656669235 657151871 650604401 650618896 653509903 654942780 657714615 657964020
3775.5F57964020j446381j96304M173813J437683p392502j217880M00848K739639J930466
$$ 657964020 656517639 656321335 660495148 661932831 654540329 653322449 653723297 656462936 658393402
3784.2F58393402n099106j524582K693406K903442K764892P86973j379471j558304
$$ 658393402 653294296 651769714 654463120 657366562 660131454 660918427 659538956 657980652
3791.9F57980652J45569o50025J92185L094635m860459n495300L263474L687439O043853
$$ 657980652 658126221 657476196 657668381 660763016 655902557 650407257 653670731 657358170 663402023
3800.6F63402023p68585r311371J239319L21808M387436O285629q471451l209304M357223
$$ 663402023 662633438 653322067 654561386 654883194 659270630 665556259 657084808 653875504 658232727
3809.3F58232727N76553j764373N96313K225723N61905K936554k104263j2674103M049454
$$ 658232727 658809280 657044907 657641220 659866943 660428848 663365402 661261139 648587036 652636490
3817.9F52636490N463257N012817O569977j2958374m638596K598572l44162J749954
$$ 652636490 658099747 663112564 669682541 656724167 652085571 654684143 654339981 656089935
3825.7F56089935M775238r18045p34405R56344Q33664J082993p829208M32434P899093
$$ 656089935 660865173 659947128 659212723 660169067 661002731 662085724 654256516 654688950 662588043
3834.3F62588043k586593j285477P702866q075028q438263P134476k235184p86285
$$ 662588043 660001450 658715973 666418839 658343811 649905548 657040024 654804840 654018555
3842.1F54018555N762100o92062j828003N53131k22397Q82034K976685n36652Q81653
$$ 654018555 659780655 659088593 657260590 657813721 657591324 658473358 661450043 660913391 661795044
3850.7F61795044L591614j0599060M002227r693832m315033J1590881J040345j029740
$$ 661795044 665386658 654787598 658789825 649095993 644780960 656371841 657412186 656382446
3858.4F56382446K348481J343231K809295o014785k691803N234375k977524n255661
$$ 656382446 658730927 660074158 662883453 656868668 654176865 659411240 656433716 651178055
3866.2F51178055L290634O203690Q145599l707733j3013459J606904O585998L962021
$$ 651178055 654468689 660672379 668817978 665110245 652096786 653703690 660289688 664251709
3873.9F64251709j0991974j064606N799408K53754O25153L649826k983628p407913
$$ 664251709 653259735 652195129 657994537 658248291 658873444 662523270 659539642 652131729
3881.6F52131729M263458L108521K190246N706711j1952591o49871L603973o52542
$$ 652131729 656395187 659503708 661693954 667400665 655448074 654798203 658402176 657749634
3889.3F57749634L231735k541656n900193K578583K663498p45010q4229m53110K133484
$$ 657749634 660981369 658439713 652539520 655118103 657781601 657036591 656952362 656499252 658632736
3898F58632736L719559q073578K930450M72107n999527P535401j107559l574677Q44269
$$ 658632736 662352295 654278717 657209167 657681274 651681747 659217148 658109589 654534912 655379181
3906.7F55379181J588440K648239J7090J46179j152801L80325J014862o52466J738663
$$ 655379181 656967621 659615860 659632950 659779129 658626328 659006653 660021515 659369049 661107712
3915.3F61107712K757721k288895p084045N19256J854019k210235J639099J300507
$$ 661107712 663865433 661576538 654492493 655011749 656865768 654655533 656294632 657595139
3923.1F57595139M65316n31158l066940k74659J290436J433869j622620j325913L723298
$$ 657595139 658060455 657529297 654462357 654187698 655478134 656912003 655289383 653963470 657686768
3931.7F57686768j207734l630905J894226K059174Q63113p22198p41654k3574j163559
$$ 657686768 656479034 652848129 654742355 656801529 657664642 656942444 656200790 656177216 655013657
3940.4F55013657J878128K082061l499984k404633P3090K371292K881317k098084j718902
$$ 655013657 656891785 658973846 655473862 653069229 653142319 655513611 658394928 656296844 654577942
3949.1F54577942Q17413K92969J600113j59378k304917p57370J103974P62405j705856
$$ 654577942 655395355 655688324 657288437 657129059 654824142 654066772 655170746 655933151 654227295
3957.8F54227295q85925P0114k24610L45307P53097J056366J099320J268768j756897
$$ 654227295 653341370 653411484 653186874 653532181 654285278 655341644 656440964 657709732 655952835
3966.5F55952835k829361J23596M91333J388016R08890l83225M4480o63986P30438
$$ 655952835 653123474 653247070 653738403 655126419 656035309 655652084 655696564 655032578 655763016
3975.1F55763016J359939o34308j424331k02790J600800L73993l30353m56619k270432
$$ 655763016 657122955 656488647 655064316 654861526 656462326 656836319 656505966 656049347 653778915
3983.8F53778915k4643J930314j072541j708297J467132K406082J023407r08432k398834
$$ 653778915 653754272 655684586 654612045 652903748 654370880 656776962 657800369 656891937 654493103
3992.5F54493103O15921K332306j459503k190476O16608J729202J76163j171951
$$ 654493103 655109024 657441330 655981827 653791351 654407959 656137161 656313324 655141373
4000.2F55141373
$$ 655141373
##END=$$ End of the data block
