##TITLE=$$ Begin of the data block
##JCAMP-DX=5.00 $$ ACD/SpecManager v 10.08
##SPECTROMETER/DATA SYSTEM=Varian
##DATE=07 Jan 2013 10:56:42
##DATA TYPE=INFRARED SPECTRUM
##DATA CLASS=XYDATA
##ORIGIN=
##OWNER=
##NPOINTS=3735
##FIRSTX=399.26403809
##LASTX=4000.35498047
##MAXX=4000.35498047
##MINX=399.26403809
##MAXY=102.81091309
##MINY=9.14219952
##XFACTOR=1.0000000000
##YFACTOR=0.000001000000000
##FIRSTY=43.40581512
##DELTAX=0.96440572
##XUNITS=1/CM
##YUNITS=TRANSMITTANCE
##XYDATA=(X++(Y..Y))
399.3D3405815O067131J6239098r903668j6046467l206611K1692203J741997j0349834
$$ 43405815 49472946 65712044 55808376 39761909 36555298 58247501 59989498 49639664
407D9639664m10313R644157Q100399o664466K979564O253285j1639141j2698452l882115
$$ 49639664 49229351 58873508 66973907 60309441 63289005 69542290 57903149 45204697 41322582
415.7D1322582o25000J1195656N0917675l1646995k7724923m303947n404377J3980495
$$ 41322582 40697582 51893238 102810913 71163918 43438995 39135048 33730671 47711166
423.4D7711166J1977955j1954738k724194K938610k800724R806717M845440j0458187
$$ 47711166 59689121 47734383 45010189 47948799 45148075 54954792 59800232 49342045
431.1D9342045k405930N595867P074994M677539l588356r449279k852108L978881r77531
$$ 49342045 46936115 52531982 59606976 64284515 60696159 51246880 48394772 52373653 51396122
439.8E1396122k378468K718163N212250J246414o873287l79013O272956k031223n210747
$$ 51396122 49017654 51735817 56948067 58194481 51321194 50942181 57215137 55183914 49973167
448.4D9973167o259937J810135N634419K006862L673760l13923K933265k426830q029835
$$ 49973167 43713230 45523365 51157784 53164646 56838406 56524483 59457748 57030918 49001083
457.1D9001083J572049o17726J418080N515003Q16631n003410k360985L101765l256573
$$ 49001083 50573132 49955406 51373486 56888489 57705120 52701710 50340725 53442490 50185917
465.8E0185917m464535M728180O962929m506691q005222k989884K206848P223080M246216
$$ 50185917 45721382 50449562 57412491 52905800 44900578 41910694 44117542 51340622 55586838
474.5E5586838P42279n911835k126682O040912K082562Q12622j80801o677365k814804
$$ 55586838 56329117 50417282 48290600 54331512 56414074 57226696 57045895 50368530 47553726
483.2D7553726j250522o665780J513161O738716M446251R54975j569591O850723K89944
$$ 47553726 46303204 39637424 41150585 47889301 52335552 53290527 51720936 58571659 58861603
491.8E8861603n756874k634640l544125M389691K15618k148247N116612K544906K619965
$$ 58861603 53104729 50470089 46925964 51315655 51531273 49383026 54499638 57044544 59664509
500.5E9664509j129299p157063o45279K439450r89743R15005l2826l165943K117436
$$ 59664509 58535210 51378147 50732868 53172318 52182575 53097580 53064754 49898811 52016247
509.2E2016247J311390O94298J572044k420792m189613j662571K115139o73489M22299
$$ 52016247 53327637 54021935 55593979 53173187 48983574 47321003 49436142 48762653 49184952
517.9D9184952K44846m991485l27130L987869M24977j28071K124783J340213r92176
$$ 49184952 49429798 44438313 44111183 48099052 48524029 48395958 50520741 51860954 50868778
526.6E0868778o12907j217564M6120L714729j910377n566010P62848J903271O67312
$$ 50868778 50255871 49038307 49084427 52799156 50888779 45322769 46085617 47988888 48656200
535.2D8656200k5024P72614M85664j419987Q84888n97500r96418j98074J09562K613441
$$ 48656200 48631176 49403790 49889454 48469467 49354355 48756855 47760437 47562363 47671925 50285366
544.9E0285366M8233l32165K06021N94967K086898o45591k377026L44585J779675j891102
$$ 50285366 50333599 50001434 50207455 50802422 52889320 52243729 49866703 50211288 51990963 50099861
554.5E0099861k087009O4163J524242J575608j049729j705307j137459K105256m0154
$$ 50099861 48012852 48077015 49601257 51176865 50127136 48421829 47284370 49389626 49349472
563.2D9349472j914749K356815P97936q14461k69650m94094q62191J81187l15678j479248
$$ 49349472 47434723 49791538 50589474 49775013 49505363 49011269 48149078 48330265 48014587 46535339
572.9D6535339J651127J486572k72914m47503L3677K41645l65451N87886k38166j60534
$$ 46535339 48186466 49673038 49400124 48952621 48986298 49227943 48862492 49450378 49212212 49051678
582.5D9051678l66261o1714L23494j750744k61421K037529K514606J73401r67678O96999
$$ 49051678 48685417 48623703 48947197 47196453 46935032 48972561 51487167 51660568 50692890 51389889
592.1E1389889k31686m78123Q0094p13604j655750M3659J193401l92639j602917j653080
$$ 51389889 51158203 50680080 50760174 50046570 48390820 48434479 49627880 49235241 47632324 45979244
601.8D5979244q37600p50996J632713L429005p95220l442318j568428k26482j573063
$$ 45979244 45141644 44390648 46023361 49452366 48657146 45214828 43646400 43419918 41846855
610.5D1846855j371834j238140l279251j170555K077969J689170n19111j568955p18757
$$ 41846855 40475021 39236881 35957630 34787075 36865044 38554214 38035103 36466148 35747391
619.2C5747391m06025r6905o2710j690758j386653k11890k04363R60213J700848L287010
$$ 35747391 35341366 35244461 35181751 33490993 32104340 31892450 31688087 32648300 34349148 37636158
628.8C7636158M252571R45347q97930q08697l98117K63329J71855p64194j049019p2861
$$ 37636158 41888729 42834076 41936146 41127449 40729332 40992661 41164516 40400322 39351303 39278442
638.4C9278442q47786q44577N94322J522194K148430K064762J896732J228085J270992
$$ 39278442 38430656 37586079 38180401 39702595 41851025 43915787 45812519 47040604 48311596
647.1D8311596n4134o13080J365525J110794N02033N31719j88041j1139R83444j06083
$$ 48311596 48257462 47644382 49009907 50120701 50622734 51154453 50966412 50955273 51938717 51832634
656.8E1832634r90253J52103M01443p0190L73405J312775N98946o69209j240734r60987
$$ 51832634 50842381 50994484 51395927 51325737 51699142 53011917 53610863 52941654 51700920 50739933
666.4E0739933L49083J224697R2545J244266N94467m27543R16607O2172j620587o58939
$$ 50739933 51089016 52313713 52406258 53650524 54244991 53817448 54734055 54796227 53175640 52516701
676.1E2516701Q5586K086266K023228n36190j157017p15454q1452p1377J94718J60259
$$ 52516701 52602287 54688553 56711781 56175591 55018574 54303120 54221668 54150291 54345009 54505268
685.7E4505268n19451j014175n70954l23562o37379J75415m85218N0819J190495K41592
$$ 54505268 53985817 52971642 52400688 52077126 51439747 51615162 51129944 51180763 52371258 52612850
695.3E2612850Q995p26875j103535m81975N14980N02323M64699Q33923l57692M74212
$$ 52612850 52621845 51894970 50791435 50309460 50824440 51326763 51791462 52625385 52267693 52741905
705E2741905M37988q17798q881J136364J204186m89205q35483j178124p28512O67828
$$ 52741905 53179893 52362095 52353214 53489578 54693764 54204559 53369076 52190952 51462440 52130268
714.6E2130268J50620R73884O10657n47112L91171L16238M24858J310769L27938r10492
$$ 52130268 52280888 53254772 53865429 53318317 53709488 54025726 54450584 55761353 56089291 55178799
724.3E5178799o11924J82271P53162m57470j360008j43486P03083P63767N5393o06689
$$ 55178799 54566875 54749146 55502308 55044838 53684830 53541344 54244427 55008194 55063587 54456898
733.9E4456898K26219O30814n18551k13459M84241n51582l29636p7312q96416M2576
$$ 54456898 54683117 55313931 54795380 54581921 55066162 54514580 54184944 54107632 53211216 53253792
743.6E3253792J602302Q46199q1493n4928j324161m30218K076576J624603n11093j110122
$$ 53253792 54856094 55702293 55620800 55565872 54241711 53811493 55888069 57512672 57001579 55891457
753.2E5891457K61436M81159L50968O84906O0955k41715J03329N63801L70407N9284
$$ 55891457 56152893 56634052 56985020 57669926 57730881 57489166 57592495 58156296 58526703 58585987
762.8E8585987j70067n87841o8447n7670o42266k08900o4499J33442J107593J019280
$$ 58585987 58415920 57828079 57759632 57701962 57059696 56850796 56786297 56919739 58027332 59046612
772.5E9046612l08777p11147L76350P13062M52366L03383q59810p33517R33030J230400
$$ 59046612 58737835 58026688 58403038 59116100 59568466 59871849 59012039 58278522 59211552 60441952
782.1F0441952j32736k57546M03862l39195L99929O31229m33716m2121j32637O55250
$$ 60441952 60309216 60051670 60455532 60116337 60516266 61147495 60713779 60671658 60539021 61194271
791.8F1194271N29747j152695j32896L20587o45668l37711j83922L3237O94390M80835
$$ 61194271 61724018 60571323 60438427 60759014 60113346 59775635 59591713 59624950 60319340 60800175
801.4F0800175m3221k2518K10537L59264j98555j86130P19242M17240K16019k32125
$$ 60800175 60756954 60734436 60944973 61304237 61105682 60919552 61638794 62056034 62272053 62039928
811.1F2039928j048210M22684Q56674k06035p05834r37301P18284J571510K22764m03264
$$ 62039928 60991718 61414402 62271076 62065041 61359207 60421906 61140190 62711700 62934464 62531200
820.7F2531200l00308n71903m76631K10972J02440J35196m8885q08285q04317l08930
$$ 62531200 62230892 61658989 61182358 61393330 61495770 61630966 61582081 60773796 59969479 59660549
830.4E9660549M63162L87474k82864o77517o65783K21382L11436r82899q69995k33703
$$ 59660549 60123711 60511185 60228321 59550804 58885021 59106403 59417839 58434940 57564945 57331242
840E7331242p46251Q9074L53515p79636m39762J91932j75224n03334K43393K53677
$$ 57331242 56584991 56674065 57027580 56247944 55808182 56000114 55824890 55321556 55564949 55818626
849.6E5818626J19580L97636j95934R0767M00852O34506P12799N86819P76501l17547
$$ 55818626 55938206 56335842 56139908 56230675 56631527 57266033 57978832 58565651 59342152 59024605
859.3E9024605k65511Q14926M89128l0143N93456Q04825k52743k48592L03310j24336
$$ 59024605 58759094 59574020 60063148 60033005 60626461 61431286 61178543 60929951 61233261 61108925
868.9F1108925n89543P45762J007733j124047j085441K95513Q09082K58324K05795
$$ 61108925 60519382 61265144 62272877 61148830 60063389 60358902 61167984 61426308 61632103
877.6F1632103K64179j279857j098977J72726M00845M21192P0064m13017o99257m35791
$$ 61632103 61896282 60616425 59517448 59690174 60091019 60512211 60582275 60169258 59470001 59034210
887.3E9034210L90991K54483k33483J19828l19104l54778K20795j70479m46800j33503
$$ 59034210 59425201 59679684 59446201 59566029 59246925 58892147 59112942 58942463 58495663 58362160
896.9E8362160R52690N36026q59749l06847L82248K87571l16795k13440N58918K11399
$$ 58362160 59314850 59850876 58991127 58684280 59066528 59354099 59037304 58823864 59382782 59594181
906.5E9594181l75076k04258m09580j041092l98739J73702m74426o92993k35173L20832
$$ 59594181 59219105 59014847 58605267 57564175 57165436 57339138 56864712 56171719 55936546 56257378
916.2E6257378N5996q14370l70464N69462K72941n92880j169990m53595K92332l84220
$$ 56257378 56313374 55499004 55128540 55698002 55970943 55378063 54208073 53754478 54046810 53662590
925.8E3662590l6362L11318o33404l15796L21304j17897j92710K02129L0369r7119
$$ 53662590 53626228 53937546 53304142 52988346 53309650 53191753 52999043 53201172 53231541 53134422
935.5E3134422L48629M72252M64832P97062P03618l8365l19832J63765M78813O27484
$$ 53134422 53483051 53955303 54420135 55217197 55920815 55882450 55562618 55726383 56205196 56832680
945.1E6832680N13546l35507j37340M53022O8676N16525N31220J19850M88666K81162
$$ 56832680 57346226 57010719 56873379 57326401 57395077 57911602 58442822 58562672 59051338 59332500
954.8E9332500k59998j90666L60462k35592o73904m20407o20639j92925N1876l31527
$$ 59332500 59072502 58881836 59242298 59006706 58332802 57912395 57291756 57098831 57150707 56819180
964.4E6819180j043290q84597j10627r9937R6016J02901M5925k94483q95000m27418
$$ 56819180 55775890 54891293 54780666 54680729 54776745 54879646 54925571 54631088 53736088 53308670
974.1E3308670K38831K43522J64292J44374m60765l39543K4922l70282l89030l14728
$$ 53308670 53547501 53791023 53955315 54099689 53638924 53299381 53324303 52954021 52564991 52250263
983.7E2250263J88717J66153k13894r941l94360n43270n99891q24532n76076n98088
$$ 52250263 52438980 52605133 52391239 52381298 51986938 51443668 50843777 50019245 49443169 48845081
993.3D8845081j325027k200535j857250k0405J382366J477513J156215O75259L51173
$$ 48845081 47520054 45319519 43462269 43441864 44824230 46301743 47457958 48133217 48484390
1002D8484390K3537n92011j22024K35950l45615m38938O8371J77879l65810k48349
$$ 48484390 48507927 47915916 47793892 48029842 47684227 47245289 47313660 47491539 47125729 46877380
1011.7D6877380m3014j05145O7273m65104o69559k86255k03983k5257j49228p6465
$$ 46877380 46834366 46729221 46796494 46331390 45661831 45375576 45171593 45146336 44997108 44920643
1021.3D4920643J03294m64889p40101n00679M513N7884l27313j80229k57034n4855
$$ 44920643 45023937 44559048 43818947 43318268 43322781 43380665 43053352 42873123 42616089 42561234
1031D2561234k19426q70262m78981k68158K75540P29827K52091n9273n69908o18904
$$ 42561234 42341808 41471546 40992565 40724407 40999947 41729774 41981865 41922592 41352684 40733780
1040.6D0733780k52056K32574K33231q4854r369k88262J99101N44140K04941j84453
$$ 40733780 40481724 40714298 40947529 40862675 40853306 40565044 40764145 41308285 41513226 41328773
1050.2D1328773m14718K60189J03706j7086K62657k51621m16019Q4686N71880j73420
$$ 41328773 40914055 41174244 41277950 41260864 41523521 41271900 40855881 40940567 41512447 41339027
1059.9D1339027m88075L16597n2410m59965J12602N16213L88927n153l86761o07166
$$ 41339027 40850952 41167549 41115139 40655174 40767776 41283989 41672916 41667763 41281002 40673836
1069.5D0673836m70394m277K00737k742k72408o081K81258l34221k78728J58119l22353
$$ 40673836 40203442 40199165 40399902 40397160 40124752 40118671 40399929 40065708 39786980 39945099 39622746
1080.1C9622746m03534J03294j84925p06627m6593L26439K98359L01289k68330k84790
$$ 39622746 39219212 39322506 39137581 38430954 38384361 38710800 39009159 39310448 39042118 38757328
1089.8C8757328n18669p61196q67497j123428n82565n64930j057087j239636j034664
$$ 38757328 38238659 37477463 36609966 35486538 34903973 34339043 33281956 32042320 31007656
1098.5C1007656p72865p85025o51314p64480r33609j484057j340908q19729j087860
$$ 31007656 30234791 29449766 28798452 28033972 27100363 25616306 24275398 23455669 22367809
1107.1B2367809j126264j157801p46923p55824q69787n56751o23211n54527k54284
$$ 22367809 21241545 20083744 19336821 18580997 17711210 17154459 16531248 15976721 15722437
1115.8A5722437j14688m69526J01262K00410j32039J11366J91661K87945k06469L43854
$$ 15722437 15607749 15138223 15239485 15439895 15307856 15419222 15610883 15898828 15692359 16036213
1125.5A6036213K67027m73237p8627J96151O02791K72192l85016p67854k60043J22993
$$ 16036213 16303240 15830003 15751376 15947527 16550318 16822510 16437494 15669640 15409597 15532590
1135.1A5532590l42227j81782n23169n95711l53416m01549l24855j35834k76423p72818
$$ 15532590 15190363 15008581 14485412 13889701 13536285 13134736 12809881 12674047 12397624 11624806
1144.8A1624806o49950n75650k94510l30173j83236P1802r9302n2151l69436L70807
$$ 11624806 10974856 10399206 10104696 9774523 9591287 9663089 9563787 9511636 9142200 9513007
1154.4I513007M16292o3873j32040j64120N13462M85386N48356n4338r6833N91504
$$ 9513007 9929299 9865426 9733386 9569266 10082728 10568114 11116470 11062132 10965299 11556803
1164A1556803L18544L28985O34509R84127J69667K35996Q06619M74125Q49733R55217
$$ 11556803 11875347 12204332 12838841 13822968 13992635 14228631 15035250 15509375 16359108 17314325
1173.7A7314325Q06462P19139Q25924P30467J055444J299071Q09343P70914O31832
$$ 17314325 18120787 18839926 19665850 20396317 21451761 22750832 23560175 24331089 24962921
1182.4B4962921R65565J263525J037294O88547O17602O14948L24890Q01085P78825
$$ 24962921 25928486 27192011 28229305 28917852 29535454 30150402 30475292 31276377 32055202
1191C2055202K65091J95679L58029O13426Q60718R40193L02688M04675P60204O51035
$$ 32055202 32320293 32515972 32874001 33487427 34348145 35288338 35591026 35995701 36755905 37406940
1200.7C7406940N36698L80081O83842M70718K76287K82368N2483M55493P41276N88864
$$ 37406940 37943638 38323719 39007561 39478279 39754566 40036934 40089417 40544910 41286186 41875050
1210.3D1875050N03315N37372K56809J9001K68639K64874J8718p7049J65188L51726
$$ 41875050 42378365 42915737 43172546 43191547 43460186 43725060 43743778 43666729 43831917 44183643
1220D4183643k247j39236K59953L86989l1257k27112J65203M83776J91158l10074k76489
$$ 44183643 44181396 44042160 44302113 44689102 44657845 44430733 44595936 45079712 45270870 44960796 44684307
1230.6D4684307J05854L6110J8688J99669r8877N5905L37257J11198J72772J34334
$$ 44684307 44790161 44826271 44844959 45044628 44945751 45001656 45338913 45450111 45622883 45757217
1240.2D5757217Q2371J78070M9214j1387j92433k40089M9446L5038K28993N50209N5439
$$ 45757217 45839588 46017658 46066872 46055485 45863052 45622963 45672409 45707447 45936440 46486649 46542088
1250.8D6542088m19041j88118K36263J57929o7868L8361r255J47736K62066J42723
$$ 46542088 46123047 45934929 46171192 46329121 46261253 46299614 46290359 46438095 46700161 46842884
1260.5D6842884m5795k72614J97918M34921Q4050l9834l4896J10378J58142J3557J46607
$$ 46842884 46797089 46524475 46722393 47157314 47241364 47201530 47166634 47277012 47435154 47448711 47595318
1271.1D7595318N99426L12794k55722j14445J04832M59320N11032J08860J37001J78913
$$ 47595318 48194744 48507538 48251816 48137371 48242203 48701523 49212555 49321415 49458416 49637329
1280.7D9637329K06898K35817J51336L00774K47315J41429J1418m2462M21284N10304
$$ 49637329 49844227 50080044 50231380 50532154 50779469 50920898 50932316 50889854 51311138 51821442
1290.4E1821442J37905N3112J40766P3643K88059M76856K04342O6101p7106M6180J25283
$$ 51821442 51959347 52012459 52153225 52226868 52514927 52991783 53196125 53262226 53185120 53231300 53356583
1301E3356583J59481K22294j96682R2556L96560J74763J47743K5353k8786n2830P3769
$$ 53356583 53516064 53738358 53541676 53634232 54030792 54205555 54353298 54378651 54349865 54297035 54370804
1311.6E4370804J0872q3996Q6468J10672K15324R5982n0717J53279J91757q0116m7734
$$ 54370804 54381676 54297680 54384148 54494820 54710144 54806126 54755409 54908688 55100445 55020329 54972595
1322.2E4972595L39775L68824N1422j85485k21566r8999J14983J57680J07815K7870
$$ 54972595 55312370 55681194 55732616 55547131 55325565 55226566 55341549 55499229 55607044 55634914
1331.8E5634914k8003O1783M5478J80912O7997k76447j27460K32307K09778j05423
$$ 55634914 55606911 55668694 55714172 55895084 55963081 55686634 55559174 55791481 56001259 55895836
1341.5E5895836K9968o5437j54591J53828J65432J9310o6635N1452J3577n4478n1235
$$ 55895836 55925804 55860367 55705776 55859604 56025036 56044346 55977711 56029163 56042740 55988262 55937027
1352.1E5937027q9569N1605O2691J08555n6347j27442O325k63576k61990J73168J16978
$$ 55937027 55847458 55899063 55961754 56070309 56013962 55886520 55892845 55629269 55367279 55540447 55657425
1362.7E5657425j95068R0400J69377j6747q3526k27692l35262l9616K52926r8488m49059
$$ 55657425 55462357 55552757 55722134 55705387 55621861 55394169 55058907 55019291 55272217 55173729 54724670
1373.3E4724670l18203J43280J91918j22894q6708j85997N317K31579j35830j27300
$$ 54724670 54406467 54549747 54741665 54618771 54532063 54346066 54351383 54582962 54447132 54319832
1382.9E4319832n501J02978J73878O5189r1316J25011K91599J18290J55499k45106
$$ 54319832 54314331 54417309 54591187 54656376 54565060 54690071 54981670 55099960 55255459 55010353
1392.6E5010353k90382J78714j02489r4032L3931K09626l29308n00313P7603J15291
$$ 55010353 54719971 54898685 54796196 54702164 54736095 54945721 54616413 54116100 54193703 54308994
1402.2E4308994J15792k08569j81503J44100N516j16173k17548p8980n8311J27891
$$ 54308994 54424786 54216217 54034714 54178814 54184330 54068157 53850609 53771629 53713318 53841209
1411.9E3841209O4454j40168k1415q0990j13179j77093j46599m12544K94605N10937
$$ 53841209 53905663 53765495 53744080 53663090 53549911 53372818 53226219 52813675 53108280 53619217
1421.5E3619217J04404K4372l37368j1398M43096K37473J26827k95711l49179L43548
$$ 53619217 53723621 53747993 53410625 53399227 53842323 54079796 54206623 53910912 53561733 53905281
1431.2E3905281M28516J64074j26232R7508L16265J58932J14K02751J78887J7936q3084
$$ 53905281 54333797 54497871 54371639 54469147 54785412 54944344 54944458 55147209 55326096 55344032 55260948
1441.8E5260948K2362K34547m6421j25172K54116J86539k37721o183J99573L05981
$$ 55260948 55283310 55517857 55471436 55346264 55600380 55786919 55549198 55543015 55742588 56048569
1451.4E6048569L05179l8364q5037k51419k68650M47261Q2001K98851K74967J30097
$$ 56048569 56353748 56315384 56230347 55978928 55710278 56157539 56239540 56538391 56813358 56943455
1461.1E6943455L2024O2214L03844P0042k3556M9034N6008R8637k8710l5255l0991
$$ 56943455 56975479 57037693 57341537 57411579 57388023 57437057 57493065 57591702 57562992 57527737 57496746
1471.7E7496746N05997L08147J34217J57634m3358O52920O33156K73125J58741R1594
$$ 57496746 58002743 58310890 58445107 58602741 58559383 59212303 59845459 60118584 60277325 60368919
1481.3F0368919J73191J08250J46866J33701l1044J1708j07468J37234j07804l59173
$$ 60368919 60542110 60650360 60797226 60930927 60899883 60911591 60804123 60941357 60833553 60474380
1491F0474380K30992J35490o1111j07502J40964j27170j30524j83155l74813R3666
$$ 60474380 60705372 60840862 60779751 60672249 60813213 60686043 60555519 60372364 59997551 60091217
1500.6F0091217l8834p6217N4680N6530r5005J09428k43412r73392j82019j34956K2961
$$ 60091217 60052383 59976166 60030846 60087376 59992371 60101799 59858387 58884995 58702976 58568020 58590981
1511.2E8590981k16294k21618J51191j69445m67418q29937J17313N11711L26302J79630
$$ 58590981 58374687 58153069 58304260 58134815 57667397 56837460 56954773 57466484 57792786 57972416
1520.8E7972416p66987k08012K50741K36877k87273r4494J49696k96970r1946l3054
$$ 57972416 57205429 56997417 57248158 57485035 57197762 57103268 57252964 56955994 56864048 56830994
1530.5E6830994j72345k84709o32576q8349M18724O6223j85501J2306O36975l54676
$$ 56830994 56658649 56373940 55741364 55653015 56071739 56137962 55952461 55964767 56601742 56247066
1540.1E6247066o33808j10202J5689J48621j42059j73767K06634J31848J65370j18789
$$ 56247066 55613258 55503056 55518745 55667366 55525307 55351540 55558174 55690022 55855392 55736603
1549.8E5736603j33141K13677R8442J82190j43906j40480N4596j79028L29884O38920
$$ 55736603 55603462 55817139 55915581 56097771 55953865 55813385 55867981 55688953 56018837 56657757
1559.4E6657757o30242J05839L85903J76441L3733n5191r7893J95320J70075J1356
$$ 56657757 56027515 56133354 56519257 56695698 56729431 56674240 56576347 56771667 56941742 56953098
1569.1E6953098m74720j02764J81603J45588m5159k03049J48221j69339k56153L8635
$$ 56953098 56478378 56375614 56557217 56702805 56657646 56454597 56602818 56433479 56177326 56215961
1578.7E6215961J6324l5611o1256K098j46248k05784l05736j96404n5805j77406j85536
$$ 56215961 56232285 56196674 56135418 56137516 55991268 55785484 55479748 55283344 55227539 55050133 54864597
1589.3E4864597l73966l35514k38663o3450k44888l38512j27205k21558p7312l02689
$$ 54864597 54490631 54155117 53916454 53853004 53608116 53269604 53142399 52920841 52843529 52540840
1599E2540840l50761m06399k33044k998k98389j36662j94111k50889m26872k33761
$$ 52540840 52190079 51783680 51550636 51547638 51249249 51112587 50918476 50667587 50240715 50006954
1608.6E0006954k64126l88683J28803k6249j02081m27322l78861m45156r56104L99685
$$ 50006954 49742828 49354145 49482948 49456699 49354618 48927296 48548435 48103279 47147175 47546860
1618.2D7546860J74122J37950k22587l70197m23939j03687J64180k42885j61652m30248
$$ 47546860 47720982 47858932 47636345 47266148 46842209 46738522 46902702 46659817 46498165 46067917
1627.9D6067917K857k842k10136q9485p1728J78470j40560m36382n74169j15494L42716
$$ 46067917 46070774 46067932 45857796 45768311 45696583 45875053 45734493 45298111 44723942 44608448 44951164
1638.5D4951164K67472K40123j34109M8420p2041O6139J92124k82086m4323R057L90174
$$ 44951164 45218636 45458759 45324650 45373070 45301029 45367168 45559292 45277206 45232883 45241940 45632114
1649.1D5632114L7663R6535M88067J255909j479042l11432N62027K72209J15097j3072
$$ 45632114 45669777 45766312 46254379 47510288 46031246 45719814 46281841 46554050 46669147 46656075
1658.8D6656075P6786J41063L55042M83730k34932P9682J11370L62796L46600J0323
$$ 46656075 46732861 46873924 47228966 47712696 47477764 47557446 47668816 48031612 48378212 48388535
1668.4D8388535j39622J41971O94645J21548N1872L06282J69289L4969M03668N72567
$$ 48388535 48248913 48390884 49085529 49207077 49258949 49565231 49734520 49769489 50173157 50745724
1678E0745724K64599J84337J09944L63311L68687J7391k36580K57809Q64681M76601
$$ 50745724 51010323 51194660 51304604 51667915 52036602 52053993 51817413 52075222 52939903 53416504
1687.7E3416504K39815K37613K49440L56411K36999M44164L44395L57224L1913K02111
$$ 53416504 53656319 53893932 54143372 54499783 54736782 55180946 55525341 55882565 55914478 56116589
1697.3E6116589O56662M45053n89356J24966J336101P02156L72040L84465L25561L30048
$$ 56116589 56773251 57218304 56628948 56753914 58090015 58792171 59164211 59548676 59874237 60204285
1707F0204285J05262K03103J98314J98837K98558K31724K79697L55877M06193K38292
$$ 60204285 60309547 60512650 60710964 60909801 61208359 61440083 61719780 62075657 62481850 62720142
1716.6F2720142m09305r76837P07538O71646K23385R8423K5192J31642K33131J99669
$$ 62720142 62310837 61334000 62041538 62713184 62936569 63034992 63060184 63191826 63424957 63624626
1726.3F3624626P0198J4359J67137j16619K18284M74423M2961k13860l9627K13448
$$ 63624626 63694824 63709183 63876320 63759701 63977985 64452408 64495369 64281509 64241882 64455330
1735.9F4455330J64894K77283K19627m84680K7771N00793J14708m2106K53959L61313
$$ 64455330 64620224 64897507 65117134 64632454 64660225 65161018 65275726 65233620 65487579 65848892
1745.5F5848892J94901n9021J4580L39675L82073R3445L22364O83877K43049L1067
$$ 65848892 66043793 65984772 65999352 66339027 66721100 66814545 67136909 67820786 68063835 68094902
1755.2F8094902J66359j70616K69089L62243K10121K37336l21747J84410N33432R0408
$$ 68094902 68261261 68090645 68359734 68721977 68932098 69169434 68847687 69032097 69565529 69655937
1764.8F9655937j12045Q1039K32651j15929N242O5422k73773k88925K91404M99329
$$ 69655937 69543892 69624931 69857582 69741653 69746895 69812317 69538544 69249619 69541023 70040352
1774.5G0040352L4187j22513L04680K44675P698j28273n089K15866J47034n0865j18775
$$ 70040352 70074539 69952026 70256706 70501381 70509079 70380806 70375717 70591583 70738617 70687752 70568977
1785.1G0568977J00K21450K17705j29494o3453K08023K40753j01456r9235J52565K7405
$$ 70568977 70569077 70790527 71008232 70878738 70815285 71023308 71264061 71162605 71063370 71215935 71243340
1795.7G1243340K7252R8243K8382k60117j07162K89154J75911K12097O5315q1299j4549
$$ 71243340 71270592 71368835 71397217 71137100 71029938 71319092 71495003 71707100 71772415 71691116 71676567
1806.3G1676567n8868p523R7389J3832j68319Q6776Q7502J15654K56302K8061J00357
$$ 71676567 71617699 71610176 71707565 71721397 71553078 71639854 71727356 71843010 72099312 72127373 72227730
1816.9G2227730Q446j58997m4083o3926Q8592N6351j6235L1219j68907K1927J45324
$$ 72227730 72236176 72077179 72033096 71969170 72057762 72114113 72097878 72129097 71960190 71982117 72127441
1827.5G2127441n500n5092o4118K24594K61879q125k3308n2864l5850M5311L7735Q1092
$$ 72127441 72121941 72066849 72002731 72227325 72489204 72481079 72457771 72404907 72369057 72414368 72452103 72533195
1839.1G2533195L6454M9850j03309O8809J57364m15108R5047L0754j23718J46721P8438
$$ 72533195 72569649 72619499 72516190 72584999 72742363 72327255 72422302 72453056 72329338 72476059 72554497
1849.7G2554497R2750J77872o5964o9099J70486p1808j54274N0713J778L4385J74500
$$ 72554497 72647247 72825119 72759155 72690056 72860542 72788734 72634460 72685173 72686951 72721336 72895836
1860.3G2895836R8328r3964o0883m165M1694p5027r5856J86722q4419j37291J56822
$$ 72895836 72994164 72900200 72839317 72835152 72876846 72801819 72705963 72892685 72808266 72670975 72827797
1870.9G2827797J38817L5141N2704M5623k05291o0112J43158J21963J15708K9800m1435
$$ 72827797 72966614 73001755 73054459 73100082 72894791 72834679 72977837 73099800 73215508 73245308 73203873
1881.5G3203873n4428k60j03897n7403R4764P3433L8384q0887j19507K4681J8051q3687
$$ 73203873 73149445 73149185 73045288 72987885 73082649 73156082 73194466 73113579 72994072 73018753 73036804 72953117
1893.1G2953117J68496J51878j29212J15159N3169j56723j77330O7116M8095k01019
$$ 72953117 73121613 73273491 73144279 73259438 73312607 73155884 72978554 73045670 73093765 72892746
1902.7G2892746J73172J42639l4714P5684j26549j23466O157l2608M6783J33164l3570
$$ 72892746 73065918 73208557 73173843 73249527 73122978 72999512 73005669 72973061 73019844 73153008 73119438
1913.3G3119438r1240L1945J33369J22818k40044j43524Q9340j083O1249j8944n5054
$$ 73119438 73028198 73060143 73193512 73316330 73076286 72932762 73022102 73021019 73082268 73063324 73008270
1923.9G3008270J07880K2026o836k2713J3542J25901o9679J7517j4359j70479M9332
$$ 73008270 73116150 73138176 73131340 73108627 73122169 73248070 73178391 73195908 73181549 73011070 73060402
1934.6G3060402p9399K8572P8209j45165l181J7593J5167j63513j61781K18468J01410
$$ 73060402 72981003 73009575 73087784 72942619 72939438 72957031 72972198 72808685 72646904 72865372 72966782
1945.2G2966782q4031j4808L6377J14128K03361K5658j14723j90605j18264L2914N3
$$ 72966782 72882751 72867943 72904320 73018448 73221809 73247467 73132744 72942139 72823875 72856789 72856842
1955.8G2856842J05408m2061j21086J14021P8987l9856j12121k4651J19530J23886
$$ 72856842 72962250 72920189 72799103 72913124 72992111 72952255 72840134 72815483 72935013 73058899
1965.4G3058899k411j47697o4026R4108p637j63192r5582k5016J45492J11557R804
$$ 73058899 73056488 72908791 72844765 72938873 72931236 72768044 72672462 72647446 72792938 72904495 72914299
1976G2914299Q8318r1522j13793j2275M5730k1797p1602L0380j10382n5855Q0452J39420
$$ 72914299 73002617 72911095 72797302 72785027 72830757 72808960 72737358 72767738 72657356 72601501 72681953 72821373
1987.6G2821373R8846j19117l1533q1611l04573l1617J36292p5912N2902J80160n6541
$$ 72821373 72920219 72801102 72769569 72687958 72383385 72351768 72488060 72412148 72465050 72645210 72588669
1998.2G2588669o0372J3222J29395L2501j23909m2458p7827N028M9667j08910j02714
$$ 72588669 72528297 72541519 72670914 72703415 72579506 72537048 72459221 72464249 72513916 72405006 72302292
2008.8G2302292J52038Q6632j55563j5419O9717Q9981P241j50948q2115k4231J9691
$$ 72302292 72454330 72540962 72385399 72369980 72439697 72529678 72536919 72385971 72303856 72279625 72299316
2019.4G2299316J11504k8107j88957P1060J41342o2912j01585j04202J8600N4924m4716
$$ 72299316 72410820 72382713 72193756 72264816 72406158 72343246 72241661 72137459 72156059 72210983 72166267
2030G2166267m272J00334m6379j59012l9497L7758J68235j9920k13753n8418m2999
$$ 72166267 72161995 72262329 72215950 72056938 72017441 72055199 72223434 72203514 71989761 71931343 71888344
2040.6G1888344l2608P0335J57585O7475r4719j21910o9893N8395J35697K9922j05186
$$ 71888344 71855736 71926071 72083656 72151131 72056412 71934502 71864609 71923004 72058701 72088623 71983437
2051.2G1983437j4580m5197j25221o6124k4170J38733R3033m5868n4977j47957r8275
$$ 71983437 71968857 71923660 71798439 71732315 71708145 71846878 71939911 71894043 71839066 71691109 71592834
2061.9G1592834J22605J32454n6587p7630p8834r1293M7348N1414j31576j15815l9848
$$ 71592834 71715439 71847893 71791306 71713676 71634842 71543549 71590897 71642311 71510735 71394920 71355072
2072.5G1355072j32065k4826M5403m9607j10374j40297j0109L6377K3003K5650k7008
$$ 71355072 71223007 71198181 71243584 71193977 71083603 70943306 70933197 70969574 70992577 71018227 70991219
2083.1G0991219L456K4070p545l8689r6542m1481O2263j6372Q0658M4571k11945n0346
$$ 70991219 70994675 71018745 71011200 70972511 70875969 70834488 70896751 70880379 70961037 71005608 70793663 70743317
2094.6G0743317R6130J51894N9684j01570Q4679R5421J3611R9891J49864Q9310n7548
$$ 70743317 70839447 70991341 71051025 70949455 71034134 71129555 71143166 71243057 71392921 71482231 71424683
2105.2G1424683j44905q2436L0640j1826r354J02730O8138l0624j4916l1738j9981
$$ 71424683 71279778 71197342 71227982 71216156 71206802 71309532 71377670 71347046 71332130 71300392 71280411
2115.9G1280411M1298r6016q4305J49025J64474j48384j93603O5193N6839R5360K594
$$ 71280411 71321709 71225693 71141388 71290413 71454887 71306503 71112900 71178093 71234932 71330292 71332886
2126.5G1332886j23787l4096o6109J9425L486n1826M2938r788n6603N8701L2173j24107
$$ 71332886 71209099 71175003 71108894 71128319 71131805 71079979 71122917 71113129 71056526 71115227 71147400 71023293
2138G1023293M8652Q6365l6469J35834J22719m6967l20O5453k7367o1501q606Q4671
$$ 71023293 71071945 71158310 71121841 71257675 71380394 71333427 71333107 71398560 71371193 71309692 71301086 71385757
2149.6G1385757J38932m4030j27548J8250M6425k1218m1076P980J43959P7026n447
$$ 71385757 71524689 71480659 71353111 71371361 71417786 71396568 71355492 71363472 71507431 71584457 71579010
2160.2G1579010q0399k59529N4772J61773p6980k1874j5487l0106K5017J60194R468
$$ 71579010 71498611 71239082 71293854 71455627 71378647 71356773 71341286 71311180 71336197 71496391 71505859
2170.8G1505859j62849n5176k7122P0068K8587N158j15975j55845J94877J04256j52565
$$ 71505859 71343010 71287834 71260712 71330780 71359367 71364525 71248550 71092705 71287582 71391838 71239273
2181.4G1239273m1893J84547N7686k01225o9450R9197R2789K5886l4202p3372Q8478
$$ 71239273 71197380 71381927 71439613 71238388 71168938 71268135 71360924 71386810 71352608 71279236 71367714
2192G1367714J20598L0288J02990m8523p8942K0592j9943r2728l6316O5216K4620J02929
$$ 71367714 71488312 71518600 71621590 71573067 71494125 71514717 71494774 71402046 71365730 71430946 71455566 71558495
2203.6G1558495Q2138L4301j10489j34773J71845J24855J6098J9462J05667k5909k19658
$$ 71558495 71640633 71674934 71564445 71429672 71601517 71726372 71742470 71761932 71867599 71841690 71622032
2214.2G1622032m1694m8279J05346J81542L326R186o7802r9366J107J15326r102o2172
$$ 71622032 71580338 71532059 71637405 71818947 71822273 71831459 71763657 71664291 71665398 71780724 71771622 71709450
2225.8G1709450O7283j9752j05553k9205J30302J1780q2985J05339K1424j25550L4241
$$ 71709450 71776733 71756981 71651428 71622223 71752525 71764305 71681320 71786659 71808083 71682533 71716774
2236.4G1716774N3001j21345n821j4695j10054L9292P4028M9370K9609J25412K9915
$$ 71716774 71769775 71648430 71642609 71627914 71517860 71557152 71631180 71680550 71710159 71835571 71865486
2247G1865486j44371P1137j5603k13447r041J39252M0321j13197m6318L2409o6207
$$ 71865486 71721115 71792252 71776649 71563202 71554161 71693413 71733734 71620537 71574219 71606628 71540421
2257.6G1540421K5558J02341l6759r613J1620P011Q8982k7283r7809J2963N0903N806
$$ 71540421 71565979 71668320 71631561 71621948 71633568 71640579 71729561 71702278 71604469 71617432 71668335 71674141
2269.2G1674141M3121N6534m2412L9498N4550q7418o4758q2932m417J77978R2698K8907
$$ 71674141 71717262 71773796 71731384 71770882 71825432 71738014 71673256 71590324 71585907 71763885 71856583 71885490
2280.8G1885490N2468n3108j50376m7272J08628n226l9772Q2862Q4229q255k46628
$$ 71885490 71937958 71884850 71734474 71687202 71795830 71790604 71750832 71833694 71917923 71909668 71663040
2291.4G1663040k00882O2416R9564J01562J10497P6294l8674n3772M0383j21536r4330
$$ 71663040 71462158 71524574 71624138 71725700 71836197 71912491 71873817 71820045 71860428 71738892 71644562
2302G1644562O7215j18157O3263K74452j09062j50200L5355M250o6643j03195J43646
$$ 71644562 71711777 71593620 71656883 71931335 71822273 71672073 71707428 71711678 71645035 71541840 71685486
2312.6G1685486J67152q6250Q156K50396K49581J0338l89611l64334J59302L0891k22747
$$ 71685486 71852638 71766388 71774544 72024940 72274521 72284859 71895248 71530914 71690216 71721107 71498360
2323.2G1498360O0127K37427K36961j06033k89299r903L03550L25165J98609k19017
$$ 71498360 71558487 71795914 72032875 71926842 71637543 71627640 71931190 72256355 72454964 72235947
2332.8G2235947o63658R9220K92434l40499J46743L80219N6793J17401R2301l85193
$$ 72235947 71572289 71671509 71963943 71623444 71770187 72150406 72207199 72324600 72416901 72031708
2342.5G2031708k26769J34529M036L78517O9390k33750J79230J4084m16870j66161
$$ 72031708 71804939 71939468 71943504 72322021 72391411 72157661 72336891 72350975 71934105 71767944
2352.1G1767944L83858J81114k84523k7107J28944M64203L38883p89788q65097L71445
$$ 71767944 72151802 72332916 72048393 72021286 72150230 72614433 72953316 72163528 71298431 71669876
2361.8G1669876Q75435K18216K00195N5672m70619k29622K9877J01539k1332k48062
$$ 71669876 72545311 72763527 72963722 73019394 72548775 72319153 72349030 72450569 72429237 72181175
2371.4G2181175j55327Q5488M555q9905l8002l0243K88749J82450k62711j49452P5844
$$ 72181175 72025848 72111336 72115891 72025986 71987984 71957741 72246490 72428940 72166229 72016777 72092621
2382G2092621J22261o9222k05635j79443k6779J94740K7580J412Q0940m5036L0098
$$ 72092621 72214882 72145660 71940025 71760582 71733803 71928543 71956123 71957535 72038475 71993439 72023537
2392.6G2023537O3560J9692K1919M5517m2626j92138j06674O2255P1595L05K8442l555
$$ 72023537 72087097 72106789 72128708 72174225 72131599 71939461 71832787 71895042 71966637 71966942 71995384 71991829
2404.2G1991829M3564L8551j00838Q5404N1903j86737j27343N5992J62163m5151j55311
$$ 71991829 72035393 72073944 71973106 72058510 72110413 71923676 71796333 71852325 72014488 71969337 71814026
2414.8G1814026J7738P8339l2746q5388O3622J33552J5129j48742j59088J06613J91719
$$ 71814026 71831764 71910103 71877357 71791969 71855591 71989143 72004272 71855530 71696442 71803055 71994774
2425.4G1994774r2003j83365J0758P9101N9342P6377r0332k25891j08535o3073L3882
$$ 71994774 71902771 71719406 71730164 71809265 71868607 71944984 71854652 71628761 71520226 71457153 71491035
2436G1491035J01014J7662P2998M6776K1537O5461j2269r1514m8874j4595j44096o295
$$ 71491035 71592049 71609711 71682709 71729485 71751022 71816483 71804214 71712700 71663826 71649231 71505135 71498840
2447.6G1498840J84883j602q0269L9093o599j21132m0321J4465m1748o1897L6033J3764
$$ 71498840 71683723 71682121 71601852 71640945 71634346 71513214 71472893 71487358 71445610 71383713 71419746 71433510
2459.2G1433510j24413K8054L3264k1851N9105k7298m3915L662l7994j61316K2301
$$ 71433510 71309097 71337151 71370415 71348564 71407669 71380371 71336456 71340118 71302124 71140808 71163109
2469.8G1163109J69449n0690j04355n3032N4619N0552N5054J1116r6985K6535j52145
$$ 71163109 71332558 71281868 71177513 71124481 71179100 71229652 71284706 71295822 71198837 71225372 71073227
2480.4G1073227j12366J41464N2887m3357j62453L0502J33965n0621K0935p8400k28935
$$ 71073227 70960861 71102325 71155212 71111855 70949402 70979904 71113869 71063248 71084183 71005783 70776848
2491G0776848l2425N7297o638N8998l3203j46606K9945J20705M1534o042n2742o0372
$$ 70776848 70744423 70801720 70795082 70854080 70820877 70674271 70704216 70824921 70866455 70860413 70807671 70747299
2502.6G0747299k2041j09741q5999Q0139N1636P5783R3124o3095j1635N0194r7107
$$ 70747299 70725258 70615517 70529518 70609657 70661293 70737076 70830200 70767105 70755470 70805664 70708557
2513.2G0708557j14128l9558J21101J45775j10291o4727p5486j89369O6361R8739k9220
$$ 70708557 70594429 70554871 70675972 70821747 70711456 70646729 70571243 70381874 70448235 70546974 70517754
2523.8G0517754R4452J18942j16814k17987p0213K3460J801O591R2064J64818J89675
$$ 70517754 70612206 70731148 70614334 70396347 70326134 70349594 70351395 70357986 70450050 70614868 70804543
2534.4G0804543o1768l08777j15990K8389k5627r2827m974J76323O8718n6946M4548
$$ 70804543 70742775 70433998 70318008 70346397 70320770 70227943 70222969 70399292 70468010 70411064 70455612
2545G0455612l1044k27150j01906O4339N3894n7716n8449J16585M5402J572R735q1253
$$ 70455612 70424568 70197418 70095512 70159851 70213745 70156029 70097580 70214165 70259567 70261139 70270874 70189621
2556.6G0189621n9525o469R3574m974q3557k4979p7652j3801J8699k4124o836L3966
$$ 70189621 70130096 70123627 70217201 70212227 70128670 70103691 70026039 70012238 70030937 70006813 69999977 70033943
2568.1G0033943O226m9996j7982k2301m0001o1477j7388K3148p8293q7311L7476J53480
$$ 70033943 70040169 69990173 69972191 69949890 69909889 69848412 69831024 69854172 69775879 69688568 69726044 69879524
2579.7F9879524J17661j09444k73994j20903J60186K14135K3582j57623j28578m6677
$$ 69879524 69997185 69887741 69613747 69492844 69653030 69867165 69890747 69733124 69604546 69557869
2589.4F9557869j4816o7917q4610K07710J91963k29088n6633J90407j18263j92558
$$ 69557869 69543053 69475136 69390526 69598236 69790199 69561111 69504478 69694885 69576622 69384064
2599F9384064O149O5269n6526j32209m1321O1N7441N4490J09184R9396j14624r4864
$$ 69384064 69390213 69455482 69398956 69266747 69225426 69225487 69282928 69337418 69446602 69545998 69431374 69336510
2610.6F9336510p9491q3290n1605j04302j6533R1072M9759j6929K5474j28853j77810
$$ 69336510 69257019 69173729 69122124 69017822 69001289 69092361 69142120 69125191 69150665 69021812 68844002
2621.2F8844002O0364K9861r7610l7751J87630O3019k02454j18431m8126N2742k190
$$ 68844002 68904366 68934227 68836617 68798866 68986496 69049515 68847061 68728630 68680504 68733246 68731056
2631.8F8731056O3660J45981j98632j89399K067M7798M8066q0765o9199R209j8097
$$ 68731056 68794716 68940697 68742065 68552666 68554733 68602531 68650597 68569832 68500633 68509842 68491745
2642.4F8491745m1428j4724o3233m1580J6281J4946P7522q3404j98509o0349k6459
$$ 68491745 68450317 68435593 68372360 68330780 68347061 68362007 68439529 68356125 68157616 68097267 68070808
2653F8070808M143L1967j2832L4385P4196k0111k2087K5818l1479j05629j38832r5222
$$ 68070808 68074951 68106918 68094086 68128471 68202667 68182556 68160469 68186287 68154808 68049179 67910347 67815125
2664.6F7815125j48423m3930K34764R4925j29356r8999n5100k777M3175n0285q5938
$$ 67815125 67666702 67622772 67857536 67952461 67823105 67724106 67669006 67666229 67709404 67659119 67573181
2675.2F7573181J34819J17974j03898m7866L4027j7227j71746k24243k960O6482q0452
$$ 67573181 67708000 67825974 67722076 67674210 67708237 67691010 67519264 67295021 67292061 67358543 67278091
2685.8F7278091r9052O5544J96823N9220j15410r8847l6644J4092j4542p7179R682
$$ 67278091 67179039 67244583 67441406 67500626 67385216 67286369 67249725 67263817 67249275 67172096 67181778
2696.4F7181778J30859o4071l08060m4014J40770J0231K029m9469o3041j23024j04004
$$ 67181778 67312637 67248566 66940506 66896492 67037262 67047493 67049522 67000053 66937012 66813988 66709984
2707F6709984Q3748R9266J23886p6790j76010Q7570J12656n761j70463j82076p7354
$$ 66709984 66793732 66892998 67016884 66940094 66764084 66851654 66964310 66958549 66788086 66606010 66528656
2717.6F6528656q949J9165k9358O3377r6023j34858J28266M8248m9057j20621j18980
$$ 66528656 66519707 66538872 66509514 66572891 66476868 66342010 66470276 66518524 66469467 66348846 66229866
2728.2F6229866P0686J53847n2475k19711N2994J13937o7673j29379j59744o1364j0429
$$ 66229866 66300552 66454399 66401924 66182213 66235207 66349144 66281471 66152092 65992348 65930984 65920555
2738.8F5920555O9161K3384j16104K0751N9685k9060o8810m104J73263M0177k71653
$$ 65920555 65989716 66013100 65896996 65917747 65977432 65948372 65879562 65875458 66048721 66088898 65817245
2749.4F5817245k23869J6365R7512L66j32370L0487J98852k0248j55228j44150j30683
$$ 65817245 65593376 65609741 65707253 65707619 65575249 65605736 65804588 65784340 65629112 65484962 65354279
2760F5354279j03394l2829J71768P3830j12854l9185j0056K396q0353j28898M7340
$$ 65354279 65250885 65218056 65389824 65463654 65350800 65311615 65301559 65303955 65223602 65094704 65142044
2770.7F5142044J50414O790j18019o0173J5991R6008m2511j54877p1548j05003J0597
$$ 65142044 65292458 65299248 65181229 65121056 65137047 65233055 65190544 65035667 64964119 64859116 64869713
2781.3F4869713L0769j46332j58714p294n401j35353R2460J54869P485o6147j43257
$$ 64869713 64900482 64754150 64595436 64588142 64582741 64447388 64539848 64694717 64702202 64636055 64492798
2791.9F4492798j8532j55724j57836P7987o126l6888l4973o7131o8497m6902l3634
$$ 64492798 64474266 64318542 64160706 64238693 64232567 64195679 64160706 64093575 64025078 63978176 63944542
2802.5F3944542k9343o5437j47686k2045O5182L8677p2190j56765n9143j13815j08372
$$ 63944542 63915199 63849762 63702076 63680031 63745213 63783890 63711700 63554935 63495792 63381977 63273605
2813.1F3273605O5129N5656k31834k35184J22208J2577j37707J9298J4596m8028j31534
$$ 63273605 63338734 63394390 63162556 62927372 63049580 63062157 62924450 62943748 62958344 62910316 62778782
2823.7F2778782j31958K1404j0738j24317j156L0617r5669q4229r2514j80584k28546
$$ 62778782 62646824 62668228 62657490 62533173 62532017 62562634 62466965 62382736 62290222 62109638 61881092
2834.3F1881092j59893k2442L6499k3231j44940j85325j73310j83929j80599k25571
$$ 61881092 61721199 61698757 61735256 61712025 61567085 61381760 61208450 61024521 60843922 60618351
2843.9F0618351k71214j79340j32515k05810k00890j40213j93153k90520j09966N8403
$$ 60618351 60347137 60167797 60035282 59829472 59628582 59488369 59295216 59004696 58894730 58953133
2853.6E8953133L1833O0738k4254L7201J13819m4838l8330p3116k29389j96904L1887
$$ 58953133 58984966 59045704 59021450 59058651 59172470 59127632 59089302 59016186 58786797 58589893 58621780
2864.2E8621780O7593j23116j28528j29357p6328M4796j30188j76594L2837j8428j34884
$$ 58621780 58689373 58566257 58437729 58308372 58232044 58276840 58146652 57970058 58002895 57984467 57849583
2874.8E7849583o2844p0980j00021m562L3237o7146j33122j4705k877j29368l3935
$$ 57849583 57786739 57715759 57615738 57611176 57644413 57577267 57444145 57429440 57426563 57297195 57263260
2885.4E7263260k4254j29898n1502r6279j72978j52996k23892k02690M1572J38234
$$ 57263260 57239006 57109108 57057606 56961327 56788349 56635353 56411461 56208771 56250343 56388577
2895.1E6388577n0774n4360j47930l03459m5112l2036j62171j7307O6635L6770p1865
$$ 56388577 56337803 56283443 56135513 55832054 55786942 55754906 55592735 55575428 55642063 55678833 55606968
2905.7E5606968p7080p5146k67620k36721O5899J00739J541l3596j34327o6036j06453
$$ 55606968 55529888 55454742 55187122 54950401 55016300 55117039 55118580 55084984 54950657 54884621 54778168
2916.3E4778168k65236k12185r1187J03501M4441j38088o5228l1814k060N0113J8475
$$ 54778168 54512932 54300747 54209560 54313061 54357502 54219414 54154186 54122372 54120312 54170425 54188900
2926.9E4188900k1667q0391o4511j0978L8890J14243k4845j84712p8876J05594K41906
$$ 54188900 54167233 54086842 54022331 54011353 54050243 54164486 54139641 53954929 53876053 53981647 54223553
2937.5E4223553K68703J05538j18214J8963K02945Q5034J0899o3420l8288J1429k2778
$$ 54223553 54492256 54597794 54479580 54498543 54701488 54786522 54797421 54734001 54695713 54707142 54684364
2948.1E4684364K3255J5739k1675q6636m4704J01250J47072m2489k58239j43105M0325
$$ 54684364 54707619 54723358 54701683 54615047 54570343 54671593 54818665 54776176 54517937 54374832 54415157
2958.7E4415157J58848K9244o1127M9694m589J56685K00729L7804M162k3770O5594
$$ 54415157 54574005 54603249 54542122 54591816 54587227 54743912 54944641 54982445 54986607 54962837 55028431
2969.3E5028431M0031O3427J86440R6863L406J30608K52731M1428r1755J13136K50973
$$ 55028431 55068462 55131889 55318329 55415192 55418598 55549206 55801937 55843365 55751610 55864746 56115719
2979.9E6115719Q8985L7102K05746Q1741L6392K02549J09154l448P8880P5558n5981
$$ 56115719 56204704 56241806 56447552 56529293 56565685 56768234 56877388 56873940 56952820 57028378 56972397
2990.5E6972397J52519K84950j07799j36051K21775K22423J5274p5496J556O1096m7283
$$ 56972397 57124916 57409866 57302067 57166016 57387791 57610214 57625488 57549992 57551548 57612644 57565361
3001.1E7565361j0345J02207O2526K3877r7897j12617J01749J98025K2564j88759j14212
$$ 57565361 57555016 57657223 57719749 57743626 57645729 57533112 57634861 57832886 57855450 57666691 57552479
3011.7E7552479r140p2602j65203j7280K37865J07060j28655k84363j86721P7060N7625
$$ 57552479 57543339 57470737 57305534 57288254 57526119 57633179 57504524 57220161 57033440 57110500 57168125
3022.4E7168125k9682o4121M65j30119j50940K04380P5222q4595k2457q1783o3000
$$ 57168125 57138443 57074322 57074787 56944668 56793728 56998108 57073330 56988735 56966278 56884495 56821495
3033E6821495j73355k59361j24272J35147J17009r6722o2889n6255j7434l1101q9359
$$ 56821495 56648140 56388779 56264507 56399654 56516663 56419941 56357052 56300797 56283363 56252262 56162903
3043.6E6162903j9421q2973p4757n1262j5285R2239m4815j06564m2713K0161o363k73083
$$ 56162903 56143482 56060509 55985752 55934490 55919205 56011444 55966629 55860065 55817352 55837513 55831150 55558067
3055.1E5558067j39808J10984j17092j73317k1518K6519l9802r3952q5362n8674m0226
$$ 55558067 55418259 55529243 55412151 55238834 55217316 55243835 55204033 55110081 55024719 54966045 54925819
3065.7E4925819j93237m8584J40988j2394Q354j48735k49317O7775Q6991q0914l7567
$$ 54925819 54732582 54683998 54824986 54812592 54820946 54672211 54422894 54490669 54577660 54496746 54459179
3076.4E4459179l0434j05278j27907n1925Q2504k9064j60736j10050k8469k1695j94206
$$ 54459179 54428745 54323467 54195560 54143635 54226139 54197075 54036339 53926289 53897820 53876125 53681919
3087E3681919N3829K39907r5818j05019m7363j15135o1398m3521j12202j49754j0254
$$ 53681919 53735748 53975655 53879837 53774818 53727455 53612320 53550922 53507401 53395199 53245445 53235191
3097.6E3235191J86783J52107j44142k22301j62075j20697m135j7147j34671j52401
$$ 53235191 53421974 53574081 53429939 53207638 53045563 52924866 52920731 52903584 52768913 52616512
3107.2E2616512l067m9629k7901n294j54576K8828q1886j66390k7248j43883N3596
$$ 52616512 52613445 52563816 52535915 52530621 52376045 52404873 52322987 52156597 52129349 51985466 52039062
3117.8E2039062J00941j38840j30001j3004o6887j93153j11435j12518j62777o8150
$$ 52039062 52140003 52001163 51871162 51858158 51791271 51598118 51486683 51374165 51211388 51143238
3127.5E1143238J08849J02291j26812j54660j05327j20125j05530r3788n2109p618
$$ 51143238 51252087 51354378 51227566 51072906 50967579 50847454 50741924 50648136 50596027 50588409
3137.1E0588409n4679j04332p0515k6817R243j35102j87839l9627K361M2713j18572
$$ 50588409 50533730 50429398 50358883 50332066 50341309 50206207 50018368 49978741 49981102 50023815 49905243
3147.7D9905243j26743Q7108p5535j31660j19801k43827j78467o3767N6885o1871j63890
$$ 49905243 49778500 49865608 49790073 49658413 49538612 49294785 49116318 49052551 49109436 49047565 48883675
3158.3D8883675j6781q5369j05683l2062P976r1240k43244N7499M9259l03226j13651
$$ 48883675 48866894 48781525 48675842 48643780 48651756 48560516 48317272 48374771 48424030 48120804 48007153
3168.9D8007153R7740o7559j46328r3811j83094j17698j362p5737o1771p6130j31894
$$ 48007153 48104893 48037334 47891006 47797195 47614101 47496403 47495041 47419304 47357533 47281403 47149509
3179.5D7149509K3510J34724j18576j56746r3582k80911p7816N2117j43055j62670
$$ 47149509 47173019 47307743 47189167 47032421 46938839 46657928 46580112 46632229 46489174 46326504
3189.2D6326504j04637j19091k3552P969k12914l0411N6027j31264o4007j07910m6101
$$ 46326504 46221867 46102776 46079224 46087193 45874279 45843868 45899895 45768631 45704624 45596714 45550613
3199.8D5550613j24191j75522j8715q4148k2400q385n1746j03725j69205o1829j49410
$$ 45550613 45426422 45250900 45232185 45148037 45125637 45117252 45065506 44961781 44792576 44730747 44581337
3210.4D4581337k25777n53J34125k4784j30741p2716j13258k43714j80939N0389P644
$$ 44581337 44355560 44355007 44489132 44464348 44333607 44260891 44147633 43903919 43722980 43773369 43781013
3221D3781013o0859L5663m3907j51516o9790J5248k0722n5530n4306j09505j40221
$$ 43781013 43720154 43755817 43711910 43560394 43490604 43505852 43485130 43429600 43375294 43265789 43125568
3231.6D3125568r540o6231j25545M5822j10798j55686o0062j88595L227J45993j14006
$$ 43125568 43116028 43049797 42924252 42970074 42859276 42703590 42643528 42454933 42458160 42604153 42490147
3242.2D2490147j80508O309o5162j83964p6553r0580j32382K911J07662k9041j04824
$$ 42490147 42309639 42315948 42250786 42066822 41990269 41899689 41767307 41770218 41877880 41848839 41744015
3252.8D1744015r3487j47869j02513j38740o3736M4968l0289k1282j05496j28441n4122
$$ 41744015 41650528 41502659 41400146 41261406 41197670 41242638 41212349 41191067 41085571 40957130 40903008
3263.4D0903008r9583o7341J4099L1693o5197j1868P7953j16954j33511k3521M169
$$ 40903008 40803425 40736084 40750183 40781876 40716679 40704811 40782764 40665810 40532299 40508778 40512947
3274D0512947p6519k76939j74160O9435P5184N104Q9328P56j64826o8817j90521j21716
$$ 40512947 40436428 40159489 39985329 40054764 40129948 40135052 40224380 40225136 40060310 39991493 39800972 39679256
3285.6C9679256N0293n0331K0603J6911o6734j29120p6855r1286j07769Q8879l0144
$$ 39679256 39729549 39679218 39699821 39716732 39649998 39520878 39444023 39352737 39244968 39333847 39303703
3296.2C9303703j62876j63479l8879O3435k1595M6863o5037j42627j3279k3186j46309
$$ 39303703 39140827 38977348 38938469 39001904 38980309 39027172 38962135 38819508 38806229 38783043 38636734
3306.8C8636734j00540M1946R4258P3249k58236k14912M1184m799j01864j84571L7430
$$ 38636734 38536194 38578140 38672398 38745647 38487411 38272499 38313683 38308884 38207020 38022449 38059879
3317.4C8059879p9857j04026J22181j52413k79175r3460Q7479j47846j80332J18671
$$ 38059879 37980022 37875996 37998177 37845764 37566589 37473129 37560608 37412762 37232430 37351101
3327.1C7351101J732j23776j42345l2597l372q0807j19651r5894M3533k6825j38187
$$ 37351101 37352833 37229057 37086712 37054115 37050743 36969936 36850285 36754391 36797924 36771099 36632912
3337.7C6632912j89972j51238q7463M4929R3728n5729N008j56910k71312j20934l9085
$$ 36632912 36442940 36291702 36204239 36249168 36342896 36287167 36292175 36135265 35863953 35743019 35703934
3348.3C5703934O6166o1367j69255l7052n1365k24941q0208J2146p7576r243j09645
$$ 35703934 35770100 35708733 35539478 35502426 35451061 35226120 35145912 35158058 35080482 35071239 34961594
3358.9C4961594q7922l5747o5956l8067q4480j3516Q2699o317j71005r6016j32424
$$ 34961594 34873672 34837925 34771969 34733902 34649422 34635906 34718605 34712288 34541283 34445267 34312843
3369.5C4312843j75224j06403k07318j22921n848J39023j5796k06330o4029j40999
$$ 34312843 34137619 34031216 33823898 33700977 33695129 33834152 33818356 33612026 33547997 33406998
3379.2C3406998o6456n8609j36654o8329o6246j02043q2729J58805J64563K464j25557
$$ 33406998 33340542 33281933 33145279 33076950 33010704 32908661 32825932 32984737 33149300 33151764 33026207
3389.8C3026207q1577k152j59206p8377l1620p3139p8747j1864M2908j54533j37158
$$ 33026207 32944630 32942478 32783272 32704895 32673275 32600136 32521389 32509525 32552433 32397900 32260742
3400.4C2260742O695N6118L0968P2170K0962j74671j09112J6048N7949j24153j14658
$$ 32260742 32267437 32323555 32354523 32426693 32447655 32272984 32163872 32179920 32237869 32113716 31999058
3411C1999058M8012r4655P4334J70715j34922j79895N0228J35343K2961j27039r4221
$$ 31999058 32047070 31952415 32026749 32197464 32062542 31882647 31932875 32068218 32091179 31964140 31869919
3421.6C1869919J29513J7650j53301o4304M1027J29141L3128q6096j36089r0198J39259
$$ 31869919 31999432 32017082 31863781 31799477 31840504 31969645 32002773 31916677 31780588 31690390 31829649
3432.2C1829649J95570K4921j15665q5007L647l998P5428J27514r3798j37424P8947
$$ 31829649 32025219 32050140 31934475 31849468 31853115 31849117 31924545 32052059 31958261 31820837 31899784
3442.8C1899784J69609J75110J15036m772j33049j11443J10390J66634p2239r9041
$$ 31899784 32069393 32244503 32359539 32354767 32221718 32110275 32220665 32387299 32315060 32216019
3452.5C2216019M2606k6127K6497J56685J22017M5040r663J32809K71542k1527k41043
$$ 32216019 32258625 32232498 32258995 32415680 32537697 32582737 32573074 32705883 32977425 32955898 32714855
3463.1C2714855k5207M9682J26271J86790K6161m16L6797J05740l5386j39495J02878
$$ 32714855 32689648 32739330 32865601 33052391 33078552 33078136 33114933 33220673 33185287 33045792 33148670
3473.7C3148670J74809Q1482M9224J6438j22791M1156L25154J88576j0266k3041J89312
$$ 33148670 33323479 33404961 33454185 33470623 33347832 33388988 33714142 33902718 33892452 33869411 34058723
3484.3C4058723J28144q0380M2603J05095P6874M9270Q4931Q1581J8123J1544J02035
$$ 34058723 34186867 34106487 34149090 34254185 34331059 34380329 34465260 34546841 34564964 34576508 34678543
3494.9C4678543K01393r830p5363N9677Q6643J50494O3633q9562l5202N9925J35372
$$ 34678543 34879936 34870106 34794743 34854420 34941063 35091557 35155190 35065628 35030426 35090351 35225723
3505.5C5225723J78025J42192K05895J26655n3215l1448R9285K26418P2929P2983M5479
$$ 35225723 35403748 35545940 35751835 35878490 35825275 35793827 35893112 36119530 36192459 36265442 36310921
3516.1C6310921j02436J9703J32820J72897R6020K78400J74553j81705J41948J25489
$$ 36310921 36208485 36228188 36361008 36533905 36629925 36908325 37082878 36901173 37043121 37168610
3525.7C7168610m3976M3392K74387J95523j22410K4048J04465J11187R9705J02211
$$ 37168610 37124634 37168026 37442413 37637936 37515526 37539574 37644039 37755226 37854931 37957142
3535.4C7957142O4342O1619L17501J85711O1764K6821r708J68628R3010k4093J07063
$$ 37957142 38021484 38083103 38400604 38586315 38648079 38674900 38665192 38833820 38926830 38902737 39009800
3546C9009800K13226J07067O7643J34067J81679n0804j40324L32768J43806L1448K39014
$$ 39009800 39223026 39330093 39397736 39531803 39713482 39662678 39522354 39855122 39998928 40030376 40269390
3556.6D0269390K10003J64829M3179M417N7404L83369J30211k08294L48301O6345j8715
$$ 40269390 40479393 40644222 40687401 40691818 40749222 41132591 41262802 41054508 41402809 41469154 41450439
3567.2D1450439K36500N5977L90785J86375L3012Q2241Q7010J88747J83846J35673
$$ 41450439 41686939 41742916 42133701 42320076 42353088 42435329 42522339 42711086 42894932 43030605
3576.9D3030605M0619K75131J85276k4520K36011K38587R4360O0745L38829K32727
$$ 43030605 43071224 43346355 43531631 43507111 43743122 43981709 44076069 44136814 44475643 44708370
3586.5D4708370j02360K43420q9516J04226L71769K42332J80973J83510K17537n8769
$$ 44708370 44606010 44849430 44759914 44864140 45235909 45478241 45659214 45842724 46060261 46001492
3596.1D6001492J37908L42076K22080K85011L0556j8791K00729J69064K03388M79652
$$ 46001492 46139400 46481476 46703556 46988567 47019123 47000332 47201061 47370125 47573513 48053165
3605.8D8053165M42856q8794K17330J09684l4400N52631L11798j47186J24042M2012
$$ 48053165 48496021 48407227 48624557 48734241 48699841 49252472 49564270 49417084 49541126 49583138
3615.4D9583138K53551K97840K77329M97158k30988k05082M46594M41853M02943L22750
$$ 49583138 49836689 50134529 50411858 50909016 50678028 50472946 50919540 51361393 51764336 52087086
3625.1E2087086O2172N7098P24171N40359r54849M23180L68370K94399J09234m0764
$$ 52087086 52149258 52206356 52930527 53470886 52516037 52939217 53307587 53601986 53711220 53670456
3634.7E3670456M05601K89956L11714J22253Q9882K82509K30450K30228j1833J50860
$$ 53670456 54076057 54366013 54677727 54799980 54889862 55172371 55402821 55633049 55621216 55772076
3644.4E5772076L49750N39993o118m52660O76251K77278J77346o2146K47593M38805
$$ 55772076 56121826 56661819 56655701 56203041 56879292 57156570 57333916 57271770 57519363 57958168
3654E7958168K56001N45555k38156P2018M08150J42971K63607J68632K18479l8627
$$ 57958168 58214169 58759724 58521568 58593586 59001736 59144707 59408314 59576946 59795425 59756798
3663.6E9756798J6498J35605O4724N14481K46300n3307K07989l34168J98422N85323
$$ 59756798 59773296 59908901 59973625 60488106 60734406 60681099 60889088 60554920 60753342 61338665
3673.3F1338665P12170M01744j629989j56639P43629M79740N0236J82152L30696J88000
$$ 61338665 62050835 62452579 60822590 60665951 61409580 61889320 61939556 62121708 62452404 62640404
3682.9F2640404l3268n2407L1949L63658O57605p95788o61842P79346m05426k47238
$$ 62640404 62607136 62554729 62586678 62950336 63607941 62812153 62150311 62929657 62524231 62276993
3692.6F2276993O99577K45289J21510J18679m7448n104m6661K77389L97297k80815
$$ 62276993 62976570 63221859 63343369 63462048 63414600 63409496 63362835 63640224 64037521 63756706
3702.2F3756706l11104M00246K70996j59069k6176L57631N14946k66578M44297M09111
$$ 63756706 63445602 63845848 64116844 63957775 63931599 64289230 64804176 64537598 64981895 65391006
3711.9F5391006j564701J81149M63592R9610J44195K14325Q4374l09998o0158L47168
$$ 65391006 63826305 64007454 64471046 64570656 64714851 64929176 65013550 64703552 64643394 64990562
3721.5F4990562q9767k72514L90556J02699m020n0171j13488K73568K43164O37176
$$ 64990562 64900795 64628281 65018837 65121536 65117516 65067345 64953857 65227425 65470589 66107765
3731.2F6107765l07220j009003R19251M93354j040031o26656J02600L91556K63695
$$ 66107765 65800545 64791542 65710793 66204147 65164116 64537460 64640060 65031616 65295311
3739.8F5295311K34245j70379L4973Q57666j96686j792267P01027N06805N69336r0339
$$ 65295311 65529556 65359177 65394150 66251816 66055130 64262863 64963890 65470695 66040031 65949692
3749.5F5949692j165077R38583m08646q33343O38733M59251K00615m35570L53958O48606
$$ 65949692 64784615 65723198 65314552 64481209 65119942 65579193 65779808 65344238 65698196 66346802
3759.1F6346802p86240l06091O18286J80580j47812M36157j18026o04828J11252M35547
$$ 66346802 65560562 65254471 65872757 66053337 65905525 66341682 66223656 65618828 65730080 66165627
3768.8F6165627Q7501j028816R4452M29321K15958K43904j24085j56158R6557M55605
$$ 66165627 66253128 65224312 65318764 65748085 65964043 66207947 66083862 65927704 66024261 66479866
3778.4F6479866O5887o62239R9106M2938N005K32239k94723j15494K92358P9331L6262
$$ 66479866 66545753 65883514 65982620 66025558 66030563 66262802 65968079 65852585 66144943 66224274 66260536
3789F6260536N860M5l1898k9625k8809P2693L81073m74251n90355K41951L31086O87904
$$ 66260536 66266396 66266441 66234543 66204918 66176109 66248802 66629875 66155624 65565269 65807220 66138306 66826210
3800.6F6826210o21140j047767O71280K57423K87384N94780n21278o07338L11668K2637
$$ 66826210 66205070 65157303 65828583 66086006 66373390 66968170 66446892 65839554 66151222 66173859
3810.2F6173859k19612K46803K58034L4332M71634p8148j628380K34360N69557P28668
$$ 66173859 65954247 66201050 66459084 66493416 66965050 66886902 65258522 65492882 66062439 66791107
3819.9F6791107Q48664j744851m14146K87643O0082L37417K94991k29j33827j92253
$$ 66791107 67639771 65894920 65480774 65768417 65828499 66165916 66460907 66460678 66326851 66134598
3829.5F6134598K66289M56260n07942J53648O16646p90443m13460Q74214l71971r32426
$$ 66134598 66400887 66857147 66349205 66502853 67119499 66329056 65915596 66789810 66417839 65485413
3839.2F5485413M84596l3646J91529O57959m21937m57077K78641J99600J65970J25206
$$ 65485413 65970009 65936363 66127892 66785851 66363914 65906837 66185478 66385078 66551048 66676254
3848.8F6676254j88171J21483K58499q24089K31407j111618j12465R51157n6359m9400
$$ 66676254 66488083 66609566 66868065 66043976 66275383 65163765 65051300 66002457 65946098 65896698
3858.4F5896698L24440J19904J44050n91980j92459O85043j94534n42580M04480N44426
$$ 65896698 66221138 66341042 66485092 65893112 65700653 66385696 66191162 65648582 66053062 66597488
3868.1F6597488M21555q93700p83905N14229N77522L50876q90457j57112M87717L6171
$$ 66597488 67019043 66125343 65341438 65855667 66433189 66784065 65893608 65736496 66224213 66260384
3877.7F6260384P1907M49203k65999q09745M08592J79313J4923N81345p84599n0553
$$ 66260384 66332291 66781494 66515495 65705750 66114342 66293655 66308578 66889923 66105324 66054771
3887.4F6054771L21106j26693L11615o1074q37410J24230L16131n1567J77071J57471
$$ 66054771 66375877 66249184 66560799 66499725 65662315 65786545 66102676 66051109 66228180 66385651
3897F6385651J35269k8343p95548N13535K807p52968O72417Q9325k92290Q3664J74721
$$ 66385651 66520920 66492577 65697029 66210564 66213371 65460403 66132820 66222145 65929855 66013519 66188240
3907.6F6188240K32513j3298j74064k12166R1171J61469L7018Q9737J38259k54333
$$ 66188240 66420753 66407455 66233391 66021225 66112396 66273865 66310883 66400620 66538879 66284546
3917.3F6284546n19158J95633K4376k07550K76390J78131J87905j23192k94228J98853
$$ 66284546 65765388 65961021 65985397 65777847 66054237 66232368 66420273 66297081 66002853 66201706
3926.9F6201706R5978n6221j87844j57058K35946j2924k12433J81885J26305j34011
$$ 66201706 66297684 66241463 66053619 65896561 66132507 66119583 65907150 66089035 66215340 66081329
3936.6F6081329j31103J25511Q8356j30569K27737J42395l77228j27403q621J29036
$$ 66081329 65950226 66075737 66164093 66033524 66261261 66403656 66026428 65899025 65890404 66019440
3946.2F6019440Q2321k50809K9152J71433j22643L7521J83884r5062j09589J9188J15868
$$ 66019440 66101761 65850952 65880104 66051537 65928894 65966415 66150299 66055237 65945648 65964836 66080704
3956.8F6080704J14593j78642q6235J29105M9888P0053M6753j0948q6632l05176j32881
$$ 66080704 66195297 66016655 65930420 66059525 66109413 66179466 66226219 66215271 66128639 65823463 65690582
3967.4F5690582K45178L1388J3054K36389j20201k32529m6104J5609J79734J55868
$$ 65690582 65935760 65967148 65980202 66216591 66096390 65863861 65817757 65833366 66013100 66168968
3977.1F6168968m3617j59790k4605J73088R7756j22094j83479M5715J42594r2919j91047
$$ 66168968 66125351 65965561 65940956 66114044 66211800 66089706 65906227 65951942 66094536 66001617 65810570
3987.7F5810570L7460J82716J3985n0400n0560j9836J53343q5716j54320J36391P3204
$$ 65810570 65848030 66030746 66044731 65994331 65943771 65923935 66077278 65991562 65837242 65973633 66046837
3998.3F6046837j0910j08528
$$ 66046837 66035927 65927399
4000.2F5927399
$$ 65927399
##END=$$ End of the data block
