##TITLE=$$ Begin of the data block
##JCAMP-DX=5.00 $$ ACD/SpecManager v 10.08
##SPECTROMETER/DATA SYSTEM=Varian
##DATE=07 Jan 2013 10:56:32
##DATA TYPE=INFRARED SPECTRUM
##DATA CLASS=XYDATA
##ORIGIN=
##OWNER=
##NPOINTS=3735
##FIRSTX=399.26403809
##LASTX=4000.35498047
##MAXX=4000.35498047
##MINX=399.26403809
##MAXY=90.28766632
##MINY=9.38592339
##XFACTOR=1.0000000000
##YFACTOR=0.000000100000000
##FIRSTY=56.03330231
##DELTAX=0.96440572
##XUNITS=1/CM
##YUNITS=TRANSMITTANCE
##XYDATA=(X++(Y..Y))
$$ plain form
399.3 560333023 844385681 756142502 528885193 466023788 465941277 640694427 902876663
406 902876663 812964859 690353546 649892960 646156311 513143692 419829826 536432877
412.8 536432877 516762390 544931641 641929703 619502869 533591118 577982063 650559769
419.5 650559769 535985184 477098923 443571587 531846466 534698029 470813484 524021950
426.3 524021950 493877525 505119057 537695236 471522560 391177597 407959862 551783600
433 551783600 621665955 582110863 547568359 524080696 580321541 632154427 605176277 535290794
440.7 535290794 502952843 521077843 508309479 425902634 382089691 413582268 434470100
447.5 434470100 516671600 598642159 595475769 613778801 597800102 501948204 448645859 492675362
$$ packed form
399.3E60333023K84052658q8243179k27257309o2861405q2511J74753150K62182236
406I02876663q9911804j22611313m0460586l736649j33012619r3313866J16603051
412.8E36432877j9670487K8169251R6998062k2426834q5911751M4390945P2577706
419.5F50559769j14574585n8886261l3527336Q8274879K851563o3884545N3208466
426.3E24021950l0144425J1241532L2576179o6172676q0344963J6782265J43823738
433E51783600O9882355l9555092l4542504k3487663N6240845N1832886k6978150o9885483
440.7E35290794l2337951J8125000j2768364q2406845m3812943L1492577K0887832
447.5D34470100Q2201500Q1970559l166390J8303032j5978699r5851898n3302345M4029503
$$ plain form
455.2 492675362 556824112 536885414 508574524 534961014 536751099 485399170 465667992 484469643
462.9 484469643 481363869 528386841 550726509 468504829 479761620 556183586 521018257 460103149
470.6 460103149 477066803 511961212 458817978 496763725 602139893 548806725 470566521
477.4 470566521 514802513 559817657 524812012 487420998 467551727 432559052 444841614
484.1 444841614 518503304 549469528 518738594 519367218 566405296 591472702 613285599 580596542
491.8 580596542 528420334 514933739 523398285 532107735 506454506 517589340 545348511 536828804
499.6 536828804 546442032 576511650 584657860 541251259 519317703 518021889 499232750 544003830
507.3 544003830 611173210 571120453 531477432 560631676 536285706 461561546 422297554
$$ packed form
455.2D92675362O4148750j9938698k8310890K6386490J790085n1351929j9731178J8801651
462.9D84469643l105774M7022972K2339668q2221680J1256791P6421966l5165329o0915108
470.6D60103149J6963654L4894409n3143234L7945747J05376168n3333168p8240204
477.4D70566521M4235992M5015144l5005645l7391014j9869271l4992675J2282562
484.1D44841614P3661690L0966224l0730934O28624M7038078K5067406K1812897l2689057
491.8E80596542n2176208j3486595Q464546Q709450k5653229J1134834K7759171q519707
499.6E36828804R613228L0069618Q146210m3406601k1933556j295814j8789139M4771080
507.3E44003830O7169380m0052757l9643021K9154244k4345970p4724160l9263992
$$ plain form
514 422297554 460796661 518831596 496521606 462012558 453168449 466575737 529441681 572371635
521.7 572371635 561796188 540601883 529286308 503730469 475980530 479731636 457628174 437314606
529.5 437314606 476325111 509613304 517569504 505101700 487869072 505789680 507069244 501473045
537.2 501473045 507385292 505944138 514286957 496660347 486496162 489526787 478673172 490618591
544.9 490618591 487505722 484955902 479842148 466127701 502686577 511129150 494400940 499993706
552.6 499993706 498637733 508211632 496951714 491309814 515837440 507033043 488417358 474251099
560.3 474251099 469407959 488293495 487711487 488506279 499422760 483747330 482360992 507008896
568 507008896 523209801 520654068 491935425 455112114 449986877 477915878 502979507 510864601
$$ packed form
514D22297554L8499107N8034935k2309990l4509048q844109J3407288O2865944M2929954
521.7E72371635j0575447k1194305j1315575k5555839k7749939L751106k2103462k0313568
529.5D37314606L9010505L3288193P956200j2467804j7232628J7920608J279564n596199
537.2E01473045N912247j441154Q342819j7626610j0164185L030625j0853615J1945419
544.9D90618591l112869k549820n113754j3714447L6558876Q442573j6728210N592766
552.6D99993706j355973R573899j1259918n641900K4527626q804397j8615685j4166259
560.3D74251099m843140J8885536n82008P94792J0916481j5675430j386338K4647904
568E07008896J6200905k555733k8718643l6823311n125237K7929001K5063629P885094
$$ plain form
575.8 510864601 506547356 506468239 495249443 470898781 468841324 464020004 470611877 493402176
583.5 493402176 486656342 478112755 464335098 449902344 468570175 499942017 507216187 502508583
591.2 502508583 513624001 508076248 502670097 500486679 482324600 490191154 501139412 487678223
598.9 487678223 466841011 462353935 481072159 477390251 450274277 447655983 467109528 468335724
606.6 468335724 457750168 444964638 421409988 413884659 406600647 383637276 370156326 364627304
614.3 364627304 373094559 392072945 391317673 375210838 362641487 352382011 348304367 345656548
622 345656548 336727753 330671921 331311836 329085503 329312820 341017876 364405670 399769363 416574059
630.7 416574059 419261703 429912300 431601906 416429482 393775406 391486206 393247528 371526108
$$ packed form
575.8E10864601m317245p9117j1218796k4350662k057457m821320O591873K2790299
583.5D93402176o745834q543587j3777657j4432754J8667831L1371842P274170m707604
591.2E02508583J1115418n547753n406151k183418j8162079P866554J0948258j3461189
598.9D87678223k0837212m487076J8718224l681908k7115974k618294J9453545J226196
606.6D68335724j0585556j2785530k3554650p525329p284012k2963371j3480950n529022
614.3C64627304Q467255J8978386p55272j6106835j2569351j0259476m077644k647819
622C45656548q928795o055832O39915k226333K27317J1705056K3387794L5363693J6804696
630.7D16574059K687644J0650597J689606j5172424k2654076k289200J761322k1721420
$$ plain form
638.4 371526108 355434608 369727135 402708015 424096718 434064217 434407845 433184166 450470314
646.2 450470314 478366089 496516762 487692528 482706795 502084312 510940056 510715523 519016685
653.9 519016685 521331787 511789818 497512169 499818611 521062202 532342682 530983620 530745125
661.6 530745125 530184135 533600540 534478264 522177391 516988945 519958000 496286392 530244179
669.3 530244179 563890610 567345467 557054443 546959801 546146545 545809975 535136414 533157692
677 533157692 531090355 532929077 542040253 538728294 539463425 544920158 538050766 537989655 545990028
685.7 545990028 535195274 521366653 528350792 538948555 533253555 521647072 523075714 527880096
693.4 527880096 526901398 527389679 525794144 520518265 512367630 509157600 515695686 518573112 516568680
$$ packed form
638.4C71526108j6091500J4292527L2980880K1388703R967499L43628j223679J7286148
646.2D50470314K7895775J8150673q824234m985733J9377517Q855744k24533Q301162
653.9E19016685K315102r541969j4277649K306442K1243591J1280480j359062k38495
661.6E30745125n60990L416405Q77724j2300873n188446K969055k3671608L3957787
669.3E30244179L3646431L454857j0291024j0094642q13256l36570j0673561j978722
677E33157692k067337J838722R111176l311959P35131N456733o869392o1111Q000373
685.7E45990028j0794754j3828621O984139J0597763n695000j1606483J428642M804382
693.4E27880096r78698M88281j595535n275879q150635l210030O538086K877426k004432
$$ plain form
702.1 516568680 518199081 519547997 517374573 517436714 522575836 526620827 532418137 541391640 541120567
710.8 541120567 533509369 526129799 527309189 537641830 539663467 535752144 536565475 540167122
718.5 540167122 541944618 540300598 541486168 544129524 544842834 548965645 556626396 561882248 561394005
727.2 561394005 553652039 549130325 544523430 538108253 551903915 556792068 541435127 537344666
734.9 537344666 530725327 530518188 543262444 541507721 533226585 541787376 551542282 544313126
742.6 544313126 546460724 557317162 558614960 554670410 548774834 547468987 549780159 557489510
750.3 557489510 565258598 567062035 567031975 568894539 574994392 582424850 592623291 586289406 572953911
759 572953911 576508636 581523514 589535217 588218231 581290665 592723885 601521568 591937752 577772446
$$ packed form
702.1E16568680J630401J348916k173424O2141N139122M044991N797310Q973503k71073
710.8E41120567p611198p379570J179390J0332641K021637l911323Q13331L601647
718.5E40167122J777496j644020J185570K643356P13310M122811P660751N255852m88243
727.2E61394005p741966m521714m606895o415177J3795662M888153j5356941m090461
734.9E37344666o619339k07139J2744256j754723q281136Q560791R754906p229156
742.6E44313126K147598J0856438J297798l944550n895576j305847K311172P709351
750.3E57489510P769088J803437l0060J862564O099853P430458J0198441o333885j3335495
759E72953911L554725N014878Q011703j316986o927566J1433220Q797683r583816j4165306
$$ plain form
767.7 577772446 576958313 576376572 574158630 582334976 581421471 574898987 576784096 584608841 587827721
776.4 587827721 585781555 590306358 594454765 597656822 601929741 599964142 596752815 603581276
784.1 603581276 611217270 608563042 609449005 607772560 594919586 589976349 602911797 614346085
791.8 614346085 608930473 601387367 600354195 605413055 607647896 603147850 602144737 604227028
799.5 604227028 605471954 601660728 597169189 598565712 607646561 616989479 617968864 615731316 610359764
808.2 610359764 612841339 619463692 621983910 628626404 632305450 633846092 623559380 613280678
815.9 613280678 620691643 626132278 628722458 624097557 619162827 622036324 616847343 614681015
823.6 614681015 616262054 613226624 614954300 616180534 607176132 602217751 607697716 608791733
$$ packed form
767.7E77772446q14133n81741k217942Q176346r13505o522484J885109P824745L218880
776.4E87827721k046166M524803M148407L202057M272919j965599l211327O828461
784.1F03581276P635994k654228Q85963j676445j2852974m943237J2935448J1434288
791.8F14346085n415612p543106j033172N058860K234841m500046j003113K082291
799.5F04227028J244926l811226m491539J396523R080849R342918R79385k237548n371552
808.2F10359764K481575O622353K520218O642494L679046J540642j0286712j0278702
815.9F13280678P410965N440635K590180m624901m934730K873497n188981k166328
823.6F14681015J581039l035430J727676J226234r004402m958381N479965J094017
$$ plain form
831.3 608791733 605195274 597254715 593706932 595562859 591588402 593437653 589948235 578114777
839 578114777 571546288 563543243 563541756 566178474 560248756 562338066 569350128 566676521 558918762
847.7 558918762 553043480 556613541 564310532 560123329 556510658 564043732 572034988 575439529
855.4 575439529 576337585 580971909 586394424 590214691 594537468 598254662 602864037 605392952 606541061
864.1 606541061 603171120 597616310 599733620 605890541 613563766 612530060 610856819 618872299
871.8 618872299 616224480 611784668 614853058 616107635 618246040 621848450 623645782 615445862
879.5 615445862 606596680 607587509 610391083 613952217 613634453 608633995 605557632 603530884 600749741
888.2 600749741 597352867 597971306 594418869 582885323 583406639 593620834 591916122 583652992
$$ packed form
831.3F08791733l596459p940559l547783J855927l974457J849251l489418j1833458
839E78114777o568489q003045j487K636718n929718K089310P012062k673607p757759
847.7E58918762n875282L570061P696991m187203l612671P533074P991256L404541
855.4E75439529Q98056M634324N422515L820267M322777L717194M609375K528915J148109
864.1F06541061l369941n554810K117310O156921P673225j033706j673241Q015480
871.8F18872299k647819m439812L068390J254577K138405L602410J797332q199920
879.5F15445862q849182R90829K803574L561134l17764n000458l076363k026748k781143
888.2F00749741l396874O18439l552437j1533546N21316J0214195j704712q263130
$$ plain form
895.9 583652992 588689575 607624321 613085136 597110405 589544067 593352356 595547218 593965378
903.7 593965378 590566635 595300484 596456604 588344765 585021210 582297821 577016106 572656403
911.4 572656403 570909042 567765961 563030434 563434486 564029579 558818893 551035233 549787788 554649925
920 554649925 554556236 545511627 540764160 545285072 544386292 539336472 532721100 529612160 533165817
928.7 533165817 528177719 526231194 531996422 531450691 532174797 533112411 533115959 538732300 542534676
937.4 542534676 546439819 552920837 555436134 559651909 564051399 564801788 569471436 574405365 575076714
946.1 575076714 578175354 584001083 582270279 580334358 588452225 589419136 584689369 587527618 590700302
954.8 590700302 590985909 588787651 583339653 574350243 569049187 574735260 579780388 572350121 561905975
$$ packed form
895.9E83652992N036583J8934746N460815j5974731p566338L808289K194862j581840
903.7E93965378l398743M733849J156120q111839l323555k723389n281715m359703
911.4E72656403j747361l143081m735527M04052N95093n210686p783660j247445M862137
920E54649925r3689r044609m747467M520912q98780n049820o615372l108940L553657
928.7E33165817m988098j946525N765228n45731P24106R37614L548N616341L802376
937.4E42534676L905143O481018K515297M215775M399490P50389M669648M933929O71349
946.1E75076714L098640N825729j730804j935921Q117867R66911m729767K838249L172684
954.8E90700302K85607k198258n447998q989410n301056N686073N045128p430267j0444146
$$ plain form
963.4 561905975 559721718 558710480 554249992 552201996 552129898 551577682 552493324 552916527 549492989
972.1 549492989 543340645 540091286 541399269 538580666 534156265 534196892 532774849 532295723 533542175
980.8 533542175 532548943 530571594 526696243 525007782 525755234 520934677 514711037 512413826 510805397
989.5 510805397 506777344 496063385 484207840 476406059 467729836 454489326 436825066 432588615
997.2 432588615 447735977 463648758 473734055 479106445 480911598 478538933 475872841 480494461
1004.9 480494461 479208908 472970161 471755066 472470894 474169617 469876022 467010155 468163643
1012.6 468163643 467998161 469800339 464404831 456747475 453795967 451321182 448855705 446589050
1020.3 446589050 445986061 445468025 446435776 443850098 437885475 432299728 427796669 428615990 427189178
$$ packed form
963.4E61905975k184257j011238m460488k047996p2098n52216R15642M23203l423538
972.1E49492989o152344l249359J307983k818603m424401M0627j422043m79126J246452
980.8E33542175r93232j977349l875351j688461P47452m820557o223640k297211j608429
989.5E10805397m028053j0713959j1855545p801781q676223j3240510j7664260m236451
997.2D32588615J5147362J5912781J0085297N372390J805153k372665k666092M621620
1004.9D80494461j285553o238747j215095P15828J698723m293595k865867J153488
1012.6D68163643j65482J802178n395508p657356k951508k474785k465477k266655
1020.3D46589050o02989n18036R67751k585678n964623n585747m503059Q19321j426812
$$ plain form
1029 427189178 426797905 430675812 426322136 413991508 412062798 420696983 422758179 422321815 419016762
1037.7 419016762 414929810 412561798 407065659 406717224 410054207 413886909 414972267 414674644 413518486
1046.4 413518486 408319893 407693214 412868423 419689598 419173126 414460487 413556328 410804787 407713280
1055.1 407713280 409018898 415025978 415070648 411505241 413224869 410199738 407118721 409481697 410797043
1063.7 410797043 414623909 415307770 410721664 410793457 410958252 408956146 402578087 396305084 396259575
1072.4 396259575 394751205 400057144 405251770 400371208 398020172 396603737 391940422 389937935
1080.1 389937935 393753548 392013626 385461121 387129707 391583977 390178871 388253899 391323395
1087.9 391323395 392152481 387415199 381351585 376781578 365283546 349578094 342371330 338599854
$$ packed form
1029D27189178l91273L877907m353676j2330628j928710Q634185K061196m36364l305053
1037.7D19016762m086952k368012n496139l48435L336983L832702J085358k97623j156158
1046.4D13518486n198593o26679N175209O821175n16472m712639r04159k751541l091507
1055.1D07713280J305618O007080M4670l565407J719628l025131l081017K362976J315346
1063.7D10797043L826866O83861m586106P1793J64795k002106o378059o273003m5509
1072.4C96259575j508370N305939N194626m880562k351036j416435m663315k002487
1080.1C89937935L815613j739922o552505J668586M454270j405106j924972L069496
1087.9C91323395Q29086m737282o063614m570007j1498032j5705452p206764l771476
$$ plain form
1095.6 338599854 334186592 324771881 317515640 312937069 302353745 288080406 272538338 266269436
1103.3 266269436 255221939 243542385 236823883 221347828 210721531 200448418 190841293 181964359
1111 181964359 176894302 173291302 161612701 158515720 159465008 157721586 151995459 150629387 152524271
1119.7 152524271 151872482 153551159 149801445 149725771 153507175 161176872 166169720 164932671 167522697
1128.4 167522697 166991653 166759472 164959850 161283226 157297468 156924124 156785583 148573675 142746744
1137 142746744 136807280 135362320 134356451 130743179 128408613 124431238 123179722 116965160 110631752
1145.7 110631752 105498486 102612753 101762638 97116232 97018127 100107145 99004011 93859234 96498528
1154.4 96498528 98181467 99391098 104935284 104475536 106160803 108249912 112281837 114322615 115526314
$$ packed form
1095.6C38599854m413262r414711p256241m578571j0583324j4273339j5542068o268902
1103.3B66269436j1047497j1679554o718502j5476055j0626297j0273113r607125q876934
1111A81964359n070057l603000j1678601l096981R49288j743422n726127j366072J894884
1119.7A52524271o51789J678677l749714p5674L781404P669697M992848j237049K590026
1128.4A67522697n31044k32181j799622l676624l985758l73344j38541q211908n826931
1137A42746744n939464j444960j005869l613272k334566l977375j251516o214562o333408
1145.7A10631752n133266k885733q50115m646406r8105L089018j103134n144777K639294
1154.4I6498528J682939J209631N544186m59748J685267K089109M031925K040778J203699
$$ plain form
1163.1 115526314 120933542 123920507 128122911 133395967 140508575 141443214 144260387 153826752
1170.8 153826752 160351868 168025112 173186359 178570099 186653194 195806999 205405769 218339748
1178.5 218339748 230840607 239728088 249962959 257402229 267087231 274553337 279017582 285256767
1186.2 285256767 290367355 298193550 306343555 315248547 321167030 325506935 328469620 331553345
1193.9 331553345 342017021 350286446 355260162 357462997 362516594 372178535 376306877 380536156
1201.6 380536156 387541924 393228035 396066742 398562508 401826439 406762848 412469254 416279716
1209.4 416279716 422525558 428243866 431211586 432116928 432465019 433895721 434725342 436036072 435843124
1218 435843124 439346199 444696350 444135933 444269867 446886024 447360115 446429596 448160667 449492989
$$ packed form
1163.1A15526314N407228K986965M202404N273056P112608R34639K817173R566365
1170.8A53826752O525116P673244N161247N383740Q083095R153805R598770J2933979
1178.5B18339748J2500859Q887481J0234871P439270R685002P466106M464245O239185
1186.2B85256767N110588P826195Q150005Q904992N918483M339905K962685L083725
1193.9C31553345J0463676Q269425M973716K202835N053597R661941M128342M229279
1201.6C80536156P005768N686111K838707K495766L263931M936409N706406L810462
1209.4D16279716O245842N718308K967720R05342L48091J430702Q29621J310730j92948
1218D35843124L503075N350151n60417J33934K616157M74091r30519J731071J332322
$$ plain form
1226.7 449492989 449867287 451360588 451318092 452747421 455651932 456257820 454402390 452700157 451766357
1235.4 451766357 452522621 455765610 455846481 454483643 456061440 458544121 460253029 460576859 459863281
1244.1 459863281 459016647 459094467 459882698 459980965 460544167 464005737 465492821 462686386 462361488
1252.8 462361488 465596809 467585411 467213936 466442871 465984802 467573013 469173355 469896393 471015930
1261.4 471015930 469435768 469777908 473871536 476028366 475365868 476930504 480964851 479280472 475346336
1270.1 475346336 478451385 485045891 485373116 483142090 485572815 487190018 485854530 485898666 489822998
1278.8 489822998 494385796 498224487 502082787 502154083 502382317 505258904 506637764 507910194 509192963
1287.5 509192963 508599930 511021614 516633949 518130531 518888474 521448402 521932983 524634056 529329567
$$ packed form
1226.7D49492989L74298J493301m2496J429329K904511O05888j855430j702233r33800
1235.4D51766357P56264L242989Q0871j362838J577797K482681J708908L23830p13578
1244.1D59863281q46634P7820P88231R8267N63202L461570J487084k806435l24898
1252.8D62361488L235321J988602l71475p71065m58069J588211J600342P23038J119537
1261.4D71015930j580162L42140M093628K156830o62498J564636M034347j684379l934136
1270.1D75346336L105049O594506L27225k231026K430725J617203j335488M4136L924332
1278.8D89822998M562798L838691L858300P1296K28234K876587J378860J272430J282769
1287.5E09192963n93033K421684N612335J496582P57943K559928M84581K701073M695511
$$ plain form
1296.2 529329567 530525513 531888313 535317001 535772247 535055046 536548920 535994186 535954971 540016136
1304.8 540016136 543491592 545852661 546243668 543719368 542727203 544682312 545582733 543882637 545088959
1313.5 545088959 547600899 547553711 548613892 551361885 553177414 551984367 549856873 550337868 552491760
1322.2 552491760 554506416 555119171 554909172 555470390 555483017 555348930 557965355 560214119 560283279
1330.9 560283279 560309753 560036392 559082794 558809319 561233597 562290840 560598412 558631706 556590118
1339.6 556590118 558477821 559576607 559706230 561839256 561275368 560635262 562196007 561223068 560218277
1348.2 560218277 563144073 564790268 561548080 558539696 558910103 560397186 563330193 564959526
1355.9 564959526 562997131 562821465 564394188 563969955 559798241 556220398 555802193 554478722 556344032
$$ packed form
1296.2E29329567J195946J362800L428688M55246p17201J493874n54734l9215M061165
1304.8E40016136L475456K361069L91007k524300r92165J955109R00421j700096J206322
1313.5E45088959K511940m7188J060181K747993J815529j193047k127494M80995K153892
1322.2E52491760K014656O12755k09999N61218J2627j34087K616425K248764O9160
1330.9E60283279K6474k73361r53598k73475K424278J057243j692428j966706k041588
1339.6E56590118J887703J098786J29623K133026n63888o40106J560745r72939j004791
1348.2E60218277K925796J646195l242188l008384L70407J487083K933007J629333
1355.9E64959526j962395j75666J572723m24233m171714l577843m18205j323471J865310
$$ plain form
1364.6 556344032 557983055 557926369 557643967 555890121 553489380 551975861 555685310 556598091 551676331
1373.3 551676331 552403755 551347313 549569855 550833206 548107529 545951424 545697441 543497887 543709068
1382 543709068 545731201 546572876 547588425 548742447 548895264 546682205 549028549 553118858 553911171
1390.7 553911171 555142403 553534660 550975266 550278893 549544754 552150917 551684494 551042442 549328461
1399.3 549328461 544125519 542449951 541796532 543188438 543264389 540251389 540849037 542473946 541764412
1408 541764412 539985771 539899979 540225830 541842270 542501106 541567459 542533875 542531471 540649796 538371010
1417.7 538371010 536744614 532446327 534539833 538941574 539647026 539661865 538257256 538011322 540733833
1426.3 540733833 541629944 541448288 540464706 540055389 543378716 546071548 545318680 544368782 545839233
$$ packed form
1364.6E56344032J639023n6686k82402j753846k400741j513519L709449R12781m921760
1373.3E51676331P27424j056442j777458J263351k725677k156105k53983k199554K11181
1382E43709068K022133Q41675J015549J154022J52817k213059K346344M090309P92313
1390.7E53911171J231232j607743k559394o96373p34139K606163m66423o42052j713981
1399.3E49328461n202942j675568o53419J391906P5951l013000N97648J624909p09534
1408E41764412j778641q5792L25851J616440O58836r33647R66416k404j881675k278786
1417.7E38371010j626396m298287K093506M401741P05452J4839j404609k45934K722511
1426.3E40733833Q96111j81656r83582m09317L323327K692832p52868r49898J470451
$$ plain form
1435 545839233 546780167 545517464 548147049 551238556 550920906 552108192 555361481 556093483 557358818
1443.7 557358818 558023911 559149323 561186905 562413902 563415222 562835579 563047943 562898369 561501389
1452.4 561501389 562568474 563189621 561339531 562673492 564011078 563680534 566262741 567747993 570332298
1461.1 570332298 571693268 573867264 575866013 573258743 574011536 575229797 576585503 576909142 577215729
1469.7 577215729 579434929 577924461 578051109 581631088 583925858 587526245 592887001 597897987
1477.5 597897987 601020584 603291550 604599724 603630409 604390335 608508530 610018501 608438377 608586922
1486.1 608586922 610531731 610407600 610955200 612366982 609928741 609827576 611782074 611845551 610694504
1494.8 610694504 610019493 607970963 607252388 603484802 602007332 604027100 603896027 604594269 604770088
$$ packed form
1435E45839233R40934j262703K629585L091507l17650J187286L253289P32002J265335
1443.7E57358818O65093J125412K037582J226997J001320n79643K12364j49574j396980
1452.4E61501389J067085O21147j850090J333961J337586l30544K582207J485252K584305
1461.1E70332298J360970K173996J998749k607270P52793J218261J355706L23639L06587
1469.7E77215729K219200j510468J26648L579979K294770L600387N360756N010986
1477.5E97897987L122597K270966J308174r69315P59926M118195J509971j580124J48545
1486.1F08586922J944809j24131N47600J411782k438241j01165J954498O3477j151047
1494.8F10694504o75011k048530p18575l767586j477470K019768j31073O98242J75819
$$ plain form
1503.5 604770088 602394943 595146561 587823448 589869499 590217743 592152596 589402237 588321114
1511.2 588321114 585613251 582983551 583643646 582214508 578774452 572191048 575290260 578915710
1518.9 578915710 580526161 577940636 569643097 575654488 578659286 579141426 578609390 578293762 576181488
1527.6 576181488 569663315 569518509 572139664 570904846 565894661 561279411 561258278 562874985 562784348
1536.3 562784348 562283745 564040985 562324257 555477371 560651550 563061485 556093483 555403862 559427757
1545 559427757 557193336 556915054 558541641 560701752 560812378 557840195 559928780 559709740 559093323
1553.6 559093323 561471977 561510582 563131828 560526009 559133949 573892937 558621407 561049957
1561.4 561049957 565972214 568477783 568915405 570777168 573535690 573134308 571649208 569595261 566659393
$$ packed form
1503.5F04770088k375145p248382p323113K046051L48244J934853k750359j081123
1511.2E88321114k707863k629700O60095j429138l440056o583404L099212L625450
1518.9E78915710J610451k585525q297539O011391L004798M82140n32036l15628k112274
1527.6E76181488o518173j44806K621155j234818n010185m615250k1133J616707r0637
1536.3E62784348n00603J757240j716728o846886N174179K409935o968002o89621M023895
1545E59427757k234421k78282J626587K160111J10626k972183K088585k19040o16417
1553.6E59093323K378654L8605J621246k605819j392060J4758988j5271530K428550
1561.4E61049957M922257K505569M37622J861763K758522m01382j485100k053947k935868
$$ plain form
1570 566659393 567801323 568965492 571009483 571445503 570427284 566954384 557746964 562032394 565433960
1578.7 565433960 566923332 566154404 563216133 561830750 560490799 560230179 558263893 555424461 552817612
1587.4 552817612 551354675 553710289 550881996 544978638 542536812 543142204 540753555 534116516
1595.1 534116516 530248146 528576508 529233742 527406425 523791885 519613304 516376305 516239243 514888229
1603.8 514888229 513058281 510241737 506535988 502785225 502318916 500036278 496079292 494653473
1611.5 494653473 491891212 492152634 489997520 487134666 485496101 480978508 480006104 477128410 476312218
1620.2 476312218 474052696 472309875 470261955 469557533 470816269 468626976 467316589 463253059
1627.9 463253059 463855438 464420052 460611191 457320976 455924606 457447891 456912117 454673882 449812393
$$ packed form
1570E66659393J141930J164169K043991M36020j018219l472900r207420M285430L401566
1578.7E65433960J489372p68928k938271j385383j339951k60620j966286k839432k606849
1587.4E52817612j462937K355614k828293n903358k441826O05392k388649o637039
1595.1E34116516l868370j671638O57234j827317l614540m178581l236999j37062j351014
1603.8E14888229j829948k816544l705749l750763m66309k282638l956986j425819
1611.5D94653473k762261K61422k155114k862854j638565m517593r72404k877694q16192
1620.2D76312218k259522j742821k047920p04422J258736k189293j310387m063530
1627.9D63253059O02379N64614l808861l290215j396370J523285n35774k238235m861489
$$ plain form
1636.6 449812393 449751167 453300934 455287399 455470924 453939552 454533844 452007065 452244797 454413185
1645.3 454413185 453648796 455638046 456560097 458923798 459094048 462055779 466274681 471847115 461886177
1653.9 461886177 461187630 466139679 466533279 468076706 468467216 467606239 470379333 474769936 476844368
1662.6 476844368 475321922 477952232 479637833 483104591 485716133 484557114 484948502 488877907
1670.3 488877907 493142815 494673691 498645782 503075676 504952507 501372185 504447517 511640739
1678 511640739 515412025 517059937 516799812 520119820 524634209 525865784 524997444 526796265 532776070
1686.7 532776070 535301094 538545990 541112671 542136497 546778069 550131073 554695168 557576370
1694.4 557576370 558181877 559682732 563160248 569384232 574421577 572237167 575474930 584479294
$$ packed form
1636.6D49812393o1226L549767J986465J83525j531372N94292k526779K37732K168388
1645.3D54413185p64389J989250R22051K363701J70250K961731M218902N572434r960938
1653.9D61886177o98547M952049L93600J543427L90510q60977K773094M390603K074432
1662.6D76844368j522446K630310J685601L466758K611542j159019L91388L929405
1670.3D88877907M264908J530876L972091M429894J876831l580322L075332P193222
1678E11640739L771286J647912k60125L320008M514389J231575q68340J798821N979805
1686.7E32776070K525024L244896K566681J023826M641572L353004M564095K881202
1694.4E57576370O05507J500855L477516O223984N037345k184410L237763R004364
$$ plain form
1702.1 584479294 589434738 593716469 598075294 600928917 604505768 606500015 607978554 610493431
1709.9 610493431 614700508 616923599 618467484 619552460 617641907 620734329 625724220 630846825
1717.6 630846825 628451576 629588852 634110870 632995796 632325363 635662994 638161430 640527954
1725.3 640527954 641763916 641218033 640664062 641262970 641574326 643460159 646408997 645974350 636659050
1734 636659050 635175209 644767838 648821030 650714569 654832458 654219894 652832031 657944031 660158539
1742.7 660158539 658127365 659321213 664082184 667571640 666703262 666519852 671328812 675494537 673962784
1751.3 673962784 674623718 680212097 682553940 683308792 684907608 685663071 689363708 691477890 691716156
1760 691716156 692691803 690885696 693969040 698495178 699552994 698480988 699144440 702832489 701873703
$$ packed form
1702.1E84479294M955444M281731M358825K853623L576851J994247J478539K514877
1709.9F10493431M207077K223091J543885J084976j910553L092422M989891N122605
1717.6F30846825k395249J137276M522018j115074o70433L337631K498436K366524
1725.3F40527954J235962n45883n53971N98908L11356J885833K948838m34647r315300
1734F36659050j483841R592629M053192J893539M117889o12564j387863N112000K214508
1742.7F60158539k031174J193848M760971L489456q68378j83410M808960M165725j531753
1751.3F73962784O60934N588379K341843P54852J598816P55463L700637K114182K38266
1760F91716156R75647j806107L083344M526138J057816j072006O63452L688049r58786
$$ plain form
1768.7 701873703 700770874 701054306 700376358 699058533 698717422 703624878 704685135 703549118 706339417
1777.4 706339417 709227066 710052032 708154221 708869553 710277252 710663376 711209717 710694656 711551819
1786 711551819 713345947 714129105 713036499 713404388 715153656 717039185 715708618 712996826 715845337
1794.7 715845337 717676239 716543121 716388016 716475449 713534164 712459869 717424927 720699539 721728287
1803.4 721728287 721868134 722118530 722628555 720862427 719804916 720988159 721234055 718440552 719158859
1812.1 719158859 720849838 722078552 724767914 724368896 724225693 724694290 724912796 725414581 725213776
1820.8 725213776 726959686 726393967 724553070 724280472 723182220 724123993 725740128 727124329 727229385
1829.4 727229385 725708771 728097763 729950180 729393082 728812256 726412277 725813065 727821503 728411026
$$ packed form
1768.7G01873703j102829K83432o77948j317825l41111M907456J060257j136017K790299
1777.4G06339417K887649Q24966j897811P15332J407699L86124N46341n15061Q57163
1786G11551819J794128P83158j092606L67889J749268J885529j330567k711792K848511
1794.7G15845337J830902j133118j55105Q7433k941285j074295M965058L274612J028748
1803.4G21728287J39847K50396N10025j766128j057511J183243K45896k793503P18307
1812.1G19158859J690979J228714K689362l99018j43203M68597K18506N01785k00805
1820.8G25213776J745910n65719j840897k72598j098252R41773J616135J384201J05056
1829.4G27229385j520614K388992J852417n57098n80826k399979n99212K008438N89523
$$ plain form
1838.1 728411026 728939743 729100800 730714493 730339508 728252640 728152008 726652145 727720718 728912277
1846.8 728912277 730120316 730796814 731022415 731965714 732562714 733708038 732909088 732453461 731986237
1855.5 731986237 730362549 731722260 732604370 732833176 733847656 733596268 732580795 731610184 731899109
1864.2 731899109 733178787 732616730 730818329 730960236 732905731 733904724 732941208 733679886 734875870
1872.8 734875870 735228958 735352478 733410187 732738419 734014511 735607376 736318588 735903854 736116791
1881.5 736116791 735781403 735093842 733678055 733627548 734979858 735097046 734930573 733825836 732624283
1890.2 732624283 732631607 732947922 733141022 734580994 736082306 736130219 737239914 737917252 737522888 735277176
1899.8 735277176 733627319 733612366 733486786 735851974 738300629 738724670 737296066 735505829 734444351
$$ packed form
1838.1G28411026N28717J61057J613693l74985k086868j00632j499863J068573J191559
1846.8G28912277J208039O76498K25601R43299N97000J145324p98950m55627m67224
1855.5G31986237j623688J359711Q82110K28806J014480k51388j015473r70611K88925
1864.2G31899109J279678n62057j798401J41907J945495R98993r63516P38678J195984
1872.8G34875870L53088J23520j942291o71768J276092J592865P11212m14734K12937
1881.5G36116791l35388o87561j415787n0507J352310J17188j66473j104737j201553
1890.2G32624283P324L16315J93100J439972J501312M7913J109695O77338l94364k245712
1899.8G35277176j649857j4953j25580K365188K448655M24041j428604j790237j061478
$$ plain form
1908.5 734444351 734142380 735583420 735699081 736042862 737360535 737236557 735643463 735530396 736581955
1917.2 736581955 734357147 734647446 735984879 735539246 737084045 737784576 735552673 734333801 735084763
1925.9 735084763 736018524 734233780 732496567 734516754 736830978 737960052 737519684 734942322 733840332
1934.6 733840332 734549026 735821838 735323792 733545456 733406677 735035477 736304550 733664474 731220551
1943.2 731220551 732384491 733658905 733438721 732888412 733907394 735979004 738649216 738113022 735630722
1951.9 735630722 734132614 734113388 733896027 731984100 732700653 731968384 730979004 733203125 734299469
1960.6 734299469 735179291 734041672 733671799 735611496 734888000 733714523 733253326 732783661 733867340
1969.3 733867340 734346619 733662186 734133606 734094238 733395615 732999268 733386002 733629837 733199005 733610229
$$ packed form
1908.5G34444351l01971J441040J15661L43781J317673j23978j593094j13067J051559
1917.2G36581955k224808K90299J337433m45633J544799P00531k231903j218872P50962
1925.9G35084763R33761j784744j737213K020187K314224J129074m40368k577362j101990
1934.6G33840332P08694J272812m98046j778336j38779J628800J269073k640076k443923
1943.2G31220551J163940J274414k20184n50309J018982K071610K670212n36194k482300
1951.9G35630722j498108j9226k17361j911927P16553p32269r89380K224121J096344
1960.6G34299469Q79822j137619l69873J939697p23496j173477m61197m69665J083679
1969.3G33867340M79279o84433M71420l9368o98623l96347L86734K43835m30832M11224
$$ plain form
1978.9 733610229 732366409 731692352 731616745 729742126 728823853 729290009 730571365 731047745 731801758
1987.6 731801758 731453781 730648117 731673279 730688934 728523026 727595367 729136887 731179276 731682816
1996.3 731682816 731266556 730762711 731978149 731764145 730227432 728608704 729763794 731842651 729989548
2005 729989548 729226379 729124832 729113464 729430618 729494247 729448853 728176956 728517761 727847519 727131042
2014.6 727131042 728843079 729602280 728885727 728198471 728877945 729648514 729263306 727229233 726199722
2023.3 726199722 727066422 727385941 726796722 725577621 726279602 726504288 725332565 725937881 726268692
2032 726268692 725175018 724556351 725777206 726530914 726512070 727297058 726879196 725334167 723739777
2040.6 723739777 722757187 724705353 727032623 726513901 724930878 723098831 723294754 724664230 724598312
$$ packed form
1978.9G33610229j243820o74057p5607j874619r18273M66156J281356M76380P54013
1987.6G31801758l47977q05664J025162r84345k165908r27659J541520K042389N03540
1996.3G31682816m16260n03845J215438k14004j536713j618728J155090K078857j853103
2005G29989548p63169j01547j1368L17154O3629m5394j271897L40805o70242p16477
2014.6G27131042J712037P59201p16553o87256O79474P70569l85208k034073j029511
2023.3G26199722Q66700L19519n89219j219101P01981K24686j171723O05316L30811
2032G26268692j093674o18667J220855P53708j8844P84988m17862j545029j594390
2040.6G23739777r82590J948166K327270n18722j583023j832047J95923J369476o5918
$$ plain form
2049.3 724598312 724956207 724509277 723616943 722748184 721659470 722063675 723470612 724170151 723540344
2058 723540344 723539581 723008499 721168289 719875565 720180359 721585007 721723175 721075745 719943161 719868240
2067.6 719868240 721755676 722379990 720024414 718109131 719238663 718733368 716710281 716020889 715492706
2076.3 715492706 714476242 714512711 716461487 716184006 715504608 716603394 716232758 715700912 715519867
2085 715519867 713836899 712129211 713384628 715219116 715556488 716092911 715965042 714766388 713230209
2093.7 713230209 712787323 714765549 716375122 715820312 715346527 715160141 715453186 716479034 717629395
2102.4 717629395 718053055 717313919 717606964 717088089 716820221 717169647 716190720 717136841 718008881 719351349
2112 719351349 720142746 719143372 718235550 715872040 716621246 717798004 716744080 717463608 718047943
$$ packed form
2049.3G24598312L57895m46930q92334q68759j088714M04205J406937O99539o29807
2058G23540344p63n31082j840210j292724L04794J404648J38168o47430j132584p4921
2067.6G19868240J887436O24314k355576j915283J129532n05295k023087o89392n28183
2076.3G15492706j016464L6469J948776k77481o79398J098786l70636n31846j81045
2085G15519867j682968j707688J255417J834488L37372N36423j27869j198654j536179
2093.7G13230209m42886J978226J609573n54810m73785j86386K93045J025848J150361
2102.4G17629395M23660p39136K93045n18875k67868L49426r78927R46121Q72040J342468
2112G19351349P91397r99374r07822k363510P49206J176758j053924P19528N84335
$$ plain form
2120.7 718047943 717141647 716370392 716946869 716559830 716409454 716680527 716491623 717244797 717318954 717619019
2130.3 717619019 716660309 715150757 715485458 715996399 716463394 716709824 716165161 715381622 717320938
2139 717320938 718753815 717450027 717782822 718397598 718017502 718382492 718959198 718282166 718168030 718201523
2148.6 718201523 717637405 718634872 718571320 717539520 717761917 718383179 718793945 719092407 719980392 720580063
2158.3 720580063 719643402 718845367 719814911 720773697 721360931 720230026 718023987 718322678 718891754
2167 718891754 718657150 718041992 717459335 716779785 715909653 718104172 720972900 720514679 719680405 720137100
2176.6 720137100 718829880 717357635 718139343 718914719 718378067 717757797 718356781 717622223 716845398
2185.3 716845398 717810135 718456039 718615341 717411118 716680222 717097321 718528290 719492264 718291855
$$ packed form
2120.7G18047943r06296p71255N76477l87039j50376K71073j88904P53174P4157L00065
2130.3G17619019r58710j509552L34701N10941M66995K46430n44663p83539J939316
2139G17320938J432877j303788L32795O14776l80096L64990N76706o77032j14136L3493
2148.6G18201523n64118R97467o3552j031800K22397O21262M10766K98462Q87985N99671
2158.3G20580063r36661p98035R69544R58786N87234j130905k206039K98691N69076
2167G18891754k34604o15158n82657o79550q70132K194519K868728m58221q34274M56695
2176.6G20137100j307220j472245P81708P75376n36652o20270N98984p34558p76825
2185.3G16845398R64737O45904J59302j204223p30896M17099J430969R63974j200409
$$ plain form
2194 718291855 718859787 719687195 719632492 720368195 719909439 719169922 719959259 721346664 722317276 722617722
2203.6 722617722 722709961 722745209 721470108 720829163 721714630 722264023 722240067 722143784 723217621 723232040
2213.3 723232040 721963806 720974274 720671539 722242661 723976517 724757614 723998260 723423462 723200760
2221.9 723200760 722012024 721900482 722540665 722890244 722527618 722666168 721880112 720668335 722519760
2230.6 722519760 723300018 722385330 722908325 723025513 722060928 723055420 724780807 724399261 723333435
2239.3 723333435 722085648 721729507 721330414 720625687 720978165 721916885 723079605 722779312 722530518
2248 722530518 723261642 723585052 722481384 721277847 722447052 723110199 722881393 723081360 722747116
2256.7 722747116 721828918 721248779 721168671 721344147 723365402 724234161 722362442 721808548 723073196
$$ packed form
2194G18291855N67932Q27408n4703P35703m58756p39517P89337J387405R70612L00446
2203.6G22617722R2239L5248j275101o40945Q85467N49393k3956r6283J073837J4419
2213.3G23232040j268234r89532l02735J571122J733856P81097p59354n74798k22702
2221.9G23200760j188736j11542O40183L49579l62626J38550p86056j211777J851425
2230.6G22519760P80258r14688N22995J17188r64585R94492J725387l81546j065826
2239.3G23333435j247787l56141l99093p04727L52478R38720J162720l00293k48794
2248G22530518P31124L23410j103668j203537J169205O63147k28806J99967l34244
2256.7G22747116r18198n80139q0108J75476K021255Q68759j871719n53894J264648
$$ plain form
2265.3 723073196 724335098 723916168 721631088 721228409 723524933 723760834 723400726 724479828 723332062
2274 723332062 721519089 721725693 722240219 722723770 723478546 723268661 723062973 722825928 722520447 722513580
2283.7 722513580 721945419 722751465 723693390 724730606 726392365 725787048 724101181 723228531 722924957
2292.3 722924957 721138382 720044250 721247101 722440491 723173904 723045807 724193192 725603180 723902588
2301 723902588 720675278 721088333 724948730 726268692 725590744 724862976 724320374 723735275 722442627
2309.7 722442627 720825729 721969681 725421524 724619904 723459549 723638535 724391556 725370636 723209839
2318.4 723209839 723576508 724067383 722976913 723326950 722742538 721860657 721989899 724211807 725124054
2327.1 725124054 726815033 729690323 729842148 727850571 724720078 723577728 724147568 724954300 721986008
$$ packed form
2265.3G23073196J261902m18930k285080m02679K296524K35901l60108J079102j147766
2274G23332062j812973K06604N14526M83551P54776k09885k05688k37045l05481o867
2283.7G22513580n68161Q06046R41925J037216J661759o05317j685867q72650l03574
2292.3G22924957j786575j094132J202851J193390P33413j28097J147385J409988j700592
2301G23902588l227310M13055L860397J319962o77948p27768n42602n85099j292648
2309.7G22442627j616898J143952L451843q01620j160355J78986P53021R79080k160797
2318.4G23209839L66669M90875j090470L50037n84412q81881J29242K221908R12247
2327.1G25124054J690979K875290J51825j991577l130493j142350N69840Q06732k968292
$$ plain form
2335.7 721986008 720141678 723852539 726212311 726432495 724888840 723952484 722204742 723795776 726515656
2344.4 726515656 724254379 727296982 730408630 729270782 729211960 728551407 725594635 724908371 729144897
2353.1 729144897 729214172 725210114 728315125 733754120 733656387 730936432 725880661 719283829 721683502
2361.8 721683502 730962448 735881958 739182816 738428574 732489166 730308685 729524689 729797974 730646515
2370.4 730646515 729161072 728046265 727383499 727993011 728625259 728342667 727351761 727744598 728945923
2379.1 728945923 726031647 724613495 726411133 727079315 727228699 727007523 727155304 726994400 726371765
2387.8 726371765 725998230 725858231 726019058 726167603 726043777 726067200 727068100 726996536 727595215 727526169
2397.4 727526169 724356155 723905487 725478897 726170731 725790176 725088730 725596085 726626282 726602936
$$ packed form
2335.7G21986008j844330L710861K359772K20184j543655r36356j747742J591034K719880
2344.4G26515656k261277L042603L111648j137848n8822o60553k956772o86264M236526
2353.1G29144897O9275m004058L105011N438995r7733k719955n055771o596832K399673
2361.8G21683502R278946M919510L300858p54242n939408k180481p83996K73285Q48541
2370.4G30646515j485443j114807o62766O09512O32248k82592r90906L92837J201325
2379.1G28945923k914276j418152J797638O68182J49384k21176J47781j60904o22635
2387.8G26371765l73535j39999J60827J48545j23826K3423J000900p1564N98679o9046
2397.4G27526169l170014m50668J573410O91834l80555p01446N07355J030197k3346
$$ plain form
2406.1 726602936 725713654 726789856 726263275 724284134 725128098 727135620 728314056 726572571 724668884
2414.8 724668884 723560867 723707428 725501709 724692307 724516678 725585556 724791565 723371964 722053070
2423.5 722053070 722985611 725180664 725267181 724849472 724791336 723399124 723096237 724113312 723061676
2432.2 723061676 722290649 722904587 721474152 720840912 722642670 722799988 723003998 723879547 723922043
2440.8 723922043 724046555 723043900 721646194 721504745 722006073 721440811 721631699 723441849 723045654
2449.5 723045654 722101364 722702560 722888260 721599426 719424667 718010635 718253632 719783859 720299072
2458.2 720299072 718902054 718901215 721425781 722546463 721574020 720471420 720043335 720168152 719559402
2466.9 719559402 719194412 717840042 716379623 717869263 718940125 718117294 717843781 718211365 717791824
$$ packed form
2406.1G26602936q89282J076202n26581j979141Q43964K007522J178436j741485j903687
2414.8G24668884j108017J46561J794281q09402j75629J068878p93991j419601j318894
2423.5G22053070R32541K195053Q6517m17709n8136j392212l02887J017075j051636
2432.2G23061676p71027O13938j430435o33240J801758J57318K04010Q75549M2496
2440.8G23922043J24512j002655j397706j41449N01328n65262J90888J810150l96195
2449.5G23045654r44290O01196J85700j288834k174759j414032K42997J530227N15213
2458.2G20299072j397018q39K524566J120682r72443j102600m28085J24817o08750
2466.9G19559402l64990j354370j460419J489640J070862q22831k73513L67584m19541
$$ plain form
2475.6 717791824 718290710 718991776 718467941 718280792 717269135 716928101 717040176 717053146 717185364 715777206
2485.2 715777206 715758438 716537781 716353912 715783005 715966339 716476059 715000992 714314346 714833755 715722580
2494.8 715722580 715937347 714621811 714200134 714308853 715852890 716923065 715703430 714917984 713816147
2503.5 713816147 713052597 713096771 712546768 711869507 712208481 713297958 713404617 714054871 713824615 711506653
2513.2 711506653 711123352 710395432 710555954 713873062 713829727 712422943 712733536 711575394 710552444
2521.9 710552444 710586395 710554657 711413422 712228394 711449051 711529541 712168808 710793304 709993668 710958481
2531.5 710958481 711885834 713094788 714156723 712880020 709962006 708169937 708580475 709529877 709467316
2540.2 709467316 709407349 709621582 710104065 710312958 710315018 710851212 710034561 708418579 708301010 708893967
$$ packed form
2475.6G17791824M98886P01066n23835j87149j011657l41034J12075J2970J32218j408158
2485.2G15777206j8768P79343j83869n70907J83334N09720j475067o86646N19409Q88825
2494.8G15722580K14767j315536m21677J08719J544037J070175j219635p85446j101837
2503.5G13816147p63550M4174n50003o77261L38974J089477J06659O50254k30256k317962
2513.2G11506653l83301p27920J60522L317108m3335j406784L10593j158142j022950
2521.9G10552444L3951l1738Q58765Q14972p79343Q0490O39267j375504p99636R64813
2531.5G10958481R27353J208954J061935j276703k918014j792069M10538R49402o2561
2540.2G09467316n9967K14233M82483K08893K060N36194q16651j615982j17569N92957
$$ plain form
2549.8 708893967 707969742 707032776 706756516 705242844 706013336 708261871 707745743 707046432 707458649
2558.5 707458649 706862640 705631256 705635910 706897659 708141708 708063736 708242035 708940353 708002090 707448730
2568.1 707448730 707854462 707639771 706747513 705385132 704260101 703977585 704135361 703888016 704150391
2576.8 704150391 704823227 705140076 705760040 705473785 704058075 703162842 702193451 702740479 705157242
2585.5 705157242 705183716 704163132 702974014 701738663 702619934 702462463 701535492 702019806 702388306
2594.2 702388306 702008286 702845993 704085541 703010406 702074280 701590958 701222382 700504303 698997421
2602.9 698997421 698466263 698088226 699066238 700492020 701012497 700459900 698261337 696917572 696891403
2611.5 696891403 697930450 698084869 697086868 696854477 697154922 697639236 697585602 697109528 696016006
$$ packed form
2549.8G08893967r24225r36966k76260j513672P70492K248535n16128o99311M12217
2558.5G07458649n96009j231384M654J261749J244049p7972J78299O98318r38263n53360
2568.1G07448730M05732k14691q92258j362381j125031k82516J57776k47345K62375
2576.8G04150391O72836L16849O19964k86255j415710q95233r69391N47028K416763
2585.5G05157242K6474j020584j189118j235351Q81271j57471r26971M84314L68500
2594.2G02388306l80020Q37707J239548j075135r36126m83322l68576p18079j506882
2602.9F98997421n31158l78037R78012J425782N20477n52597k198563j343765k6169
2611.5F96891403J039047J54419r98001k32391L00445M84314n3634m76074j093522
$$ plain form
2620.2 696016006 696729355 698127136 696333923 694263382 694757843 696224594 695525055 694669342 694340134
2628.9 694340134 693693237 693998718 693952942 695021515 694875717 692724152 692424850 692367477 693139114 694540710
2638.5 694540710 693780289 692726974 692170029 690318451 689589157 690919952 691415100 690557022 689138031
2647.2 689138031 689308777 690563507 689970627 688121643 687069168 686755981 687440109 689229813 688509750
2655.9 688509750 686840363 687118301 687266693 688055420 688923187 687858734 686735611 686672363 685823059
2664.6 685823059 684490967 683824081 683853836 684285202 683975601 684012833 683502808 682471313 683029099 682687607
2674.2 682687607 681809692 682685471 683676605 683514175 683747559 684443970 683793030 682027664 679370041
2682.9 679370041 677184677 677684708 679166946 679348831 679436340 679738312 679620132 679668427 679612732 679767227
$$ packed form
2620.2F96016006P13349J397781j793213k070541M94461J466751o99539q55713l29208
2628.9F94340134o46897L05481m5776J068573j45798k151565k99302n7373P71637J401596
2638.5F94540710p60421j053315n56945j851578p29294J330795M95148q58078j418991
2647.2F89138031J70746J254730n92880j848984j052475l13187O84128J789704p20063
2655.9F88509750j669387K77938J48392P88727Q67767j064453j123123o3248q49304
2664.6F85823059j332092o66886K9755M31366l09601L7232n10025j031495N57786l41492
2674.2F82687607q77915Q75779R91134j62430K33384O96411o50940j765366k657623
2682.9F79370041k185364N00031J482238J81885Q7509L01972j18180M8295n5695J54495
$$ plain form
2692.5 679767227 679754181 679506912 679530563 679559860 679996490 678977814 676922760 676948166 677956924 677948456
2702.2 677948456 677667847 677555771 676847229 676149902 675549850 674918137 674952087 674385681 673148117 673621445
2711.8 673621445 675419617 675908508 674554977 673602829 673802261 673011246 671813889 671154022 671345062
2720.5 671345062 672478027 671881409 671209335 671511154 670583572 669854507 669936066 670093613 670703049 671130447
2730.2 671130447 669624329 668358307 668239517 667526016 668082733 668221130 666841049 665989456 665742035
2738.8 665742035 666150513 665921021 665092468 664176178 663567047 664457169 665202255 665249023 665515976 664740753
2748.5 664740753 663909912 664281082 664439163 665175400 665261612 663835144 663979416 664397202 663465576 662921295
2758.1 662921295 662938080 662240829 660429916 659290543 660794296 662144775 661172867 661060562 661683655
$$ packed form
2692.5F79767227j3046k47269K3651K9297M36630j018676k055054K5406J008758q468
2702.2F77948456k80609j12076p08542o97327o00052o31713L3950n66406j237564M73328
2711.8F73621445J798172M88891j353531r52148J99432p91015j197357o59867J91040
2720.5F71345062J132965n96618o72074L01819r27582p29065Q1559J57547O09436M27398
2730.2F71130447j506118j266022j18790p13501N56717J38397j380081q51593k47421
2738.8F65742035M08478k29492q28553r16290o09131Q90122P45086M6768K66953p75223
2748.5F64740753q30841L71170J58081P36237Q6212j426468J44272M17786r31626n44281
2758.1F62921295J6785o97251j810913j139373J503753J350479r71908j12305O23093
$$ plain form
2766.8 661683655 660999603 658598709 656780090 657495499 657233047 656579895 656847916 656617203 657503967
2775.5 657503967 658375244 657193680 655850525 656525421 657875214 657099457 654618225 652882309 652274780
2784.2 652274780 653298492 654729385 653021164 651736298 653567963 654734573 653862152 652727356
2791.9 652727356 651996384 649956741 648261337 647640762 646988907 647044373 646509781 646408768 646622925
2800.5 646622925 645950089 645539932 645000381 645320587 644976349 643772278 644459839 643439713 641490479
2809.2 641490479 641996689 642393951 641888657 640118103 639961929 641890335 640074387 637798462 638302383
2817.9 638302383 637168388 635355949 636643867 637538948 635882111 635199165 634916039 633865318 631725960
2826.6 631725960 630515900 631637344 631486664 630571785 629022331 626493645 625043564 625442276 625448837
$$ packed form
2766.8F61683655o84052k400894j818619P15409k62452o53152K68021k30713Q86764
2775.5F57503967Q71277j181564j343155O74896J349793p75757k481232j735916o07529
2784.2F52274780J023712J430893j708221j284866J831665J166610q72421j134796
2791.9F52727356p30972k039643j695404o20575o51855N5466n34592j01013K14157
2800.5F46622925o72836m10157n39551L20206l44238j204071O87561j020126j949234
2809.2F41490479N06210L97262n05294j770554j56174J928406j815948k275925N03921
2817.9F38302383j133995j812439J287918Q95081j656837o82946k83126j050721k139358
2826.6F31725960j210060J121444j50680r14879j549454k528686j450081L98712O561
$$ plain form
2835.3 625448837 622939644 622389679 623082390 621838036 620818214 619847565 617330856 614471512 614629707
2843.9 614629707 613389320 608197823 604955750 603785744 603044395 602330093 599570847 596049995 595778580
2852.6 595778580 596347237 594718704 594307823 595879631 597175941 596738853 596506615 597286987 597120438
2861.3 597120438 595919800 593911400 592523994 591754723 591662331 591501350 589846535 588626366 588072472
2870 588072472 587856407 586430397 584838409 585621147 584895439 582740822 582883644 583335533 581114349
2878.7 581114349 579337311 580437469 581211777 581007805 580226059 579075699 578394623 577450333 577149239
2887.3 577149239 576403618 573837776 571666641 570550804 570655022 570457497 569707336 570623741 570241051
2896 570241051 568883476 568497734 566457100 564291382 563102188 562322578 562530899 562522240 561809273 560828667
$$ packed form
2835.3F25448837k509193n49965O92711j244354j019822r70649k516709k859344J58195
2843.9F14629707j240387n191497l242073j170006p41349p14302k759246l520852k71415
2852.6E95778580N68657j628533m10881J571808J296310m37088k32238P80372j66549
2861.3E97120438j200638k008400j387406p69271r2392j60981j654815j220169n53894
2870E88072472k16065j426010j591988P82738p25708k154617J42822M51889k221184
2878.7E81114349j777038J100158P74308k03972p81746j150360o81076r44290l01094
2887.3E77149239p45621k565842k171135j115837J04218j97525p50161R16405l82690
2896E70241051j357575l85742k040634k165718j189194p79610K08321q659p12967r80606
$$ plain form
2905.7 560828667 560247383 560076790 559447670 558295593 558236351 559330368 558635750 556598778 556138191
2914.3 556138191 556728516 554765549 550958672 549653969 549573135 548788681 547981110 547399483 547064743
2923 547064743 546264153 545525360 545383263 546280632 546865120 545706062 545149956 544655380 544700699 547260284
2932.7 547260284 548502464 546793213 545935593 548050652 550620956 551033134 549993820 549486656 550530128
2941.3 550530128 552789345 554860573 554527702 553259354 553152275 553623161 553630180 551892586 551196136
2950 551196136 552349777 553041534 552968941 551901016 551917953 552580528 551273193 549230156 549522972 551548157
2959.7 551548157 552931404 554065323 553213997 552994843 555367012 555178528 553891945 553324966 553456345
2968.3 553456345 556096191 557633247 557103767 558183136 559603920 559928665 561480064 563582764 564328194
$$ packed form
2905.7E60828667n81284j70593o29120j152077n9242J094017o94618k036972m60587
2914.3E56138191N90325j962967l806877j304703q0834p84454q07571n81627l34740
2923E47064743q00590p38793j42097Q97369N84488j159058n56106m94576M5319K559585
2932.7E47260284J242180j709251q57620K115059K570304M12178j039314n07164J043472
2941.3E50530128K259217K071228l32871j268348j07079M70886P019j737594o96450
2950E51196136J153641O91757p2593j067925J6937O62575j307335k043037K92816K025185
2959.7E51548157J383247J133919q51326k19154K372169j88484j286583n66979J31379
2968.3E53456345K639846J537056n29480J079369J420784L24745J551399K102700P45430
$$ plain form
2977 564328194 564840279 565439148 566299057 568291092 570611343 572856712 573027191 572021637 573149261
2985.7 573149261 572813873 573348618 577675972 579238968 578269310 579197159 581634712 581839638 581150856
2994.4 581150856 582380486 582166405 580947266 580144997 579775047 580567360 581972961 583674316 583703079
3003.1 583703079 582136803 582206078 583443909 582950516 582622795 583395462 583409309 583535347 583232460 583295288
3012.7 583295288 583487892 581579437 579483948 579333839 581023026 581932983 580745010 579175758 579047470
3021.4 579047470 579641647 578761635 578210106 578586044 577228622 575149040 575268478 576220932 575772171
3030.1 575772171 574864197 574200211 574277267 574972038 575389290 574068680 571547127 570884476 571321831
3038.7 571321831 571326218 570878792 570161057 570039444 570257683 570402451 569930649 568185959 565787392 565397415
$$ packed form
2977E64328194N12085N98869Q59909J992035K320251K245369J70479j005554J127624
2985.7E73149261l35388N34745M327354J562996r69658R27849K437553K04926o88782
2994.4E81150856J229630k14081j219139q02269l69950P92313J405601J701355K8763
3003.1E83703079j566276O9275J237831m93393l27721P72667J3847J26038l02887O2828
3012.7E83295288J92604j908455k095489j50109J689187R09957j187973j569252j28288
3021.4E79047470N94177q80012n51529L75938j357422k079582J19438R52454m48761
3030.1E75772171r07974o63986P7056O94771M17252j320610k521553o62651M37355
3038.7E71321831M387m47426p17735j21613K18239J44768m71802j744690k398567l89977
$$ plain form
3048.4 565397415 566579857 566310081 565606728 565732040 566639862 565171204 561267548 560900612 562601128
3057.1 562601128 562296410 561046371 560400772 559614220 559122620 559943352 558052139 556442299 557336998
3065.7 557336998 555022087 553778381 555487518 555674820 555010147 553943558 552400169 551676254 552284050
3074.4 552284050 553292580 553870468 552694969 550869102 550102234 549184113 548160172 546712265 545938568
3083.1 545938568 546634445 547672272 547709618 545597496 543826256 543976974 545907784 546026535 544049110
3091.8 544049110 543848801 542762451 542015533 542232666 541065941 539808846 539289627 540219345 539463844
3100.5 539463844 538376503 538743782 536797104 534983101 534955673 533962708 532183838 532818794 534558754
3109.1 534558754 534248466 533164101 531930542 531778259 532468567 531004181 528495789 527704506 527941551
$$ packed form
3048.4E65397415J182442k69776p03353J25312R07822j468658l903656l66936J700516
3057.1E62601128l04718j250039o45599p86552m91600Q20732j891213j609840Q94699
3065.7E57336998k314911j243706J709137J87302o64673j066589j543389p23915O07796
3074.4E52284050J008530N77888j175499j825867p66868r18121j023941j447907p73697
3083.1E45938568O95877J037827L7346k112122j771240J50718J930810J18751j977425
3091.8E44049110k00309j086350p46918K17133j166725j257095n19219R29718p55501
3100.5E39463844j087341L67279j946678j814003k7428r92965j778870O34956J739960
3109.1E34558754l10288j084365j233559j52283O90308j464386k508392p91283K37045
$$ plain form
3117.8 527941551 527531242 525849113 524560738 525228195 525074158 524093475 524795647 524518166 522052002
3126.5 522052002 520585670 520475578 519485016 518384628 517827072 516516075 515729904 516671104 515868568
3135.2 515868568 513947868 514457970 513628731 512107124 511692886 509369888 508546104 509233475 507956619
3143.9 507956619 506425362 506667328 506943932 505076141 504492226 505108986 504357147 504805908 505125160
3152.5 505125160 503634567 502205391 499982986 497594833 496583176 496409492 495780640 493765182 492387619
3161.2 492387619 491644325 491193848 490842018 489412117 489411354 489936523 489823837 489236183 487791786 487269058
3170.9 487269058 486286430 484454155 482212830 481403770 482679291 482156639 480649757 479064064 478441010
3179.5 478441010 479299088 478586159 478074188 478660278 476613731 473301773 472118301 471640129 472290802
$$ packed form
3117.8E27941551m10309j682129j288375O67457j54037r80683P02172k77481k466164
3126.5E22052002j466332j10092r90562j100388n57556j310997p86171R41200q02536
3135.2E15868568j920700N10102q29239j521607m14238k322998q23784O87371j276856
3143.9E07956619j531257K41966K76604j867791n83915O16760p51839M48761L19252
3152.5E05125160j490593j429176k222405k388153j011657j73684o28852k015458j377563
3161.2D92387619p43294m50477l51830j429901p63N25169j12686n87654j444397n22728
3170.9D87269058r82628j832275k241325q09060J275521n22652j506882j585693o23054
3179.5D78441010Q58078p12929n11971N86090k046547l311958j183472m78172O50673
$$ plain form
3188.2 472290802 472791252 469945984 468258743 468790779 467769127 466924553 466305542 464650269 464501076
3196.9 464501076 464264565 462646027 462401848 462581749 462315445 461756516 460460091 458631058 457556686
3205.6 457556686 457016678 454879303 453107758 452746468 452859535 452127571 450076675 449705658 450600700
3214.3 450600700 450907402 449780731 447753181 446614113 445773125 445123558 444132233 443978958 445926247
3222.9 445926247 446244278 443991966 441914215 440186729 439624825 440702248 440720673 439567680 437698975
3231.6 437698975 435576096 435163841 436244164 437078781 435569954 433939934 433926201 432283096 430248146
3240.3 430248146 429179344 427299004 426609077 427051964 426379890 426203156 426825142 426800194 425201263
3249 425201263 423669357 424343872 424614525 423040390 421446381 421487885 421130066 419079018 418406868
$$ packed form
3188.2D72290802N00450k845268j687241N32036j021652q44574o19011j655273j49193
3196.9D64501076k36511j618538k44179J79901k66304n58929j296425j829033j074372
3205.6D57556686n40008k137375j771545l61290J13067p31964k050896l71017Q95042
3214.3D50600700L06702j126671k027550j139068q40988o49567r91325j53275J947289
3222.9D45926247L18031k252312k077751j727486n61904J077423J8425j152993j868705
3231.6D37698975k122879m12255J080323Q34617j508827j630020j3733j643105k034950
3240.3D30248146j068802j880340o89927M42887o72074j76734O21986k4948j598931
3249D25201263j531906O74515K70653j574135j594009M1504l57819k051048o72150
$$ plain form
3257.7 418406868 418846512 418657227 417155380 416473808 417316475 415920029 414463005 415295792 416604729
3266.3 416604729 416099701 413044243 411717606 412312012 411493263 410833168 411165886 410850639 409039307
3275 409039307 407063065 406544418 405869560 405935097 407297554 406924210 405453415 404474792 405151711 405121880
3284.7 405121880 403558121 403453712 402107239 400270233 399960823 399168205 399589996 401097527 400725021
3293.3 400725021 400193672 399632950 397105980 397261505 398554993 396570892 394659309 393912888 394982719
3302 394982719 395883751 394435005 393181267 392366753 391601791 392514381 393338127 392223625 392473946
3310.7 392473946 391405640 389041252 389168434 388015671 386113281 385862312 386038437 383739929 381444893
3319.4 381444893 382092705 380682526 378794708 379641838 380880356 380028839 378802376 379548569 379240379
$$ packed form
3257.7D18406868M39644j89285j501847o81572Q42667j396446j457024Q32787J308937
3266.3D16604729n05028l055458j326637N94406q18749o60095L32718l15247j811332
3275D09039307j976242n18647o74858O5537J362457l73344j470795r78623O76919k9831
3284.7D05121880j563759j04409j346473j837006l09410p92618M21791J507531l72506
3293.3D00725021n31349n60722k526970J55525J293488j984101j911583p46421J069831
3302C94982719R01032j448746j253738q14514p64962R12590Q23746j114502K50321
3310.7C92473946j068306k364388J27182j152763j902390k50969J76125k298508k295036
3319.4C81444893O47812j410179j887818Q47130J238518q51517j226463P46193l08190
$$ plain form
3328.1 379240379 377448807 375773010 375415649 375284119 374991684 374440956 371438828 370038681 371199951
3336.7 371199951 371558495 369711189 367129669 367956543 369426346 367960091 366947517 366063232 362627068
3345.4 362627068 361550217 362120247 360698509 359583397 358085442 357869415 358422585 358545418 357501373
3354.1 357501373 354141083 353419609 353533401 352122192 350840187 350556297 351180916 350848541 350136833
3362.8 350136833 347338142 345574074 347212219 348113441 346995850 344935150 344924469 344085579 342504501
3371.4 342504501 342224236 339851990 338066063 337997169 337604294 337267303 337701454 337709961 335892143 334000092
3381.1 334000092 333593216 333839188 332107391 330744400 330948753 330995712 332248611 331931190 330249176
3389.8 330249176 329413223 328717117 328538017 328029213 327286568 326397476 326062698 325905113 325540657 326553001
$$ packed form
3328.1C79240379j791572j675797l57361j31530k92435n50728l002128j400147J161270
3336.7C71199951L58544j847306k581520Q26874J469803j466255j012574q84285l436164
3345.4C62627068j076851N70030j421738j115112j497955k16027N53170J22833j044045
3354.1C57501373l360290p21474J13792j411209j282005k83890O24619l32375p11708
3362.8C50136833k798691j764068J638145R01222j117591k060700j0681q38890j581078
3371.4C42504501k80265k372246j785927o8894l92875l36991M34151Q507j817818j892051
3381.1C34000092m06876K45972j731797j362991K04353M6959J252899l17421j682014
3389.8C30249176q35953o96106j79100n08804p42645q89092l34778j57585l64456J012344
$$ plain form
3399.4 326553001 327107391 325594444 323252640 323148766 323683319 322157631 322242546 323827438 324135284
3408.1 324135284 322742691 321533127 321709900 320979538 319453468 319300385 320495148 320550156 319705296
3416.8 319705296 319277039 319648457 320692825 319831429 319559288 320687866 320422363 319795036 319654598
3425.5 319654598 319776897 318363037 317269669 317714939 317898827 318360500 318452892 319248734 320166664
3434.1 320166664 320665169 321629257 320966682 320352516 320325012 318872509 318005352 318488846 319655685
3442.8 319655685 321803474 322785110 322088165 321973152 323342628 324898643 325058632 325242538 324403458
3451.5 324403458 322866135 324026031 325998840 327784195 326922455 324465179 325927925 328467979
3459.2 328467979 329254494 329411316 328971786 327248764 327240677 329737167 329959984 329060669 330542717
$$ packed form
3399.4C26553001N54390j512947k341804j03874N34553j525688Q4915J584892L07846
3408.1C24135284j392593j209564J76773p30362j526070j53083J194763N5008q44860
3416.8C19705296m28257L71418J044368q61396k72141J128578k65503o27327j40438
3425.5C19654598J22299j413860j093368M45270J83888M61673R2392P95842R17930
3434.1C20166664M98505R64088o62575o14166k7504j452503q67157M83494J166839
3442.8C19655685K147789R81636o96945j15013J369476J556015J59989J83906q39080
3451.5C24403458j537323J159896J972809J785355q61740k457276J462746K540054
3459.2C28467979P86515J56822m39530j723022q087K496490K22817q99315J482048
$$ plain form
3467.9 330542717 332035217 331297760 331591721 333922729 335977516 337568550 337140961 335946121 335099716
3476.6 335099716 334381714 336505699 339580154 340260048 339621544 340267487 341674232 341681519 341209297
3485.2 341209297 341100845 342177963 345567780 347873611 347485695 346788406 346845207 347183304 347044830
3493.9 347044830 348245163 349130211 349423981 351016273 351170731 351983376 352366028 352566910 355319481
3502.6 355319481 355660934 355142365 356022491 357091293 357235870 357831955 360260620 361012764 361530571
3511.3 361530571 362731819 364729462 365260086 363205643 362381172 363537979 366951103 369025040 370167923
3520 370167923 372166252 373069000 373765297 373184929 373656616 375290337 375794258 375662193 376521149 378225441
3529.6 378225441 378686600 381094742 383378372 382327843 382834854 385228767 384669037 384091949 386833916
$$ packed form
3467.9C30542717J492500p37457K93961K331008K054787J591034m27589j194840q46405
3476.6C35099716p18002K123985L074455O79894o38504O45943J406745P287m72222
3485.2C41209297j08452J077118L389817K305831l87916o97289N6801L38097j38474
3493.9C47044830J200333Q85048K93770J592292J54458Q12645L82652K00882K752571
3502.6C55319481L41453n18569Q80126J068802J44577N96085K428665P52144N17807
3511.3C61530571J201248J997643N30624k054443q24471J156807L413124K073937J142883
3520C70167923J998329R02748O96297n80368M71687J633721N03921j32065Q58956J704292
3529.6C78225441M61159K408142K283630j050529N07011K393913n59730n77088K741967
$$ plain form
3538.3 386833916 388639832 389430275 389078941 389003677 391924019 394388809 395187569 396537399 398073425
3547 398073425 397339783 398243866 401006317 402600937 402696915 401091766 403580551 406797447 407917633
3555.6 407917633 408884277 409267349 410521469 411140594 411246452 411498795 415069580 417587624 415718231
3564.3 415718231 418608360 420889816 421904488 424934883 426149864 427485275 426668358 427672195
3572 427672195 428716354 430330467 434311981 435467911 436440163 437577019 438958321 441174698 442698898
3580.7 442698898 443869171 446670532 448774567 448398590 452081642 454715919 452986298 453639183 453350754
3589.4 453350754 456895409 460711288 462475510 462866859 465182877 469537735 468897552 471091080 474640579
3598.1 474640579 474907761 477242508 478188591 478299255 479451828 481028175 484607697 488974876 491777687
$$ packed form
3538.3C86833916J805916P90443l51334p5264K920342K464790P98760J349830J536026
3547C98073425p33642R04083K762451J594620R5978j605149K488785L216896J120186
3555.6D07917633R66644L83072J254120O19125J05858K52343L570785K518044j869393
3564.3D15718231K890129K281456J014672L030395J214981J335411q16917J003837
3572D27672195J044159J614113L981514J155930R72252J136856J381302K216377J524200
3580.7D42698898J170273K801361K104035l75977L683052K634277j729621O52885k88429
3589.4D53350754L544655L815879J764222L91349K316018M354858o40183K193528L549499
3598.1D74640579K67182K334747R46083J10664J152573J576347L579522M367179K802811
$$ plain form
3606.8 491777687 493301926 498624306 499426270 496538467 500613708 503429947 504012871 505794067 502894135
3615.4 502894135 504804802 510183868 512741470 514992867 515220985 516038780 519470291 523853264 527012062
3624.1 527012062 529076996 532487373 533551674 536736031 542133369 535001259 536944962 540871162
3631.8 540871162 545254707 547721825 547484818 551657028 554876976 556712341 557945557 558882027 561106110
3640.5 561106110 564105911 566917152 567258224 568039398 570620003 574900131 574185028 573213806 581678696
3649.2 581678696 583560829 581358910 581400032 586038361 590784492 595362282 603777657 597844162 595387611
3657.9 595387611 600429039 601031342 601885338 604423790 607818184 608672104 608687820 609862099 611749496
3666.5 611749496 617384071 620642128 620268631 619574127 613452148 615888748 623256493 632165642 633985405
$$ packed form
3606.8D91777687J524239N322380Q01964k887803M075241K816239N82924J781196k899932
3615.4E02894135J910667N379066K557602K251397K28118Q17795L431511M382973L158798
3624.1E27012062K064934L410377J064301L184357N397338p132110J943703L926200
3631.8E40871162M383545K467118k37007M172210L219948J835365J233216R36470K224083
3640.5E61106110K999801K811241L41072P81174K580605M280128p15103r71222Q464890
3649.2E81678696J882133k201919M1122M638329M746131M577790Q415375n933495k456551
3657.9E95387611N041428O02303Q53996K538452L394394Q53920J5716J174279J887397
3666.5F11749496N634575L258057l73497o94504o121979K436600P367745Q909149J819763
$$ plain form
3675.2 633985405 616287460 617219582 623224831 627578316 628488426 630387115 635294609 638057365
3682.9 638057365 638983765 639828911 639723320 643142853 648472137 639907913 635373497 642345657 638546181
3691.6 638546181 637911072 644601364 644029312 642196045 643736801 645194016 645715714 644768143 649031372
3700.3 649031372 655699997 649251785 643847275 648665314 651719208 651603470 649657822 650858154
3708 650858154 656014786 653493347 660091171 666722565 651568680 652244568 655741882 657713318 659187698
3716.7 659187698 659806519 661939163 660634384 659549561 662937164 662325058 659361496 662254944 662035370
3725.4 662035370 661437683 660621109 659860611 663200836 665771027 671882477 670059662 661372757 668770065
3734 668770065 670858002 662294998 659917908 662845306 664802780 665544357 668200684 667198639 669988937
$$ packed form
3675.2F33985405j7697945R32122O005249M353485R10110J898689M907494K762756
3682.9F38057365R26400Q45146j05591L419533N329284q564224m534416O972160l799476
3691.6F38546181o35109O690292n72052j833267J540756J457215N21698r47571M263229
3700.3F49031372O668625o448212n404510M818039L053894j15738j945648J200332
3708F50858154N156632k521439O597824O631394j5153885O75888L497314J971436J474380
3716.7F59187698O18821K132644j304779j084823L387603o12106k963562K893448k19574
3725.4F62035370n97687q16574p60498L340225K570191O111450j822815q686905P397308
3734F68770065K087937q563004k377090K927398J957474P41577K656327j002045K790298
$$ plain form
3742.7 669988937 681259232 680948410 659104156 661297226 663458252 666484299 660351334 652031479
3750.4 652031479 665229111 664724579 658178406 663954926 667098465 668928452 665124435 667998505
3758.2 667998505 675755539 671659546 668625946 671760483 672032318 671539536 675296097 672853699 668870163
3766.8 668870163 672323761 676030655 675234833 667325821 669163742 671424179 671763916 673596191 671562347
3775.5 671562347 670716705 672317810 675622787 674958038 668686981 671288147 673033371 674175568 676866837
3784.2 676866837 673067780 670793991 673448410 674712601 675345612 676534348 675774002 673117142 672805557
3792.9 672805557 674346085 676967850 681526337 678220596 670602646 670896530 675630112 683749008
3800.6 683749008 679985352 666855316 668952484 672628098 678376389 682328720 672007523 668863983
$$ packed form
3742.7F69988937J1270295l10822k1844254K193070K161026L026047o132965q319855
3750.4F52031479J3197632n04532o546173N776520L143539J829987l804017K874070
3758.2F67998505P757034m095993l033600L134537K71835m92782L756561k442398l983536
3766.8F68870163L453598L706894p95822p909012J837921K260437L39737J832275k033844
3775.5F71562347q45642J601105L304977o64749o271057K601166J745224J142197K691269
3784.2F76866837l799057k273789K654419J264191O33011J188736p60346k656860l11585
3792.9F72805557J540528K621765M558487l305741p617950K93884M733582Q118896
3800.6F83749008l763656j3130036K097168L675614N748291L952331j0321197l143540
$$ plain form
3808.3 668863983 672128601 673434982 674846191 675927353 676753922 677200012 679926453 677007523 662199478
3817 662199478 666224213 673641434 680432587 683139572 665014114 665284653 671294937 673559494 675025940
3825.7 675025940 677480850 677012177 674742126 674970398 677261200 679767227 674565964 675285263 681388702
3834.3 681388702 675496140 673769073 681565018 676460037 669868317 672427368 669752579 671087418
3842.1 671087418 677351990 677689438 673327255 673033524 674189682 675436935 676474991 674127960 676129150
3850.7 676129150 679738693 668209839 672248764 669876633 666847534 675830612 676362686 674064713
3858.4 674064713 675416031 676625748 677716446 672829285 671616745 674999847 671197586 670050964
3866.2 670050964 675197678 679077072 681641159 672251511 665764694 671856232 679092789 683161163
$$ packed form
3808.3F68863983L264618J306381J411209J081162Q26569M46090K726441k918930j4808045
3817F62199478M024735P417221O791153K706985j8125458K70539O010284K264557J466446
3825.7F75025940K454910m68673k270051K28272K290802K506027n201263P19299O103439
3834.3F81388702n892562j727067P795945n104981o591720K559051k674789J334839
3842.1F71087418O264572L37448m362183k93731J156158J247253J038056k347031K001190
3850.7F76129150L609543j1528854M038925k372131l029099Q983078N32074k297973
3858.4F74064713J351318J209717J090698m887161j212540L383102l802261j146622
3866.2F70050964N146714L879394K564087r389648o486817O091538P236557M068374
$$ plain form
3873.9 683161163 671218414 671529770 677515106 676654205 678496475 682055054 678929062 670562057
3881.6 670562057 671174240 672341309 674328842 682624054 674981384 672896042 674828262 672274323
3889.3 672274323 675789185 676378098 670834503 671373978 672049179 672989426 676050949 676250763 677241058
3898 677241058 678314819 668900528 673290787 677575760 672936401 677557144 675690308 671642151 671363144
3906.7 671363144 674194031 678525162 677864380 676953354 676613388 675767136 674855652 674561996 675851212
3915.3 675851212 676522446 673190384 670826721 675090485 675334396 671423569 671901855 672599335 674624939
3924 674624939 673969955 671931229 673917770 675118332 675373459 673571320 671570892 673363419 673109360
3932.7 673109360 670468521 671125641 673338547 674207382 674054108 674939880 674549026 673073502 675625458
$$ packed form
3873.9F83161163j1942749L11356N985336q60901J842270L558579l125992q367005
3881.6F70562057O12183J167069J987533Q295212p642670k085342J932220k553939
3889.3F72274323L514862N88913n543595N39475O75201R40247L061523J99814R90295
3898F77241058J073761r414291M390259M284973m639359M620743j866836m048157k79007
3906.7F71363144K830887M331131o60782r11026l39966q46252r11484k93656J289216
3915.3F75851212O71234l332062k363663M263764K43911l910827M78286O97480K025604
3924F74624939o54984k038726J986541J200562K55127j802139k000428J792527k54059
3932.7F73109360k640839O57120K212906Q68835j53274Q85772l90854j475524K551956
$$ plain form
3941.4 675625458 677725983 674946976 672183228 670571976 673194885 676141739 673098221 671346817
3949.1 671346817 672038651 671537704 671903000 673508682 673947067 672108765 670219421 669869614 671387863
3957.8 671387863 672894135 672776794 673087616 673787689 673230057 673082504 675114288 676247559 673728409
3966.5 673728409 671284180 671543121 671420212 670557480 672773590 675086746 673921356 672604218 672220306
3975.1 672220306 671776505 671372147 671418152 671946259 673241653 674544907 674897232 673569641 671287842
3983.8 671287842 672310333 673531342 671863327 671050720 671224594 672333679 673484497 673247299 671539841
3992.5 671539841 670525208 672133484 672722397 672224121 673365021 674569321 672645340 670046539
4000.2 670046539
$$ packed form
3941.4F75625458K100525k779007k763748j611252K622909K946854l043518j751404
3949.1F71346817O91834n00947L65296J605682M38385j838302j889344l49807J518249
3957.8F71387863J506272j17341L10822P00073n57632j47553K031784J133271k519150
3966.5F73728409k444229K58941j22909q62732K216110K313156j165390j317138l83912
3975.1F72220306m43801m04358M6005N28107J295394J303254L52325j327591k281799
3983.8F71287842J022491J221009j668015q12607J73874J109085J150818k37198j707458
3992.5F71539841j014633J608276N88913m98276J140900J204300j923981k598801
4000.2F70046539
##END=$$ End of the data block
