##TITLE=$$ Begin of the data block
##JCAMP-DX=5.00 $$ ACD/SpecManager v 10.08
##SPECTROMETER/DATA SYSTEM=Varian
##DATE=07 Jan 2013 10:56:28
##DATA TYPE=INFRARED SPECTRUM
##DATA CLASS=XYDATA
##ORIGIN=
##OWNER=
##NPOINTS=3735
##FIRSTX=399.26403809
##LASTX=4000.35498047
##MAXX=4000.35498047
##MINX=399.26403809
##MAXY=125.53321075
##MINY=9.26784801
##XFACTOR=1.0000000000
##YFACTOR=0.000001000000000
##FIRSTY=74.36856842
##DELTAX=0.96440572
##XUNITS=1/CM
##YUNITS=TRANSMITTANCE
##XYDATA=(X++(Y..Y))
399.3G4368568J2907364k7237281o865902L468284R628758K2313820j6130311k9249221
407D3204079J400444L497204o911561j736167J2098007J6987850K962013j0829094
414.7F0672775j0740776k432483Q126514O4402519N504662o2429394j7417843l132698
422.4D2553276J2473515J0395511j321197n681088p445099Q010262J289436p349262
430.1E2925354o767441m495994J0234783M439960O36555P74693n660416k268086j665004
438.8D8154404Q725498m06582r969879J941513m852966m79344R983921K121296m28425
447.5E4789436L320099n352970k111763N283005m173958J34319J0346073L396290o248970
456.2E9381561n869728n655498o110291q86215N432537M223122l501164l733867P086685
$$ y = [74368568, 87275932, 60038651, 53172749, 56641033, 66269791, 88583611, 72453300, 43204079, 44604523, 48101727, 41190166, 39453999, 51552006, 68539856, 71501869, 60672775, 49931999, 47499516, 55626030, 120028549, 125533211, 63103817, 45685974, 42553276, 55026791, 65422302, 64101105, 58420017, 50974918, 58985180, 60274616, 52925354, 46157913, 41661919, 51896702, 56336662, 56973217, 57747910, 52087494, 49819408, 48154404, 56879902, 56473320, 46503441, 48444954, 43591988, 43112644, 53096565, 55217861, 54789436, 58109535, 52756565, 50644802, 55927807, 51753849, 51888168, 62234241, 65630531, 59381561, 53511833, 47856335, 41746044, 40859829, 46292366, 50515488, 47014324, 43280457, 50367142]
464.8E0367142J4923691n183884j5929520n458435J080368L482983M376781K162274
472.6D9821400J854805L746956N989505O01322m702651n839905k817910m65091L536171
481.2E1724602K104339l838905K795597j396450k199230J209095j095589M975517K281228
489.9E6560204M150943K416237p061668o636280l990658O423675O744038j802872o313358
498.6E0490261j355129O443016j431664k460716L47576p25521J759480M9011r45335
507.3E2170979l92930J254475K328423M160957K67807q629642n692994M12869L284675
516D9164619L09578k398357K04411J827369N182202K788837m037208k836781O74778
524.6E0879448N90057j18744p72380k509705k61395K021454q28079R38782K631931
$$ y = [50367142, 65290833, 60106949, 44177429, 38718994, 39799362, 43282345, 47659126, 49821400, 51676205, 55423161, 61412666, 62013988, 57311337, 51471432, 48653522, 48188431, 51724602, 53828941, 49990036, 52785633, 51389183, 49189953, 50399048, 49303459, 54278976, 56560204, 60711147, 63127384, 56065716, 49429436, 45438778, 51862453, 58606491, 56803619, 50490261, 49135132, 55578148, 54146484, 51685768, 52033344, 51307823, 53067303, 53116314, 52170979, 51778049, 53032524, 55360947, 59521904, 59789711, 51160069, 45467075, 45879944, 49164619, 49474197, 47075840, 47280251, 49107620, 54289822, 57078659, 53041451, 50204670, 50879448, 51469505, 51350761, 50578381, 48068676, 47807281, 49828735, 49000656, 49939438, 52571369]
533.3E2571369j095318j319908l22269p80594k155056n2563L255184j499130l791496
542D4810219j7597L258602K524002j029118k01809n81333M54773K439758p03819j347278
551.6D9606400j16471M79809n82657j292156Q16315K648437Q35663k567169l00579
560.3D9527592J764518J07972j962029j218120O63902P39441K232105j50394j766159
569D9938828l71495j463157k72404M26998K125687J636150o82957K97821j274753k28417
578.6E0132301j033802k499092K386891J603427j297279j259479j125607K91046J223774
587.3D8422180K335041Q57300j956467j263622q66291P41257J953335k49474k146675
596D7826584j855419J12121J094422M93595j337067j759010P9887O33282J682224J102684
$$ y = [52571369, 51476051, 50156143, 49833874, 49053280, 46898224, 46845661, 50100845, 48601715, 44810219, 44792622, 48051224, 50575226, 49546108, 49344299, 48762966, 49217739, 51657497, 50953678, 49606400, 49489929, 49969738, 49387081, 48094925, 48911240, 51559677, 52395340, 49828171, 49527592, 51292110, 51400082, 49438053, 48219933, 48883835, 49623276, 51855381, 51704987, 49938828, 49567333, 48104176, 47831772, 48258770, 50384457, 52020607, 51337650, 51635471, 50360718, 50132301, 49098499, 46599407, 48986298, 50589725, 49292446, 48032967, 46907360, 47198406, 48422180, 50757221, 51614521, 49658054, 48394432, 47528141, 48269398, 50222733, 49973259, 47826584, 45971165, 46083286, 47177708, 47671303, 46334236, 44575226, 44655113, 45288395, 46970619, 48073303]
605.6D8073303r29523j27251n16876j625221k440064j973564j614040k405156o14505
614.3C5827103J132629R16672n73441l51803L12466r29565j491940j861233p11971
623C2268917K7329j80634J25610J050229L393981K999649K501435J107250j309799
631.7D1983967j259567k17194N49561j184327n50754j01845k067413n92354M94678
640.4C7054752R01623K444901L221473J791413J509979J676250l43261L12191J196037
649D9765358O36719R98306P3238n45486q99368l47042K002723O90632j829891M64161
658.7E1009350R58053n24234P95730j49322P6275O25637m61895K911750O584675m52881
668.3F1373138o104637q04020o4064p91370M15012J817089k4112j566262o65996O55979
$$ y = [48073303, 47143780, 47016529, 46499653, 44874432, 42434368, 40460804, 38846764, 36441608, 35827103, 36959732, 37876404, 37302963, 36951160, 37263626, 36334061, 34842121, 32980888, 32268917, 32296246, 32115612, 32241222, 33291451, 36685432, 39685081, 42186516, 43293766, 41983967, 40724400, 40507206, 41056767, 39872440, 39321686, 39219841, 37152428, 36560074, 37054752, 37956375, 40401276, 43622749, 45414162, 46924141, 48600391, 48257130, 48569321, 49765358, 50402077, 51400383, 51473621, 50928135, 50028767, 49681725, 51684448, 52375080, 50545189, 51009350, 51967403, 51443169, 52238899, 52089577, 52165852, 52791489, 52329594, 55241344, 61826019, 61373138, 55268501, 54464481, 54400417, 53609047, 54024059, 55841148, 55817036, 54250774, 53584778, 54240757]
678E4240757k45564r97753k96154P01664P87564k11865L90690N44609j065845j291901
687.6E2556202K41417Q6830o06808J078865N25654j041900l97267J54690L2490j191098
697.3E1439075j434520O10149J843189L74512q71788l94783M92245J451042K42569
705.9E3751690j045712n65723K76188J084953K44946k73991q59756o08132J412960
714.6E3417423J625866J030949q67344j426750O23222L98548R320N61195o0322p8476
724.3E5233631N52437M65961L36659m57771j033883J46252k03243q40813O7787J28731
733.9E4395748L50365J73736m22634L18737M9473p71938O42288R76936r76570m75933
743.6E4260208R15733N47459K33124j56563K29496N98915m92657N23308J650017m37321
$$ y = [54240757, 53995193, 52997440, 52701286, 53402950, 54190514, 53978649, 54369339, 54913948, 53848103, 52556202, 52797619, 52884449, 52277641, 53356506, 53882160, 52840260, 52442993, 52597683, 52630173, 51439075, 50004555, 50614704, 52457893, 52832405, 51960617, 51565834, 52058079, 53509121, 53751690, 52705978, 52140255, 52416443, 53501396, 53746342, 53472351, 52612595, 52004463, 53417423, 55043289, 56074238, 55206894, 53780144, 54403366, 54801914, 54811234, 55372429, 55312107, 55233631, 55786068, 56252029, 56588688, 56130917, 55097034, 55243286, 55040043, 54199230, 54267017, 54395748, 54746113, 54919849, 54497215, 54815952, 54865425, 54093487, 54735775, 55712711, 54736141, 54260208, 55175941, 55723400, 55956524, 55799961, 56029457, 56628372, 56135715, 56659023, 58309040, 57871719]
753.2E7871719r61521j42128L56079J547158J65615o82774O52191k02591L35976O63612
762.8E9603336j240589K71870R18346o21567o7218l28678j118908n23461O11717O99646
772.5E8204494j82327M15806Q29788K55596J17615l22658j21479R08096L97289o77460
782.1E9824760J18664O73115j44859n6843L67737l48435j96789J072239P08088j21555
791.8F1896122l71269m92237J4785k83130m37847o5369r8415O43715R56661k88372
801.4F1474644j163037J53260O88385n18010n32028K32800J177658P89661M39434L40252
811.1F3083019j304863j3286J593158m0222q18783l05057k93884k01325J019139P88864
820.7F3506760o94893o34987l27732L7727P65488l01953j859684p64377L55324J76567
$$ y = [57871719, 56910198, 56768070, 57124149, 58671307, 58836922, 58154148, 58806339, 58603748, 58939724, 59603336, 58362747, 58634617, 59552963, 58931396, 58864178, 58535500, 57416592, 56893131, 57504848, 58204494, 58022167, 58437973, 59267761, 59523357, 59640972, 59318314, 59196835, 60104931, 60502220, 59824760, 59943424, 60616539, 60471680, 60414837, 60782574, 60434139, 60237350, 61309589, 62017677, 61896122, 61524853, 61032616, 61047401, 60764271, 60326424, 60261055, 60162640, 60806355, 61763016, 61474644, 60311607, 60464867, 61153252, 60635242, 60103214, 60336014, 61513672, 62303333, 62742767, 63083019, 61778156, 61764870, 63358028, 63317806, 62499023, 62193966, 61900082, 61698757, 62717896, 63506760, 62811867, 62176880, 61849148, 61886875, 62652363, 62350410, 60490726, 59726349, 60081673, 60258240]
830.4F0258240K19150k93544m78215n72742p65099L39447O1726j436302l82004Q6494
840E7037151n83995L89541J0723j23596M03194p59937l72139M21299l78216l95759
849.6E5648266M32670L67905J69682N53741O35738N86033j50081j33644R27024O37757
859.3E9675091M84493K99007o41819n4752R91345N90435k36374k88021L53107q7845
868.9F1084667m22031Q48793M06349o72188l57048N31716J255107O2661o67023l60733
878.6F1710270m59381m39659m73046K4678M56558M26788O0612n71396m88434k77450
888.2E9969540p8362M56150m56425r29985J99002l70316N0919R05998m0913L28774
897.9F0034382J29742p38320n75912L12114O48774n79640l83808M74255M21459k28485
$$ y = [60258240, 60477390, 60183846, 59705631, 59132889, 58367790, 58707237, 58768963, 57332661, 56950657, 57037151, 56453156, 56842697, 56853420, 56729824, 57133018, 56373081, 56000942, 56422241, 56044025, 55648266, 56080936, 56448841, 56618523, 57172264, 57808002, 58394035, 58243954, 58110310, 59037334, 59675091, 60159584, 60458591, 59816772, 59762020, 60753365, 61343800, 61107426, 60819405, 61172512, 61084667, 60662636, 61511429, 61917778, 61245590, 60888542, 61420258, 62675365, 62738026, 62071003, 61710270, 61250889, 60811230, 60338184, 60362862, 60819420, 61246208, 61306820, 60735424, 60246990, 59969540, 59891178, 60347328, 59890903, 58960918, 59159920, 58789604, 58840523, 59746521, 59705608, 60034382, 60164124, 59425804, 58849892, 59162006, 59810780, 59231140, 58847332, 59321587, 59743046, 59514561]
907.5E9514561m39095k04361o92684q7681l65455j489033j020622p1194R19872L86879
917.2E6451187m47674m24118p01801k33906l7094l94867m5700K30820o1436m54933
926.8E3880478k75517Q3107k71194o53202k86652L16120N79232K56000l34118k13039
936.4E3081215L78353M57676O10748Q65460K31502J99967O78222M77265P55996L18844
946.1E8055248l67737K73217k0161k50999K07420l06084J25340N46131Q0307L33492
955.7E8676174L06286j42315q09528q77236j42192L04409J67396k94521l03898p04556
965.4E6180019o98669p671Q5868P9453l84960j57120K20894o80832q41984k12059J46114
976E3729053P9190k89524n42404k56325J896k7394K68658J19133j93192n02960n89779
$$ y = [59514561, 59075466, 58871105, 58178421, 58090740, 57725285, 56236252, 55215630, 55144436, 56064308, 56451187, 56003513, 55579395, 54877594, 54643688, 54606594, 54211727, 54166027, 54396847, 54335411, 53880478, 53604961, 53688068, 53416874, 52763672, 52477020, 52793140, 53372372, 53628372, 53294254, 53081215, 53459568, 53917244, 54527992, 55393452, 55624954, 55824921, 56503143, 56980408, 57736404, 58055248, 57687511, 57960728, 57940567, 57689568, 57896988, 57590904, 57716244, 58262375, 58342682, 58676174, 58982460, 58840145, 58030617, 57153381, 57011189, 57315598, 57482994, 57188473, 56884575, 56180019, 55481350, 55473679, 55559547, 55639000, 55254040, 55096920, 55317814, 54636982, 53794998, 53582939, 53729053, 53808243, 53518719, 52976315, 52719990, 52721886, 52694492, 52963150, 53082283, 52889091, 52386131, 51796352]
986.6E1796352l4092k14080l80143k93922p13749p02709n26859j341935k400798j853619
996.2D3334446j24653J486839J910717J159069N77095l3809J15425K92274l06533m45267
1005.9D7965603m14597k77355K82665M99024j95660m62639n54950l16273O39751l39821
1015.5D6825748j035911n43976m68700J4480k30774l14884k59704n3002N4550r65957
1025.2D3021870l51212J93688l44277K00684M91840J39439m13536o21674m68567j75121
1034.8D1673134N14538J70345m77776j43623l41553m01004J14833O7425J30592O3813
1044.5D1370724n01503k04739L31394j27296J87946O54854K9243j00955m45015l66707
1054.1D0827946L70651J51836j57714k9294K21676J15094o878J37588J671m03568l79040
$$ y = [51796352, 51762260, 51548180, 51168037, 50874115, 50160366, 49457657, 48930798, 47588863, 45188065, 43334446, 43209793, 44696632, 46607349, 47766418, 48343513, 48309704, 48425129, 48717403, 48410870, 47965603, 47551006, 47273651, 47556316, 48055340, 47859680, 47397041, 46842091, 46525818, 47165569, 46825748, 45789837, 45245861, 44777161, 44791641, 44560867, 44245983, 43986279, 43933277, 43987827, 43021870, 42670658, 42864346, 42520069, 42720753, 43212593, 43352032, 42938496, 42316822, 41848255, 41673134, 42187672, 42358017, 41880241, 41736618, 41395065, 40994061, 41108894, 41176319, 41306911, 41370724, 40869221, 40664482, 40995876, 40868580, 41056526, 41711380, 41740623, 41639668, 41194653, 40827946, 41198597, 41350433, 41192719, 41163425, 41385101, 41500195, 41493317, 41630905, 41632576, 41229008, 40849968]
1064.7D0849968K19028q0493o49498J02684O01356k15977l0082M26040l13114j23981
1074.4D0785931j8261l31902m71580m68014M46804L18367o13297n62717L29227J10253
1084C9524811o66962O8581L46473j93496p89574l18348J82900r56917j103668p29985
1093.6C5363815n45952m74090j051983j080330q99317r73709p27100p49245j320061
1102.3B7542028q83148r44938j676444j344255q75421o52438q71191p69985j144972
1111A8379236j110004k31234l24308n25000n76931M7091r2182o92457M9259M89127
1120.6A5412597K71064L29641k82o68655Q577N16237L69976n6513j97563L61360J59850
1131.2A6506289K91847j76878n59324m58619r01111k83782j34390n76705q60968m66884
$$ y = [40849968, 41068996, 40988503, 40339005, 40441689, 41043045, 40827068, 40796986, 41223026, 40909912, 40785931, 40767670, 40435768, 39964188, 39496174, 39942978, 40261345, 39648048, 39085331, 39414558, 39524811, 38857849, 38926430, 39272903, 39079407, 38289833, 37971485, 38154385, 37197468, 36093800, 35363815, 34817863, 34343773, 33291790, 32211460, 31312143, 30338434, 29611334, 28862089, 27542028, 26658880, 25713942, 24037498, 22693243, 21817822, 21165384, 20294193, 19524208, 18379236, 17269232, 17037998, 16713690, 16188690, 15611759, 15658850, 15566668, 14874211, 14923470, 15412597, 15683661, 16013302, 16013020, 15344365, 15352942, 15869179, 16239155, 16182642, 15985079, 16346439, 16506289, 16798136, 16621258, 16061934, 15603315, 14702204, 14418422, 14284032, 13707327, 12846359, 12379475]
1140.9A2379475j22058l25255P1966l38423m94730j93589n06545m30575k24530n47888
1150.5I267848K6399O85577R6197m2640n21494k27509M72348K58062K37845K12690
1160.2A0465323O29551K57810K61286N61419N05187O04202M3259L07261M79679O50245
1169.8A4765222R78176O72082M92931O95789Q91358O25889Q41789Q93303J031152Q87778
1179.5B2775469N91999J322645J442749Q03423N66790R08832Q36027J031397N55702
1188.1C0835033L2048Q95561M75418K42981O28296P94605P50614L40508O47506M41231
1197.8C6083801K55238N76229O99696L31150L27419Q03257N06306L42159K00142N45883
1207.4D0671280O67389J86657M44000O68343O43829J88362P8568O408l8543L20552
$$ y = [12379475, 12257417, 11932162, 12004128, 11665705, 11170975, 10977386, 10470841, 10040266, 9815736, 9267848, 9294247, 9979824, 10076021, 10033381, 9511887, 9284378, 9756726, 10014788, 10252633, 10465323, 11094874, 11352684, 11613970, 12175389, 12680576, 13284778, 13328037, 13635298, 14114977, 14765222, 15743398, 16415480, 16908411, 17604200, 18495558, 19121447, 19963236, 20856539, 21887691, 22775469, 23367468, 24690113, 26132862, 26936285, 27503075, 28411907, 29247934, 30279331, 30835033, 30867081, 31762642, 32238060, 32481041, 33109337, 33903942, 34654556, 34995064, 35642570, 36083801, 36339039, 36915268, 37614964, 37946114, 38273533, 39076790, 39583096, 39925255, 40125397, 40671280, 41338669, 41525326, 41969326, 42637669, 43281498, 43469860, 43548428, 43554836, 43516293, 43836845]
1217.1D3836845J26591J46637P2983J37798J18748Q3607M82524j2542k41654J36780
1226.7D4888317K61105P7747j41346r3765P2784J15937j75412R6096J46439j13152
1236.4D5134750J16909K34066L94246J01352j48594K50122J81607k61326o7005O756
1246D5942883j58967K39796L06133K90749J03474k15172l97J78009J90140p9742O2198
1256.6D6859104J17840j53008P8358J53969o3904l21087J13030N04505J21468j29464
1266.3D7280811o2259L32283K57633k258J63471K36534O6387j2474K30385M8588o6243
1276.9D8472858L70808N53898N33680L00903J03008J61103J34601L27073K56519o6609
1286.5E1147842L1151M2942J26759J27716L1376L60275L18001R5108K66056L61477
$$ y = [43836845, 43963436, 44110073, 44183056, 44320854, 44439602, 44523209, 45005733, 44993191, 44751537, 44888317, 45149422, 45227169, 45085823, 44992058, 45064842, 45180779, 45005367, 45101463, 45247902, 45134750, 45251659, 45485725, 45879971, 45981323, 45832729, 46082851, 46264458, 46003132, 45936127, 45942883, 45783916, 46023712, 46329845, 46620594, 46724068, 46508896, 46508499, 46686508, 46876648, 46796906, 46859104, 46976944, 46823936, 46902294, 47056263, 46992359, 46671272, 46784302, 47288807, 47410275, 47280811, 47218552, 47550835, 47808468, 47806210, 47969681, 48206215, 48272602, 48260128, 48490513, 48539101, 48472858, 48843666, 49397564, 49931244, 50232147, 50335155, 50496258, 50630859, 50957932, 51214451, 51147842, 51178993, 51221935, 51348694, 51476410, 51507786, 51868061, 52186062, 52281170, 52547226, 52908703]
1296.2E2908703J48636J17115L44333J58722o1981J57715J69872r369J16391J20182
1305.8E4170319O5284O8051k3182J87847K20547K47940K97687j97204j96942O6170
1315.4E4906517J73157L29616k5913r3765K34791j4965k68990N0713L77086R1103L0327
1326E5789677J89647n2700L7098J69293J66458k781m55711k25647L40229N09788J98837
1336.7E6664188k93300m23783k02430L88282M02318R2708j92100m57108k7908N49568
1346.3E6500435L28071k14088k12921J987n5919j96183j85611M9019L62690K33825
1355.9E6611305j83052J4958J69838k30671l24768n2559P2727j47953k29572r4956
1365.6E5605297J01399J82003j07838n87292j72470O33133K00127l57544m7257j01001
$$ y = [52908703, 53057339, 53174454, 53518787, 53677509, 53615528, 53773243, 53943115, 53933746, 54050137, 54170319, 54235603, 54303654, 54280472, 54468319, 54688866, 54936806, 55234493, 55037289, 54840347, 54906517, 55079674, 55409290, 55383377, 55289612, 55524403, 55509438, 55240448, 55291161, 55668247, 55759350, 55789677, 55979324, 55926624, 55963722, 56133015, 56299473, 56296692, 55840981, 55615334, 55955563, 56465351, 56664188, 56370888, 55947105, 55744675, 56132957, 56535275, 56627983, 56435883, 55978775, 55950867, 56500435, 56828506, 56614418, 56401497, 56403484, 56347565, 56151382, 55965771, 56014790, 56377480, 56611305, 56428253, 56443211, 56613049, 56382378, 56057610, 56005051, 56077778, 55929825, 55700253, 55605297, 55706696, 55888699, 55780861, 55193569, 55021099, 55654232, 55854359, 55496815, 55449558, 55348557]
1375.2E5348557j33164j39008k24338r6642L4653n596j19118p13J1116J15757M60670
1385.8E5252174K43706m39556j8578K33529r1912K32823J65897k33433R8728r3994
1395.5E5349384l73710j37516P6648O9622L1647o4049k00763M2560o0417l28285m3396
1406.1E4361725J69357R2991j63971j81217k04880L7777K65259k3808n4981R4318n2707
1416.7E4339863k14382j41701m73049K04056L25336R7038P4925k57969R4623K44954
1426.3E4293694J28410J13754l32634k07748K46448L78670P3925l12035L11837N90301
1436E5284622j50818j99531K87224J99630J40660J58252J4904J07895l6289K0176L63735
1446.6E6190460M16336j24744l54859R1137L44880J98555j73893m5807J57749J83864
$$ y = [55348557, 55215393, 55076385, 54852047, 54755405, 54790058, 54784462, 54665344, 54664631, 54675747, 54791504, 55252174, 55495880, 55056324, 55037746, 55271275, 55179363, 55412186, 55578083, 55344650, 55443378, 55349384, 54975674, 54838158, 54914806, 54984428, 55016075, 54952026, 54751263, 54793823, 54733406, 54405121, 54361725, 54531082, 54624073, 54460102, 54278885, 54074005, 54111782, 54377041, 54353233, 54298252, 54392570, 54339863, 54125481, 53983780, 53510731, 53714787, 54040123, 54137161, 54212086, 53954117, 54048740, 54293694, 54422104, 54535858, 54203224, 53995476, 54241924, 54620594, 54694519, 54382484, 54694321, 55284622, 55133804, 54934273, 55221497, 55421127, 55561787, 55720039, 55734943, 55842838, 55806549, 55826725, 56190460, 56606796, 56482052, 56127193, 56218330, 56563210, 56761765, 56587872, 56542065, 56699814, 56883678]
1456.2E6883678q2454o26217N27775M46418J26698m9160j22219K82364K9583O279K38540
1466.8E7661285J75744K86014K84626J72779j04393K74681K34371k9247K35973K17099
1476.5E9408932M48322L64655J99752J68232J23120Q1031L6931K46940J94836Q8772
1486.1F1361523N5538k73213K46163L11947o31489j54121K79552K6157j48113P9548
1495.8F1153492k23286J97151j39091p64183P481L0506l5103L2783J08849j61190j140656
1506.4E9066753p54776N82608N04421k23866Q652k60483o33602J5412J69578k94948
1516E8179749j102860J47839N35568J04481l25070p2155L57758o7509j488J73928J35269
1526.6E8065510k43469k34799o6662q2023j97495l25649O3751m50519j36986O332j16131
$$ y = [56883678, 56801224, 56175007, 56702782, 57149200, 57275898, 57226738, 57104519, 57386883, 57416466, 57422745, 57661285, 57837029, 58123043, 58407669, 58580448, 58476055, 58750736, 58985107, 58955860, 59191833, 59408932, 59857254, 60221909, 60421661, 60589893, 60713013, 60794044, 60830975, 61077915, 61272751, 61361523, 61417061, 61143848, 61390011, 61701958, 61070469, 60916348, 61195900, 61222057, 61073944, 61153492, 60930206, 61127357, 60988266, 60224083, 60231564, 60262070, 60226967, 60259750, 60368599, 60207409, 59066753, 58311977, 58894585, 59399006, 59175140, 59183792, 58923309, 58289707, 58305119, 58474697, 58179749, 57076889, 57224728, 57760296, 57864777, 57539707, 57467552, 57825310, 57757801, 57756313, 57930241, 58065510, 57822041, 57587242, 57520580, 57438557, 57241062, 56915413, 56979164, 56528645, 56391659, 56397991, 56281860]
1537.2E6281860K30503r81510j273628J727108Q69251p57835l3440K61265k08794J48198
1546.9E6262978j33355J88836K64263j54724K92636r9609j29208n41175m113N18719
1556.5E6465248k64480J04633J528412q98403j29204J51375O9614J27808L25965O8738
1566.2E7549706q343j6918K80063m50142l84128L30478J65665j19118k79091k50484
1575.8E6817688m22821J16215K75413J68087J04199k25193m57249l90076P7519N3192
1585.5E6116974k20482k82841l29872R3304j77574m76574k21340j17169k48253l42182
1595.1E3793991k55939k55047J335k32372m13674l15967k63497k32116l12169r6775
1604.7E1417770j68068k32578k93873j26781k36427l59169j56186l50204o4095k70015
$$ y = [56281860, 56512363, 55530853, 54257225, 55984333, 56853584, 56095749, 56062309, 56323574, 56114780, 56262978, 56129623, 56318459, 56582722, 56427998, 56720634, 56621025, 56491817, 55950642, 55946529, 56465248, 56200768, 56305401, 57833813, 56935410, 56806206, 56957581, 57027195, 57155003, 57480968, 57549706, 57541363, 57524445, 57804508, 57354366, 56970238, 57300716, 57466381, 57347263, 57068172, 56817688, 56394867, 56511082, 56786495, 56954582, 57058781, 56833588, 56376339, 55986263, 56063782, 56116974, 55896492, 55613651, 55283779, 55377083, 55199509, 54722935, 54501595, 54384426, 54136173, 53793991, 53538052, 53283005, 53284340, 53051968, 52638294, 52322327, 52058830, 51826714, 51514545, 51417770, 51249702, 51017124, 50723251, 50596470, 50360043, 50000874, 49844688, 49494484, 49430389, 49160374]
1614.4D9160374k80331k19952q75309J40183j0395j94805k73777M8916l31463l79544
1624D6783897J24722k50664P0275j86753j32541j91250k88060O764j14399J32111J16546
1634.6D6070648q9630m18903j00800J2467K22385K18784l42304j44981j40976J69983
1644.3D5456673J18038m12335J89850J5881L34270P1495K27021N905q09010J019589
1653.9D6217377R2315N92541j1696l7395K17205K13611K76753K40147L06282p4063
1663.6D8033077J53565J91261K86476J37543j25099M67350L50444J53546P9929K60971
1673.2D9989063L57491L13007j99703K18330P55703M25789m8923j71482M22123M93320
1682.9E2554718l52718q3298K84206Q02300Q32596L47503K5029J66492M49306L11883
$$ y = [49160374, 48880043, 48660091, 47784782, 47924965, 47914570, 47719765, 47445988, 47494904, 47163441, 46783897, 46908619, 46657955, 46728230, 46541477, 46408936, 46217686, 45929626, 45936390, 45821991, 45954102, 46070648, 45981018, 45562115, 45461315, 45473782, 45696167, 45914951, 45572647, 45427666, 45286690, 45456673, 45574711, 45162376, 45352226, 45368107, 45702377, 45773872, 46000893, 46006798, 45197788, 46217377, 46309692, 46902233, 46890537, 46853142, 47070347, 47283958, 47560711, 47800858, 48107140, 48033077, 48186642, 48377903, 48664379, 48801922, 48676823, 49144173, 49494617, 49648163, 49728092, 49989063, 50346554, 50659561, 50459858, 50678188, 51433891, 51859680, 51810757, 51639275, 52061398, 52554718, 52202000, 52118702, 52402908, 53205208, 54037804, 54385307, 54410336, 54576828, 55026134, 55338017]
1692.5E5338017K39776J42143K95868N99400J03821L48591M99504O68785l09716N17857
1702.1E8444046P14954M93176L32935L33302Q8497K51839M79969N22777M22405J08075
1711.8F2191975n6404J819J32179K07295K41558K16675k88208M44557N35404K47093
1721.4F3873943P9148J8814P5718J18934J77964J14212Q3816M3724j79123M02291L43978
1732F5153419j39732n92316n15853P55539L39584J82312M45564o3576J49147M13849
1741.7F6127937k5299j45256K59285N21034K05552j72112o0524K67212O18439K12516
1751.3F7808784n1956N16175M06860J65039O7879q8753J97166K63123L08624L16468
1761F9909409k02378M6952L77494M1794r9716J84288J60324j82175K50710J88690l09021
$$ y = [55338017, 55577793, 55719936, 56015804, 56615204, 56719025, 57067616, 57567120, 58235905, 57926189, 58444046, 59159000, 59652176, 59985111, 60318413, 60406910, 60658749, 61138718, 61661495, 62083900, 62191975, 62135571, 62137390, 62269569, 62476864, 62718422, 62935097, 62646889, 63091446, 63626850, 63873943, 63953091, 63971905, 64047623, 64166557, 64344521, 64458733, 64542549, 64586273, 64407150, 64809441, 65153419, 65013687, 64421371, 63905518, 64661057, 65000641, 65182953, 65628517, 65564941, 65714088, 66127937, 66102638, 65957382, 66216667, 66737701, 66943253, 66771141, 66710617, 66977829, 67596268, 67808784, 67756828, 68273003, 68679863, 68844902, 68912781, 68824028, 69021194, 69284317, 69592941, 69909409, 69707031, 69753983, 70131477, 70173271, 70073555, 70257843, 70418167, 70235992, 70486702, 70675392, 70366371]
1771.6G0366371l62984K40342N23864J62690q965J63742K57584J96274k46987j17767
1781.2G1174164L61542K86659l3692k04780o8825O5567R4605p103R7236R8702P9216
1791.8G1943291m3854r7038J19087j34407o3889K69020J26954k68921j0498K86651
1801.5G2126396J3138J47232Q0353P8453J26198j19622r7732M5036J11496P0473O4186
1812.1G2645607j90910L8498L62815l3859k1362l4844n34P1099N1475K82982p2655
1822.7G3098312k10991n8601k69424P7766L34961K43042k1904l21655P6744K95769
1832.3G3244019k3682j24451K9900J43448K6230j89995J24344J06918k2835L2501J31829
1842.9G3478226J8043m40407K29119J55891q980J74134L6667L2783J3229p4302q7624
$$ y = [70366371, 70003387, 70243729, 70767593, 70930283, 70921318, 71085060, 71342644, 71538918, 71291931, 71174164, 71535706, 71822365, 71788673, 71583893, 71515068, 71580635, 71675240, 71668137, 71765373, 71864075, 71943291, 71899437, 71802399, 71921486, 71787079, 71723190, 71992210, 72119164, 71850243, 71839745, 72126396, 72139534, 72286766, 72367119, 72445572, 72571770, 72452148, 72354416, 72399452, 72510948, 72581421, 72645607, 72454697, 72493195, 72856010, 72822151, 72800789, 72765945, 72765411, 72836510, 72887985, 73170967, 73098312, 72887321, 72828720, 72559296, 72637062, 72972023, 73215065, 73193161, 72871506, 72948250, 73244019, 73220337, 73095886, 73125786, 73269234, 73295464, 73105469, 73229813, 73336731, 73313896, 73346397, 73478226, 73496269, 73055862, 73284981, 73440872, 73431892, 73606026, 73642693, 73675476, 73688705, 73614403, 73526779]
1853.6G3526779L5996Q2161J5831j33095k19719J88530J85074o7688P6286l5995j03814
1864.2G3550346J23520j35414l00148K15248Q0117P675K90794L4157o3782P3799O2264
1874.8G3938576j32592j53236L3119J64635J91864L4119m1130N050j96502k78428J16669
1885.4G3682144K72453Q7067j07719k87888j72348J23879J50672J4451N7151L0480
1895G3850342q1032J21552J61994n897r7397P8827L8422q3664J25061J4320p652P3623
1906.6G4188499j50093o0470J36467r2774j83395R7626J38305J0582O0234n531k98256
1917.2G3841194k41562K65290o95k05948K28775K20910k56234n6816K1042m7912n5031
1927.8G3713013m1817K29279K99934J51634k51869l55927o7398J6144K48566J04156
$$ y = [73526779, 73562775, 73644936, 73660767, 73527672, 73307953, 73496483, 73681557, 73613869, 73690155, 73654160, 73550346, 73673866, 73538452, 73238304, 73453552, 73533669, 73541344, 73832138, 73866295, 73802513, 73876312, 73938576, 73805984, 73652748, 73685867, 73850502, 74042366, 74076485, 74035355, 74040405, 73843903, 73565475, 73682144, 73954597, 74041664, 73933945, 73646057, 73473709, 73597588, 73748260, 73762711, 73819862, 73850342, 73769310, 73890862, 74052856, 74046959, 73949562, 74028389, 74066811, 73983147, 74108208, 74122528, 74114876, 74188499, 74038406, 73977936, 74114403, 74021629, 73838234, 73935860, 74074165, 74084747, 74144981, 74139450, 73841194, 73599632, 73864922, 73864227, 73658279, 73887054, 74107964, 73851730, 73794914, 73815956, 73768044, 73713013, 73671196, 73900475, 74200409, 74352043, 74100174, 73744247, 73676849, 73692993, 73941559, 74045715]
1937.5G4045715j31843j89385k4673K82814p7446k07680L1838O080l5583M8446O6819
1948.1G3815102j20476O8687Q1955j4450J2116l0136q4206r2049J56868k1515l5614
1958.7G3736282J35819Q583M417j01043P0816J25549j7113p0106l09220j39701J11869
1969.3G3556152n9967j66549M5990K12013J94954m0940n2253J13365q7357k2796P6202
1979.9G3768814K6985K9694q5098j03531p8522J1169K0699m7867m3747N9792O5635
1990.5G3624023p2609k01530j98914J53656K03316r849n5397j54015j10748J0780K72469
2001.1G3461182K57690r979l151j09123k06360j24306j00540o94J66320m272j23451
2011.7G3203316K4887K4612l2669J7433J72249M6494j75736j57707k82K0805p5752
$$ y = [74045715, 73913872, 73724487, 73699814, 73982628, 73905182, 73697502, 73729340, 73735420, 73699837, 73748283, 73815102, 73694626, 73763313, 73845268, 73830818, 73842934, 73812798, 73728592, 73636543, 73793411, 73771896, 73736282, 73872101, 73880684, 73885101, 73784058, 73854874, 73980423, 73963310, 73893204, 73583984, 73444283, 73556152, 73496185, 73329636, 73375626, 73587639, 73782593, 73741653, 73689400, 73802765, 73715408, 73692612, 73768814, 73795799, 73825493, 73740395, 73636864, 73558342, 73569511, 73590210, 73542343, 73498596, 73558388, 73624023, 73551414, 73349884, 73150970, 73304626, 73507942, 73498093, 73442696, 73288681, 73177933, 73188713, 73461182, 73718872, 73708893, 73705742, 73596619, 73390259, 73265953, 73165413, 73164719, 73331039, 73326767, 73203316, 73228203, 73252815, 73220146, 73237579, 73409828, 73456322, 73280586, 73122879, 73122597, 73143402, 73067650]
2022.3G3067650N4306k2354J6762Q6334o7414O3240Q4763k7473q6106l7605p3669j37337
2033.9G2921097j09093l1387K04559J21147p6607k54577j18935K22077K13462K46033
2043.5G3337776j3801k63230k65884j02318R7214Q3908K49290N7289j97746j32576
2053.2G2849922q6609q4251k5543J40617J2444j1986j16280k49023J42929K63313n8838
2063.8G2776695k50244m8523J26877N6869l1936k2888j00731k09152l0365o4431j33430
2074.4G2068741J5098M3351l4790m3099k1263j28662R6855J48460q1474N6076J1231
2085G2130524j27411n4444Q8967P4028j29082n8456J29676k7107j96075k9434J19964
2095.6G1921150J03478j3878j31645o8962J53015J48971L5393R0179j01646j02524
$$ y = [73067650, 73121956, 73099602, 73116364, 73202698, 73135284, 73198524, 73283287, 73255814, 73169708, 73132103, 73058434, 72921097, 72812004, 72780617, 72985176, 73106323, 73029716, 72775139, 72656204, 72878281, 73091743, 73337776, 73323975, 73060745, 72794861, 72692543, 72789757, 72873665, 73122955, 73180244, 72982498, 72849922, 72763313, 72679062, 72653519, 72794136, 72806580, 72794594, 72678314, 72429291, 72572220, 72835533, 72776695, 72526451, 72477928, 72604805, 72661674, 72629738, 72606850, 72506119, 72296967, 72266602, 72202171, 72068741, 72083839, 72127190, 72092400, 72049301, 72028038, 71899376, 71996231, 72144691, 72063217, 72119293, 72130524, 72003113, 71948669, 72037636, 72111664, 71982582, 71924126, 72053802, 72026695, 71830620, 71801186, 71921150, 72024628, 72010750, 71879105, 71810143, 71963158, 72112129, 72147522, 72237701, 72136055, 72033531]
2105.2G2033531L4905j9081j320j671K19711K22351O310o9107j32531r7831J0322J86302
2116.8G2391891M8501q1681p3944j1215J17767j01272j58425j6411K44065J87523j69854
2127.4G2376945j44226k45185l9856J19621q4869Q0955P2639M4602M4861j22933o6841
2138G2035713O7795Q9104l6789q01J15402L7453O0562J8188j04019m2099K1103J63048
2149.6G2424660K25975n1514k16698q5823L2410Q5266l029k9030J97052O0212j03661
2160.2G2535820n87q1513j05217l9078J33988O0440j14601p7744l8254K55646J02257
2170.8G2631157k05879m067J48163k9610k59094k8786J206N3207K23435p7309j26060
2181.4G2326363J609O1371k7343r0165q2939j07925J36657Q2078j03936p0038M5815
$$ y = [72033531, 72068436, 72049355, 72048035, 72046364, 72266075, 72488426, 72494736, 72425629, 72293098, 72195267, 72205589, 72391891, 72440392, 72358711, 72284767, 72273552, 72391319, 72290047, 72131622, 72115211, 72359276, 72546799, 72376945, 72232719, 71987534, 71947678, 72067299, 71982430, 72063385, 72136024, 72180626, 72225487, 72102554, 72035713, 72103508, 72192612, 72155823, 72155022, 72270424, 72307877, 72368439, 72386627, 72282608, 72240509, 72261612, 72424660, 72650635, 72599121, 72382423, 72296600, 72329010, 72414276, 72411247, 72382217, 72579269, 72639481, 72535820, 72535233, 72453720, 72348503, 72309425, 72443413, 72503853, 72389252, 72311508, 72273254, 72528900, 72631157, 72425278, 72421211, 72569374, 72539764, 72280670, 72251884, 72253090, 72306297, 72529732, 72452423, 72326363, 72327972, 72389343, 72362000, 72271835, 72188896, 72080971, 72217628, 72299706, 72195770, 72125732, 72171547]
2192G2171547J99905J98143J63796l2479k60673j31645J84509J81488j8639n5793j1902
2202.6G2588257j4191M0657K37137l4576k11205L5072l2264O0196J36474N9235Q0513
2213.3G2945305j7540j24046j63720N8762K09244J22307J23649k1751k20871j07170
2222.9G2804169R3101J8593r9068L601l4172j31858O9297J48461N5122q171o9115j28692
2234.5G2721268r4719J35864L1166l3127J21041j4946o5079j38832o7894N7319p293
2245.1G2644768J03805P4723K3010J24313R339j50605Q644P0404r8892o3804R7625
2255.7G2843330J25245r4628j80351j50643K4811K22344j8166k6588P9002K3300K8939
2266.3G2876595r4262j34987K5277J38687J0444q9164p6081P9445J34339o8665q6166
$$ y = [72171547, 72371452, 72569595, 72733391, 72700912, 72440239, 72308594, 72493103, 72674591, 72655952, 72600159, 72588257, 72574066, 72614723, 72851860, 72817284, 72606079, 72641151, 72608887, 72669083, 72805557, 72864792, 72945305, 72927765, 72803719, 72639999, 72698761, 72908005, 73030312, 73153961, 73132210, 72911339, 72804169, 72897270, 72915863, 72816795, 72820396, 72786224, 72654366, 72723663, 72872124, 72927246, 72919075, 72849960, 72721268, 72626549, 72762413, 72793579, 72760452, 72881493, 72866547, 72801468, 72662636, 72594742, 72652061, 72644768, 72748573, 72823296, 72846306, 72970619, 72979958, 72829353, 72837997, 72908401, 72809509, 72745705, 72843330, 72968575, 72873947, 72693596, 72542953, 72567764, 72790108, 72771942, 72745354, 72824356, 72847656, 72876595, 72782333, 72647346, 72672623, 72811310, 72821754, 72732590, 72656509, 72735954, 72870293, 72801628, 72715462]
2276.9G2715462m6952J25504J89377j8204p7904j1818L296j13907j2626O5956j2215
2287.5G2805969Q5472K19567R4146k04048j53274o6773p9590j9371J26343J96373l4820
2298.1G2969994j1643P4593m3106k18460j62384J57165J61728P3746M1526K2957k34871
2308.7G2831245k37335J27182O4774K62115R1370m05029o6735L19687J83647k13791
2318.4G2957130k02926k3796o7116l8666R4071L8711j90529R3376L12226J66488M15635
2329G3554604M82299j27266k54715j75193k04048J58660J12740q1078j44249O4728
2338.6G3386482J30280j82320J02211l24089l94531K99911R0790K13165J78910k39121
2348.3G3261688j32400J46415N0911j55227J31523j09924l63297J68640M07128L51234
$$ y = [72715462, 72668510, 72794014, 72983391, 72965187, 72887283, 72875465, 72878761, 72764854, 72752228, 72818184, 72805969, 72891441, 73111008, 73205154, 73001106, 72847832, 72781059, 72701469, 72682098, 72808441, 73004814, 72969994, 72958351, 73032944, 72989838, 72771378, 72608994, 72766159, 72927887, 73001633, 73043159, 73066116, 72831245, 72593910, 72721092, 72785866, 73047981, 73139351, 72734322, 72667587, 72987274, 73170921, 72957130, 72754204, 72730408, 72663292, 72624626, 72718697, 72757408, 72566879, 72660255, 72972481, 73138969, 73554604, 74036903, 73909637, 73654922, 73479729, 73275681, 73434341, 73547081, 73466003, 73321754, 73386482, 73516762, 73334442, 73436653, 73112564, 72718033, 73017944, 73108734, 73321899, 73500809, 73261688, 73129288, 73275703, 73326614, 73171387, 73302910, 73192986, 72829689, 72998329, 73405457, 73756691]
2357.9G3756691P6782p0457j78871K2041M13483J6342K54074J82121o67236m33098
2367.6G3371872j49139L9047k4605l23708k6306K28707K59239K02904k02828m07242
2377.2G2967941J65016J39122k67143R2407K05201R7664m3633j39969p4837o2049J80168
2387.8G3259888R4284M6646R8625j67496r7847P1709K7870j06338Q9477J31905j02875
2398.4G3345848j05446j24038O8977q9172j55556J88667J02875J7448l5438N7007o4995
2409G3206177l70865j480M28512K74506k20474k95128K0561J46935N2162q7181r4933
2419.6G3058792j9363J6090p3166l4538J30402J40777m8584j66427n5588j587O5071
2430.2G3011879q858q5411J0269j38900j71196J25366K63267Q8417m3235p5905J2932
$$ y = [73756691, 73833473, 73763016, 73584145, 73606186, 74019669, 74036011, 74290085, 74472206, 73804970, 73371872, 73222733, 73261780, 73237175, 72913467, 72887161, 73115868, 73375107, 73578011, 73375183, 72967941, 73132957, 73272079, 73004936, 73097343, 73302544, 73400208, 73356575, 73216606, 73141769, 73079720, 73259888, 73354172, 73400818, 73499443, 73331947, 73234100, 73305809, 73333679, 73227341, 73316818, 73448723, 73345848, 73240402, 73116364, 73185341, 73096169, 72940613, 73129280, 73232155, 73249603, 73214165, 73271172, 73206177, 72835312, 72833832, 73262344, 73536850, 73316376, 73021248, 73041809, 73188744, 73240906, 73153725, 73058792, 73039429, 73055519, 72982353, 72947815, 73078217, 73218994, 73170410, 73003983, 72948395, 72946808, 73011879, 73003021, 72917610, 72927879, 72788979, 72617783, 72743149, 73006416, 73094833, 73051598, 72975693, 72988625]
2440.8G2988625J23436p8728j47598j04310j25350j5694M4708L5050K9747M1320o9831
2451.5G2721375n7763O7170q8479j23275m4464l9460K9007o8260M074K59201Q4366
2462.1G2743492r0896p5013p6027K3156o417j18568j26526P5195J81877n668o5537
2472.7G2459068j3878M3801k7848m9713R201j16760j20933J083Q1528p1549q2504R1377
2484.2G2202873l7842K1164r819q2504J33865j2764j30531R4948J40900r1553j07201
2494.8G2121536J9837o9496j8860M1755M6929K1644p5752n4466j24046j9043P8643
2505.5G1968681k5161L2455K5276N7389K7854m4288n4283j48712j22056q6959J22367
2516.1G1752563J61835K4063R7931r5474j64383n9647N4154J41235o6078j03302R232
$$ y = [72988625, 73112061, 73033333, 72885735, 72781425, 72656075, 72640381, 72685089, 72720139, 72749886, 72791206, 72721375, 72663612, 72730782, 72642303, 72519028, 72474564, 72435104, 72464111, 72395851, 72399925, 72659126, 72743492, 72652596, 72577583, 72501556, 72524712, 72518295, 72399727, 72273201, 72348396, 72530273, 72524605, 72459068, 72445190, 72488991, 72461143, 72411430, 72420631, 72303871, 72182938, 72184021, 72265549, 72194000, 72111496, 72202873, 72165031, 72186195, 72176376, 72093872, 72227737, 72214973, 72084442, 72179390, 72320290, 72228737, 72121536, 72141373, 72071877, 72053017, 72094772, 72141701, 72163345, 72087593, 72033127, 71909081, 71890038, 71968681, 71943520, 71975975, 72001251, 72058640, 72086494, 72042206, 71987923, 71839211, 71717155, 71630196, 71752563, 71914398, 71938461, 72036392, 71940918, 71776535, 71716888, 71771042, 71912277, 71846199, 71742897, 71752129]
2526.7G1752129K8480j18278j32096O1379N1544L5263L1769M0397j6166j57166n7930
2537.3G1519325J55953J11244r8351q6609r0354j21697L9986J30905N6694O210p1426
2547.9G1551880j36139j0178n9753O7123J94588j73004j47675J05164P9689j83991
2557.5G1287704k13867J91834J92055j64582k22702J26816K12097K1034p6637j44226
2567.2G1209526K0844J7150o8595j29502j46751J11702Q6723l4714P492K762o6322
2577.8G1010315j5038J32134O325q4702o2401p7224K2735J16417Q4046n4085j73622
2588.4G0904900j13594R033o7642q5869J93023K34261j75369j68152P0701q1008L5865
2599G0756149L9269j99730j04508L1380J03897l5812J6823J38816j61491j48140K4887
$$ y = [71752129, 71780609, 71662331, 71530235, 71591614, 71643158, 71678421, 71710190, 71750587, 71734421, 71577255, 71519325, 71675278, 71786522, 71688171, 71601562, 71511208, 71389511, 71429497, 71560402, 71617096, 71623306, 71551880, 71415741, 71405563, 71345810, 71412933, 71607521, 71434517, 71286842, 71392006, 71471695, 71287704, 71073837, 71265671, 71457726, 71293144, 71070442, 71197258, 71409355, 71430389, 71353752, 71209526, 71230370, 71247520, 71178925, 71049423, 70902672, 71014374, 71101097, 71066383, 71073875, 71076637, 71010315, 70995277, 71127411, 71133736, 71049034, 70986633, 70909409, 70932144, 71048561, 71132607, 71078522, 70904900, 70791306, 70800339, 70732697, 70646828, 70839851, 71074112, 70898743, 70730591, 70801292, 70720284, 70756149, 70795418, 70595688, 70491180, 70522560, 70626457, 70590645, 70607468, 70746284, 70584793, 70436653, 70461540]
2609.6G0461540j11488j18073N2643J03005Q3221k1103j75110j07925J23520J86409
2619.3G0476639j0781j20368j53245j12266O1981N5657M745K5543J595l2303J518q2405
2630.8G0116310j34025J8821Q942M6631k4300j50055K7207J10481Q3618p1640j16226
2641.4F9915764j10764k23335k0248J51321K0012j35368L3561J50215j88758k39289
2651.1F9353111o897Q705o6223J7350J27876n5687r8313J16730K4819j43425j55693
2661.7F9122353j04645M1427q2313j47972J20788K04293Q9775j38397j01799Q7066
2671.3F9090576q0566r2255M1489l4706P2136K01698j12244k16278P286K7001m6669
2681.9F8857468j97174J3397J28654j60537J7150J2207j15638N3703o5597o5003J48323
$$ y = [70461540, 70350052, 70231979, 70284622, 70387627, 70470848, 70449745, 70274635, 70166710, 70290230, 70476639, 70465858, 70345490, 70192245, 70079979, 70141960, 70197617, 70202362, 70227905, 70229500, 70197197, 70198715, 70116310, 69982285, 70001106, 70010048, 70056679, 70032379, 69882324, 69909531, 70020012, 70103630, 70031990, 69915764, 69805000, 69581665, 69561417, 69712738, 69732750, 69597382, 69630943, 69781158, 69592400, 69353111, 69346214, 69354919, 69288696, 69306046, 69433922, 69378235, 69279922, 69396652, 69421471, 69278046, 69122353, 69017708, 69059135, 68976822, 68828850, 68949638, 69153931, 69243706, 69105309, 69003510, 69090576, 69010010, 68917755, 68959244, 68924538, 68996674, 69198372, 69086128, 68869850, 68877136, 68904137, 68857468, 68660294, 68673691, 68802345, 68641808, 68658958, 68671165, 68555527, 68609230, 68543633, 68478630, 68626953]
2692.5F8626953J00891q3771j31706j03576J5411l5927j76002M5539K5956P942J79329
2703.1F8471039P7324o317j98273k22267m0787K2980J5861j22482o9267M3670p866
2713.8F7963615l0822R5901n066j96892l0159j18377j15540M1100l639Q0169l7529
2724.4F7642761J175J38146L6819k9190j18858q7250j08116j30043K777J70563J95892
2735F7714676m1412j61255j40976o020J00472o7849k41096j35742J36505J20247p9529
2745.6F7198021j08757O1737J16463j62384k62513J3245K54822J4854k30407J09138
2755.2F7004219J78833j64009j23192L5996J8814k6551j23275n9548K0424j01883q1756
2765.8F6578072K5344P5753r2888l69248p4470K45636P202m6158N9235L0220R3559
$$ y = [68626953, 68727844, 68644073, 68512367, 68408791, 68424202, 68388275, 68212273, 68257812, 68283768, 68291710, 68471039, 68548363, 68542046, 68343773, 68121506, 68080719, 68103699, 68119560, 67997078, 67927811, 67971481, 67963615, 67932793, 68028694, 68023628, 67826736, 67796577, 67678200, 67562660, 67603760, 67600121, 67680290, 67642761, 67643936, 67782082, 67818901, 67789711, 67670853, 67583603, 67475487, 67345444, 67348221, 67518784, 67714676, 67673264, 67512009, 67371033, 67365013, 67465485, 67397636, 67156540, 67020798, 67157303, 67277550, 67198021, 67089264, 67151001, 67267464, 67105080, 66842567, 66855812, 67110634, 67125488, 66895081, 67004219, 67183052, 67019043, 66895851, 66931847, 66950661, 66924110, 66800835, 66741287, 66761711, 66659828, 66578072, 66603416, 66679169, 66586281, 66217033, 66142563, 66388199, 66395401, 66349243, 66408478, 66438698, 66532257]
2776.4F6532257m6776j86546o5834q8905j29891o7703J9249O6788L3737o233q9463
2787F5970680l196L0372j13815q5060o4614o553n3200j18553R3208q0009k00516N4466
2798.6F5423210q5319j70899p080J0155L7926J022j79543j56524K9991n989n9563j6495
2810.2F4820892m8683j45378j85570J17722J85760k97706j65283K61222n3588j97381
2819.8F4292007n4405j14975k2026j35818j41930J20037n5507j89663K574r338k11239
2830.4F3479717j39076k5181j07639r1171l7003n4314r9720n5332p9208o1382p6317
2841.1F2653374l30433k85011k50638k20287j16451k64931k03216j16688j06289q6594
2850.7F0672836j31496j98162k06921m5193p186K1999N9299N9037n2681j58963J10283
$$ y = [66532257, 66485481, 66298935, 66233101, 66144196, 66014305, 65946602, 65965851, 66032639, 66066376, 66060143, 65970680, 65967484, 65997856, 65884041, 65798981, 65734367, 65727814, 65674614, 65556061, 65649269, 65569260, 65368744, 65423210, 65337891, 65166992, 65159912, 65170067, 65207993, 65209015, 65029472, 64872948, 64902939, 64896950, 64837387, 64820892, 64772209, 64626831, 64441261, 64558983, 64744743, 64447037, 64281754, 64542976, 64489388, 64292007, 64237602, 64122627, 64100601, 63964783, 63822853, 63942890, 63887383, 63697720, 63700294, 63690956, 63479717, 63340641, 63315460, 63207821, 63116650, 63079647, 63025333, 62925613, 62870281, 62791073, 62729691, 62653374, 62322941, 62037930, 61787292, 61567005, 61450554, 61185623, 60982407, 60865719, 60759430, 60672836, 60541340, 60343178, 60136257, 60091064, 60083878, 60105877, 60165176, 60224213, 60171532, 60012569, 60122852]
2861.3F0122852J00109k35900l70030j62178J50738M7016j86520j66977P714J0910
2870.9E9317734q1879j00948j69247m2450J4397m1310P3464q2302j47000J2677j43063
2881.6E8610073m0249O7883j17188o6826j78959j15715K2755k26562j93318k71L2544
2892.2E7794167j23749q1829K3281j86314p9849l8910j55045j15402k76787j83792
2901.8E6575771J20327J02433L746j35312k38224l227L6541r4051k4929p6626N993
2912.4E6272442M0481j14650k29710l74645j86215N4684J68984J70787j00616k17594
2922.1E5483948l13618l02319L9105K06287O0040n5042O4411P7095j8418O9218J26328
2932.7E5437035N7102q8635r6927O1290Q931j5225K26334K52071l2734j48315Q537
$$ y = [60122852, 60222961, 59987061, 59617031, 59454853, 59605591, 59652607, 59466087, 59299110, 59306824, 59317734, 59235855, 59134907, 58965660, 58923210, 58937607, 58896297, 58969761, 58887459, 58740459, 58753136, 58610073, 58569824, 58637707, 58520519, 58453693, 58274734, 58159019, 58181774, 57955212, 57761894, 57761623, 57794167, 57670418, 57588589, 57611870, 57425556, 57345707, 57306797, 57151752, 57036350, 56759563, 56575771, 56696098, 56798531, 56802277, 56666965, 56428741, 56425514, 56462055, 56368004, 56343075, 56266449, 56272442, 56312923, 56198273, 55968563, 55593918, 55407703, 55462387, 55631371, 55802158, 55701542, 55483948, 55170330, 54868011, 54907116, 55113403, 55173443, 55118401, 55182812, 55259907, 55241489, 55310707, 55437035, 55494137, 55405502, 55308575, 55369865, 55378796, 55363571, 55589905, 55841976, 55809242, 55660927, 55669464]
2943.3E5669464J60172R7984l2272J05724O6448j23649M9968m9183j90067K5452J27334
2953.9E5907375M2542k84252j11199K35585m7547p1586J00322J91159N1536j86363
2963.5E5827572J60091J96152r8831J5663J79131J70692n619J9646J71711J92852J22562
2974.1E6951622J7895O1611p851j9146J67740J72260Q8341J54221K95692J37955l1281
2984.7E7989059N8449K6985N8258J86139J28936K5242L9356J28048M2122p6893J53130
2995.3E8758831K29015m8877j34575j7037J09066Q7025J26816J38828r7698l6415J27201
3006E9242180l040j55674m5613N0705o1210L5881O6269k03515l00567O6688K07207
3016.6E8899311r1099j02771l9071J4443r3743j84009m2671O5719K34562q3999k42936
$$ y = [55669464, 55829636, 55927620, 55895348, 56001072, 56067520, 55943871, 55993839, 55944656, 55754589, 55780041, 55907375, 55949917, 55665665, 55554466, 55790051, 55742504, 55670918, 55771240, 55962399, 56013935, 55827572, 55987663, 56183815, 56084984, 56100647, 56279778, 56450470, 56444851, 56464497, 56636208, 56829060, 56951622, 56969517, 57031128, 57023277, 57004131, 57171871, 57344131, 57432472, 57586693, 57882385, 58020340, 57989059, 58047508, 58074493, 58132751, 58318890, 58447826, 58473068, 58512424, 58640472, 58682594, 58605701, 58758831, 58987846, 58938969, 58804394, 58787357, 58896423, 58983448, 59110264, 59249092, 59151394, 59114979, 59242180, 59239140, 59083466, 59037853, 59088558, 59027348, 59063229, 59129498, 58925983, 58625416, 58692104, 58899311, 58808212, 58705441, 58666370, 58680813, 58587070, 58403061, 58360390, 58426109, 58660671, 58576672, 58333736]
3027.2E8333736O0421J9822o7181j05064n7305L5099M8691p2857p4699j8326j49796
3037.8E7952541k7900j3832q1837j02497j23295K624l9215N3959P3097j11633j37775
3048.4E7444237n5660j118q1497q0948k9492k2411j32515j04134O4225j351q3847j96064
3060E6719425j84948P9018J82094j08345j89327l4988k29855k30358j7780J87633J89476
3070.6E6362045j77772k25456K4448L0155p1834k1737j58554j42032R0896P4589k1248
3081.2E5763500j97014k6222M1424k10835o2122P8587n5779r5257P0000K7397n8334
3091.8E5275345j20838j21697K4544j25748j10473n1537O1112J19777j95614j40350
3101.4E4614521o7200j36085j02135J5221n1098j48895O1908m1729q7036j13037j37134
$$ y = [58333736, 58394157, 58413979, 58346798, 58241734, 58184429, 58219528, 58268219, 58195362, 58120663, 58102337, 57952541, 57924641, 57910809, 57828972, 57726475, 57603180, 57605804, 57566589, 57620548, 57693645, 57582012, 57444237, 57388577, 57387459, 57305962, 57225014, 57195522, 57173111, 57040596, 56936462, 57000687, 56999336, 56915489, 56719425, 56534477, 56613495, 56795589, 56687244, 56497917, 56462929, 56233074, 56002716, 55984936, 56172569, 56362045, 56184273, 55958817, 55983265, 56013420, 55941586, 55919849, 55761295, 55619263, 55710159, 55784748, 55763500, 55566486, 55540264, 55581688, 55370853, 55308731, 55387318, 55331539, 55236282, 55306282, 55333679, 55275345, 55154507, 55032810, 55057354, 54931606, 54821133, 54769596, 54830708, 54950485, 54754871, 54614521, 54547321, 54411236, 54309101, 54324322, 54273224, 54124329, 54186237, 54144508, 54057472, 53944435, 53807301]
3112E3807301J3298j17646j5819M6570j2612Q9604p3265l01106k23709l0022J0159
3122.6E3192753J6659n0774j70033k58537j85684M2496J05739Q7921n9005j36593j4549
3133.3E2570393J0784j30711k83718j57009q0765j67316k3407P5783o0502j04759q8707
3143.9E1560066N135J06693m9557j72706k67475j78051N1006n1350j69616j75568j49639
3154.5E0508938k6810J00201q6025k03171M5822L6186j33022k06783J400N8757k36877
3165.1D9858616r3197N2650j56127j61393R3655n0007k22191j3180j38389j52638m4983
3175.7D8972816j36718q0689p9250j93176j13709J62853O4000j32622n7190j30581
3185.3D8275734k08576q7796l5861j36124j05950j08108k949N2757l23261k82226R6534
$$ y = [53807301, 53820599, 53702953, 53687134, 53733704, 53721092, 53810696, 53737431, 53436325, 53212616, 53182594, 53192753, 53209412, 53158638, 52988605, 52730068, 52544384, 52586880, 52692619, 52780540, 52721535, 52584942, 52570393, 52581177, 52450466, 52166748, 52009739, 51928974, 51761658, 51738251, 51814034, 51753532, 51648773, 51560066, 51565201, 51671894, 51622337, 51449631, 51182156, 51004105, 51055111, 51003761, 50834145, 50658577, 50508938, 50482128, 50582329, 50496304, 50293133, 50338955, 50375141, 50242119, 50035336, 50036736, 50095493, 49858616, 49765419, 49818069, 49661942, 49500549, 49594204, 49544197, 49322006, 49308826, 49170437, 49017799, 48972816, 48836098, 48755409, 48676159, 48482983, 48369274, 48532127, 48596127, 48463505, 48406315, 48275734, 48067158, 47979362, 47943501, 47807377, 47701427, 47593319, 47590370, 47643127, 47319866, 47037640, 47134174]
3195.9D7134174J31276j97266l14938m54k0958r3898Q8413P0679j73966l25840j21036
3206.5D6176186L3474o0185n3318p5916o0974N9234r9327j70879l1769l3115j06190
3217.2D5577221j96488j22657j02768j03447L0990N6981J0761j20041j15391o4838
3226.8D4850323m4136L7159j04538j91300j07578q1711j20430o9576L2261q6170j79146
3237.4D3935158q8692J6453m5956k23934j20193L8688o5323j21200j2318o22j27842
3248D3184219j39415j2001J6159j31817j46870L9726j754o4347r7511j03523R136j93871
3259.6D2358131o6780J30577j31031j35677o8363j9436p2739p0621n8830n5588J36982
3270.2D1946625j69953k19791J16493J11645j29826k78766K4185l2284j51726Q2947
$$ y = [47134174, 47265450, 47068184, 46753246, 46752792, 46731834, 46637936, 46726349, 46797028, 46623062, 46297222, 46176186, 46209660, 46149475, 46096157, 46020241, 45959267, 46018501, 45919174, 45748295, 45716526, 45683411, 45577221, 45380733, 45258076, 45155308, 45051861, 45082851, 45139832, 45150593, 45030552, 44915161, 44850323, 44806187, 44843346, 44738808, 44547508, 44439930, 44358219, 44237789, 44168213, 44200474, 44114304, 43935158, 43846466, 43862919, 43816963, 43593029, 43472836, 43511524, 43446201, 43325001, 43312683, 43312061, 43184219, 43044804, 43032803, 43048962, 42917145, 42770275, 42810001, 42808247, 42743900, 42646389, 42542866, 42552002, 42358131, 42291351, 42421928, 42290897, 42155220, 42086857, 42067421, 41994682, 41924061, 41865231, 41809643, 41946625, 41776672, 41556881, 41673374, 41785019, 41655193, 41376427, 41400612, 41368328, 41216602, 41299549]
3279.8D1299549P6981j44272j46305J18900p3803j81084p6274p2167o7646k22320J007
3290.4D0512566J60129n409j07552n9963j24184k43438J6025K5543p1762n1941M2035
3301D0092049K3861j48266M2324q9623j36833l6049j71825j9505M1394j2658j18862
3311.7C9466007QJ05461j74194k90150j63052N2811q331j12438j01094p5451l6808
3322.3C8662769j30119j41659r0988J46908K14115j53492l69808j56784J41475L0419
3331.9C8152836k12105k23701l3860n8769r5978K1782j66576j54476J05068J25996
3341.6C7460217j47831k16954j46034j82136k5506j40373j45298k0199l6934n0834
3351.2C6348118k06032N7114N7884j78288o9744N066j457k98409k43171k8122j3233
$$ y = [41299549, 41376530, 41232258, 41085953, 41204853, 41131050, 40949966, 40873692, 40801525, 40733879, 40511559, 40512566, 40672695, 40667286, 40559734, 40499771, 40375587, 40132149, 40148174, 40173717, 40101955, 40050014, 40092049, 40115910, 39967644, 40009968, 39920345, 39783512, 39747463, 39575638, 39556133, 39597527, 39584869, 39466007, 39466015, 39571476, 39397282, 39107132, 38944080, 38996891, 38988560, 38876122, 38775028, 38699577, 38662769, 38532650, 38390991, 38300003, 38446911, 38661026, 38507534, 38137726, 37980942, 38122417, 38152836, 37940731, 37717030, 37683170, 37624401, 37528423, 37550205, 37383629, 37229153, 37334221, 37460217, 37312386, 37095432, 36949398, 36767262, 36741756, 36601383, 36456085, 36435886, 36398952, 36348118, 36142086, 36199200, 36257084, 36078796, 36009052, 36014118, 36012661, 35714252, 35471081, 35442959, 35429726]
3361.8C5429726L1238j48357j00121M0341k6268k32842j84921J08375o9740k46574
3371.4C4600857r8957K0694j00750j17328N9254j26446j61591r289j54758k32681r9320
3382.1C3579685Q1612M6741j50886q0204J03084q1100k64351j02364Q225O8184K8732
3392.7C3237358r2533o0520j23303j9275R9655j37306j25100p6416j42635j3309L1303
3403.3C2577919J06041J30821j06453j98807r8655l9025l944N1296O6948Q343m1290
3413.9C2453194q4332j69098j17206j9291j2676J69784K60025p233k25315j61110J59611
3424.5C2246353J44543j34121m3503P523m6139L693J1016N7015j3928l9535l9055r3861
3436.1C2060001J14804K75509K20775p2471k58576k3922R1160J25915R7435m4242j48590
$$ y = [35429726, 35460964, 35312607, 35212486, 35252827, 35226559, 34993717, 34808796, 34917171, 34847431, 34600857, 34501900, 34522594, 34421844, 34304516, 34363770, 34237324, 34075733, 34066444, 33911686, 33679005, 33579685, 33661297, 33708038, 33557152, 33476948, 33580032, 33498932, 33234581, 33132217, 33140442, 33208626, 33237358, 33144825, 33084305, 32961002, 32941727, 33041382, 32904076, 32778976, 32702560, 32559925, 32546616, 32577919, 32683960, 32814781, 32708328, 32509521, 32410866, 32371841, 32367897, 32419193, 32486141, 32494484, 32453194, 32368862, 32199764, 32082558, 32063267, 32050591, 32220375, 32480400, 32473167, 32247852, 32086742, 32246353, 32390896, 32256775, 32213272, 32220795, 32174656, 32178349, 32189365, 32246380, 32232452, 32192917, 32153862, 32060001, 32174805, 32450314, 32671089, 32598618, 32340042, 32316120, 32407280, 32533195, 32630630, 32586388, 32437798]
3446.7C2437798j11981J27640N1411K8865J41178K5803n375j3946K2152R3670j0323
3457.3C2786892q3496O5315K39662J38516M2434P3418J1181O3431Q0856O4766K50309
3467.9C3733284K7473j12163K19379P332k49428j34616N1689K49496N6030O6754J91139
3478.5C4106369N623N8895J38382j4114O305K08321J61095K2110N8593J6873J0200
3489.1C4778652J58047J96300K7897p8117L0163K25876K04361l1552j00582j10359
3498.7C5300686K9026J81934R3819Q7116J21323J65596J50856J61011J87484O3820
3508.4C6542671M261j11603o5086J38310J17614J34991K17541K7050j18889K07878
3518C7094738K71904l5309N7049J57692J13872O5159J63731K74544q0227q6743K24953
$$ y = [32437798, 32325817, 32453457, 32504868, 32533733, 32674911, 32700714, 32695339, 32681393, 32703545, 32797215, 32786892, 32703396, 32768711, 33008373, 33146889, 33189323, 33262741, 33273922, 33337353, 33418209, 33482975, 33733284, 33760757, 33648594, 33867973, 33875305, 33625877, 33491261, 33542950, 33792446, 33848476, 33915230, 34106369, 34111992, 34170887, 34309269, 34295155, 34301460, 34509781, 34670876, 34692986, 34751579, 34768452, 34778652, 34936699, 35132999, 35160896, 35082779, 35112942, 35338818, 35543179, 35511627, 35411045, 35300686, 35329712, 35511646, 35605465, 35692581, 35813904, 35979500, 36130356, 36291367, 36478851, 36542671, 36546932, 36435329, 36370243, 36508553, 36626167, 36761158, 36978699, 37005749, 36886860, 37094738, 37366642, 37331333, 37388382, 37546074, 37659946, 37725105, 37888836, 38163380, 38083153, 37996410, 38221363]
3528.6C8221363J05457N4528Q983P5558J30165R0378K16942k2297K6886L09521J01024
3539.2C9318508J61926Q3977p8354J83350K01481P1705R11p4665N3719K29645J97643
3549.9D0349846K81429M10610J05954n9197P9434J38923J10771N9956J28830J94038
3559.5D1800594J60717N776K44137K52552j33618J75907J85669J92967M10202L7712
3569.1D3332615J84082N2898M4659K03598L2997J30806J78467J81385K00813J47736
3578.8D4690056L3359q9294J97498L71479J04557L8140M05742N44846L73108o3877
3588.4D6605614n45113K29019N02312J41598O8104K13478K18849R0030K93244J23386
3598.1D7940521M4502M19899K28920J34076J68048J19454J68835M54830M91222o2794
$$ y = [38221363, 38326820, 38381348, 38390331, 38465889, 38596054, 38686432, 38903374, 38881077, 38907963, 39217484, 39318508, 39480434, 39564411, 39486057, 39669407, 39870888, 39942593, 39943504, 39868839, 39922558, 40152203, 40349846, 40631275, 41041885, 41147839, 41088642, 41168076, 41306999, 41417770, 41477726, 41606556, 41800594, 41961311, 41967087, 42211224, 42463776, 42330158, 42506065, 42691734, 42884701, 43294903, 43332615, 43516697, 43569595, 43614254, 43817852, 43850849, 43981655, 44160122, 44341507, 44542320, 44690056, 44723415, 44634121, 44831619, 45203098, 45307655, 45345795, 45751537, 46296383, 46669491, 46605614, 46060501, 46289520, 46791832, 46933430, 47001534, 47215012, 47433861, 47523891, 47817135, 47940521, 47985023, 48404922, 48633842, 48767918, 48935966, 49055420, 49224255, 49679085, 50170307, 50107513]
3607.7E0107513M80885K91092j94069L70670N7946K18601K94353k68131K48344L58670
3617.4E1965874K13379L66554M787p160J72535J65657L79727N88336L81104J03710
3627E4334503N80559L99834j195305M41131O22506N34626L94496j24084K77359K75810
3636.6E6541435K06387K51308j6018J39031L56087K95372k2336N1217M20696N37205
3646.3E8760384P9887k81845J76666J48232K28801J14277L52341M62048M67163M26860
3655.9F0934814n39836J95449M47850K04773K56717j2054L67130J62911j23806J99691
3665.6F2093639J62339M64172P4047k13253L43845m48669L28457Q46741R96616Q5663
3675.2F4733597k189736L89386P42290L83324l1731J71425L91457J07086K6893L6873
$$ y = [50107513, 50588398, 50879490, 50685421, 51056091, 51114037, 51332638, 51626991, 51358860, 51607204, 51965874, 52179253, 52545807, 52550594, 52543434, 52715969, 52881626, 53261353, 53849689, 54230793, 54334503, 54915062, 55314896, 54119591, 54560722, 55183228, 55717854, 56112350, 55988266, 56265625, 56541435, 56747822, 56999130, 56983112, 57122143, 57478230, 57773602, 57751266, 57802483, 58223179, 58760384, 58840271, 58558426, 58735092, 58883324, 59112125, 59226402, 59578743, 60040791, 60507954, 60934814, 60394978, 60590427, 61038277, 61243050, 61499767, 61487713, 61854843, 62017754, 61893948, 62093639, 62255978, 62720150, 62794197, 62580944, 62924789, 62476120, 62804577, 63651318, 64647934, 64733597, 62543861, 62933247, 63675537, 64058861, 64027130, 64198555, 64590012, 64697098, 64723991, 64760864]
3684.9F4760864m4151L02055P40265o48445m96857R48182k73598j74370L91304m0642
3694.5F5464607P1396K6688J34132Q8501r2400M34968L85292q72612l59360O22078
3704.1F5903290L27881J94656n2193M4739N77973m86336M33746P83562j448075J29441
3713.8F6408684N00641Q6662j31683L1677J31241k27715J25603N65285o6361m62372
3723.4F6961662M44710J72562l24623k46628J24214L65585Q62M83773l8765j029534
3733.1F6913818N54016L75679n31059o4224M22379J81091l0167J36475l91312J87081
3742.7F7753777J162414r27818j483772Q07167K75604P77412J2444j372856P46879
3751.4F7751251r13612l63594R79713M85703J90887n59990J48217N39199n59127j68152
$$ y = [64760864, 64716713, 65018768, 65759033, 65110588, 64613731, 65561913, 65288315, 65113945, 65505249, 65464607, 65536003, 65562691, 65696823, 65785324, 65692924, 66127892, 66513184, 65640572, 65281212, 65903290, 66231171, 66425827, 66373634, 66418373, 66996346, 66510010, 66943756, 67727318, 66279243, 66408684, 66909325, 66995987, 66864304, 66895981, 67027222, 66799507, 66925110, 67490395, 67424034, 66961662, 67406372, 67578934, 67254311, 67007683, 67131897, 67497482, 67498344, 67982117, 67943352, 66913818, 67467834, 67843513, 67312454, 67248230, 67670609, 67851700, 67821533, 67958008, 67566696, 67753777, 68916191, 67988373, 66504601, 67311768, 67587372, 68364784, 68377228, 67004372, 67751251, 66837639, 66474045, 67453758, 67939461, 68130348, 67570358, 67718575, 68257774, 67698647, 67530495]
3761F7530495N76980L03009q5899L30269K8213l75312J36024L82256M341r17313Q1001
3771.7F7994064K09832P4791K02270j4412m944M433L54690o5780p08534J76986l96
3782.3F8223000L0677K44606k62794m9301L05130L5568M8767J72485p8392j41311k2225
3792.9F8506210r353J76399L90137m24103o52847K75764L51845M93065l28507j083481
3802.5F7695129M19152K23488L33557O57333p92992n72082M75876J51176j66939O7818
3812.2F8491516J13770J39015N98610k53975j616234M73465P18811N61073K27227j823685
3821.8F7629593r4490P40539L01102M9767K05764j45958k64251J98745M43825R4742
3831.4F9159378q32657R4109O22268m72564k83013O10810n97557q19970Q27042L17055
$$ y = [67530495, 68107475, 68410484, 68324585, 68654854, 68683067, 68307755, 68443779, 68826035, 68830376, 67913063, 67994064, 68203896, 68278687, 68480957, 68466545, 68461601, 68466034, 68820724, 68754944, 68046410, 68223396, 68223000, 68253677, 68498283, 68235489, 68186188, 68491318, 68526886, 68575653, 68748138, 68669746, 68528435, 68506210, 68496857, 68673256, 69063393, 68639290, 67986443, 68262207, 68614052, 69107117, 68778610, 67695129, 68114281, 68337769, 68671326, 69328659, 68535667, 67963585, 68439461, 68590637, 68423698, 68491516, 68605286, 68744301, 69342911, 69088936, 67472702, 67946167, 68664978, 69226051, 69453278, 67629593, 67535103, 68275642, 68576744, 68626511, 68832275, 68686317, 68422066, 68620811, 69064636, 69159378, 68326721, 68420830, 69043098, 68570534, 68287521, 68898331, 68300774, 67480804, 68307846, 68624901]
3841.1F8624901j32607N66628j48140m61815J39732M7463J30630K19895j62155J29386
3850.7F8953918L34694p65617O29807j319977m81484J222740k6619j71150L28873J03607
3860.4F8808792K51022p19688k59888M05869n22759l7597M26880O40075P08588j056160
3870F8645134r42200M77967P31285N53909q91335o5734N35820j42853k25060K8542
3879.7F8705475l52844k30370M35997P1808J89224P46041r59351l04543L08800K2614
3889.3F8632851L85261k30987q84240K26990K47109M1801J87737J09542M59237J02699
3898.9F9278000r91707O84105J77673q53790L89702k80449l24944P3975K17880L16544
3908.6F8686989R1904J14776j21841p8316n1735j44081K53555L84285k04597n89012
$$ y = [68624901, 68492294, 69058922, 68910782, 68448967, 68588699, 68636162, 68766792, 68986687, 68824532, 68953918, 69288612, 68522995, 69152802, 67832825, 67351341, 68574081, 68547462, 68376312, 68705185, 68808792, 69059814, 68340126, 68080238, 68486107, 67963348, 67925751, 68352631, 68992706, 69701294, 68645134, 67702934, 68180901, 68912186, 69466095, 68574760, 68509026, 69044846, 68901993, 68676933, 68705475, 68352631, 68122261, 68558258, 68630066, 68819290, 69565331, 68605980, 68301437, 68610237, 68632851, 69018112, 68787125, 67902885, 68129875, 68376984, 68418785, 68606522, 68716064, 69175301, 69278000, 68286293, 68970398, 69148071, 68294281, 68683983, 68403534, 68078590, 68152565, 68370445, 68686989, 68778893, 68893669, 68771828, 68693512, 68641777, 68497696, 68751251, 69135536, 68930939, 68341927]
3918.2F8341927K47932J62819n34607J37436L81119L23120J39099l29941j14509j03249
3927.9F8651146j80344j29364J43151L72306k92366m55436Q6036K36275P1480o1623
3937.5F8441261L57193J06118n28443P4188K87011l80494k15911P316K10144L71636
3947.2F8730019m1413j21254o6772j86600J43089J08330q9668K3621k1256l6522p385
3957.8F8434189L5774L8536J4992O1180j8631P278N1178P0000o2813l80943n4863K07970
3969.3F8403847o1631J02921J45065O310p0519j66313J04698K3911j20308J938j65192
3980F8204727j04584J67870J32713p2265J58539K73635j76498k43347l3493J56173
3989.6F8463470J59195n5358j69030j03378P3311m7539R3948K06925k7321J2283j89308
$$ y = [68341927, 68589859, 68752678, 68218071, 68355507, 68736626, 69059746, 69198845, 68868904, 68754395, 68651146, 68470802, 68341438, 68484589, 68856895, 68564529, 68109093, 68195129, 68431404, 68502884, 68441261, 68798454, 68904572, 68376129, 68450317, 68737328, 68356834, 68140923, 68148239, 68358383, 68730019, 68688606, 68567352, 68500580, 68313980, 68457069, 68565399, 68475731, 68499352, 68478096, 68441574, 68434189, 68469963, 68508499, 68523491, 68584671, 68566040, 68573318, 68624496, 68694496, 68631683, 68250740, 68195877, 68403847, 68342216, 68445137, 68590202, 68596512, 68525993, 68359680, 68464378, 68488289, 68367981, 68369919, 68204727, 68100143, 68268013, 68400726, 68328461, 68487000, 68760635, 68584137, 68340790, 68307297, 68463470, 68622665, 68567307, 68398277, 68294899, 68368210, 68320671, 68414619, 68621544, 68594223, 68606506, 68417198]
4000.2F8417198
$$ y = [68417198]
##END=$$ End of the data block
