##TITLE=Turfa - pH 4.0 $$ Begin of the data block
##JCAMP-DX=5.00 $$ ACD/DocManager Library v 5.00
##DATE=03 May 2017 08:39:08
##DATA TYPE=INFRARED SPECTRUM
##DATA CLASS=XYDATA
##ORIGIN=Marcelo Quint
##OWNER=
##NPOINTS=1765
##FIRSTX=399.77209473
##LASTX=3997.72216797
##MAXX=3997.72216797
##MINX=399.77209473
##MAXY=1.00000000
##MINY=0.63580579
##XFACTOR=1.0000000000
##YFACTOR=0.0000312500
##FIRSTY=1.00000000
##DELTAX=2.03965425
##XUNITS=1/CM
##YUNITS=ARBITRARY UNITS
##XYDATA=(X++(Y..Y))
$$ plain form
399.8 32000 31941 31941 31760 31483 31183 30903 30635 30382 30114 29854 29649 29478 29332 29203 29096 29010 28948 28884 28793 28685 28546 28370 28158
446.7 28158 27921 27674 27405 27134 26847 26534 26221 25903 25598 25338 25155 25064 25069 25181 25388 25679 26032 26419 26810 27153 27436 27652
491.6 27652 27801 27893 27924 27908 27860 27795 27731 27657 27573 27485 27389 27292 27198 27113 27025 26932 26845 26764 26697 26651 26638 26661 26715 26801 26914 27047 27184 27304
548.7 27304 27416 27528 27633 27728 27820 27927 28044 28160 28277 28396 28520 28639 28754 28869 28978 29087 29195 29300 29408 29514 29622 29724 29825
595.6 29825 29925 30015 30102 30181 30259 30339 30418 30496 30559 30606 30651 30704 30758 30795 30826 30867 30918 30982 31048 31111 31171 31224 31274 31315 31357 31407 31456 31506 31550 31592
656.8 31592 31629 31657 31688 31708 31694 31670 31690 31714 31713 31704 31692 31674 31652 31614 31566 31514 31459 31425 31440 31523 31642 31751 31835 31895 31940 31973 31992 31985 31993 31976 31950
720 31950 31920 31894 31866 31835 31800 31751 31692 31618 31537 31455 31375 31310 31258 31222 31200 31181 31170 31162 31158 31161 31162 31160 31143 31103 31035 30939 30838 30762 30742 30774 30817 30834 30810
787.3 30810 30749 30663 30563 30474 30433 30477 30613 30812 31028 31220 31371 31486 31569 31632 31679 31717 31748 31769 31787 31803 31817 31832 31842 31852 31861 31868 31867 31849 31821
$$ packed form
399.8C2000n9%j81k77l00k80k68k53k68k60k05j71j46j29j07q6o2o4r1j08j39j76k12
446.7B8158k37k47k69k71k87l13Tl18l05k60j83r1NJ12K07K91L53L87L91L43K83K16
491.6B7652J49R2L1j6m8o5o4p4q4q8r6r7r4q5q8r3q7q1o7m6j3K3N4Q6J13J33J37J20
548.7B7304J12TJ05R5R2J07J17J16J17J19J24J19J15TJ09TJ08J05J08J06J08J02J01
595.6B9825J00R0Q7P9P8Q0P9P8O3M7M5N3N4L7L1M1N1O4O6O3O0N3N0M1M2N0M9N0M4M2
656.8C1592L7K8L1K0j4k4K0K4jrj2j8k2l8m8n2n5l4J5Q3J19J09Q4O0M5L3J9pQj7k6
720C1950l0k6k8l1l5m9n9p4q1q2q0o5n2l6k2j9j1qmLJkj7m0o8r6j01p6k0L2M3J7k4
787.3C0810o1q6j00q9m1M4J36J99K16J92J51J15Q3O3M7L8L1K1J8J6J4J5J0TRPjj8k8
$$ plain form
846.5 31821 31785 31739 31684 31616 31541 31460 31374 31286 31194 31099 31000 30897 30796 30699 30616 30544 30481 30424 30366 30305 30233 30153 30066 29969 29863 29747 29622 29491
903.6 29491 29352 29213 29087 28990 28934 28911 28908 28906 28894 28871 28835 28790 28732 28663 28592 28526 28467 28414 28364 28314 28256 28189 28106 28006 27892 27764 27625 27474 27312
962.7 27312 27139 26956 26765 26562 26345 26119 25883 25637 25383 25124 24862 24599 24335 24069 23795 23514 23228 22944 22667 22404
1003.5 22404 22171 21980 21831 21715 21610 21506 21391 21264 21126 20976 20819 20665 20532 20432 20370 20346 20351 20378 20419 20468 20524 20589 20667
1050.4 20667 20760 20865 20974 21084 21192 21303 21411 21511 21601 21675 21731 21767 21789 21800 21806 21816 21836 21870 21924 21997 22087 22187 22294 22406 22523
1101.4 22523 22642 22763 22886 23008 23125 23244 23376 23523 23681 23843 24003 24151 24292 24440 24594 24740 24868 24983 25086 25176
1142.2 25176 25253 25324 25392 25463 25534 25603 25663 25699 25707 25707 25723 25765 25826 25901 25982 26063 26143 26219 26295 26370 26445 26518 26588 26655 26718 26779 26839 26899 26960 27025 27092 27164 27239
1209.5 27239 27317 27396 27471 27544 27614 27682 27749 27813 27875 27933 27989 28045 28099 28153 28205 28254 28301 28348 28394 28438 28481 28523 28562 28596 28628 28660 28694 28726 28759 28792 28829 28869
$$ packed form
846.5C1821l6m6n5o8p5q1q6q8r2r5r9j03j01r7q3p2o3n7n8o1p2q0q7r7j06j16j25j31
903.6B9491j39Tj26r7n6k3lkj2k3l6m5n8o9p1o6n9n3n0Tn8o7q3j00j14j28j39j51j62
962.7B7312j73j83j91k03k17k26k36k46k54k59k62k63k64k66k74k81k86k84k77k63
1003.5B2404k33j91j49j16j05j04j15j27j38j50j57j54j33j00o2k4NK7M1M9N6O5P8
1050.4B0667R3J05J09J10J08J11J08J00R0P4N6L6K2J1OJ0K0L4N4P3R0J00J07J12J17
1101.4B2523J19J21J23J22J17J19J32J47J58J62J60J48J41J48J54J46J28J15J03R0
1142.2B5176P7P1O8P1TO9O0L6Q%J6M2O1P5Q1TQ0P6TP5TP3P0O7O3O1O0TO1O5O7P2P5
1209.5B7239P8P9P5P3P0O8O7O4O2N8N6TN4TN2M9M7TM6M4M3M2L9L4L2TL4L2L3TL7M0
$$ plain form
1274.8 28869 28908 28945 28981 29017 29052 29084 29113 29141 29166 29188 29207 29223 29235 29243 29249 29254 29258 29259 29258 29261 29267 29276 29292 29309 29326 29341 29354 29364 29373 29377 29376 29380 29401 29425 29441 29449 29455 29461 29465
1354.3 29465 29469 29471 29462 29444 29434 29429 29413 29391 29365 29342 29341 29347 29330 29307 29324 29393 29471 29519 29529 29517 29509 29509 29520 29531 29535 29543 29550 29548 29545 29538 29507 29463 29446 29438 29427 29415 29396 29388
1431.8 29388 29389 29374 29370 29401 29432 29454 29466 29473 29494 29529 29557 29559 29582 29663 29740 29794 29858 29936 29993 30020 30054 30105 30152 30188 30217 30243 30255 30251 30266 30303 30322 30316 30323 30351
1501.2 30351 30375 30354 30297 30306 30343 30361 30357 30347 30332 30301 30282 30274 30264 30257 30232 30189 30169 30140 30050 29974 29950 29934 29908 29863 29812 29761 29699 29581 29478 29463 29439
1564.4 29439 29385 29306 29221 29169 29102 28994 28918 28863 28789 28704 28614 28519 28421 28318 28212 28109 28007 27903 27795 27690 27585 27479 27380 27290 27181
1615.4 27181 27073 27034 27021 26997 26987 26987 27002 27048 27112 27203 27337 27483 27631 27775 27930 28130 28318 28491 28726 28958 29152 29330 29507
1662.3 29507 29685 29837 29961 30087 30210 30315 30416 30514 30591 30635 30677 30754 30827 30888 30937 30957 30970 30991 31032 31094 31145 31193 31250 31301 31340 31362
1715.4 31362 31382 31437 31502 31552 31594 31631 31661 31680 31688 31725 31772 31800 31826 31856 31880 31892 31897 31919 31949 31962 31967 31970 31969 31981 31992 31988 31976 31963 31972 31993 31990 31997 31997 31997 31997 31981
$$ packed form
1274.8B8869L9L7L6TL5L2K9K8K5K2J9J6J2QONMJjLORJ6J7TJ5J3J0RMjMK1K4J6QOTM
1354.3B9465MKrj8j0nj6k2k6k3jOj7k3J7O9P8M8J0j2q%J1TMQPklpl1m4j7qj1j2j9q
1431.8B9388Jj5mL1TK2J2PK1L5K8KK3Q1P7N4O4P8N7K7L4N1M7L6K9K6J2mJ5L7J9oPK8
1501.2C0351K4k1n7RL7J8mj0j5l1j9qj0pk5m3k0k9r0p6k4j6k6m5n1To2j18j03j5k4
1564.4B9439n4p9q5n2o7j08p6n5p4q5r0r5r8j03j06j03j02j04j08j05Tj06r9r0j09
1615.4B7181j08l9j3k4j0%J5M6O4R1J34J46J48J44J55K00J88J73K35K32J94J78J77
1662.3B9507J78J52J24J26J23J05J01R8P7M4M2P7P3O1M9K0J3K1M1O2N1M8N7N1L9K2
1715.4C1362K0N5O5N0M2L7L0J9QL7M7K8K6L0K4J2NK2L0J3NLjJ2J1mj2j3RK1lP%Uj6
$$ plain form
1788.8 31981 31984 31967 31976 31987 31982 31974 31977 31984 31986 31978 31970 31969 31971 31968 31965 31961 31949 31937 31930 31918 31914 31923 31923 31918 31916 31906 31882 31870 31875 31878 31874 31868 31858 31847 31836 31827 31819 31802 31778 31769 31775 31778 31773 31767 31761 31754 31747 31741
1886.7 31741 31731 31724 31724 31722 31719 31717 31715 31712 31709 31705 31700 31699 31699 31696 31685 31679 31679 31676 31677 31680 31677 31673 31668 31665 31662 31656 31645 31638 31638 31638 31635 31632 31626 31623 31620 31616 31611 31606 31597 31589 31586 31585 31581 31577 31574 31571 31568 31563 31558 31552 31545 31540 31539 31538 31535 31531 31527 31523 31520
2007 31520 31518 31516 31516 31512 31504 31495 31481 31457 31435 31439 31465 31481 31488 31493 31497 31499 31500 31502 31503 31505 31506 31509 31511 31513 31515 31518 31521 31522 31523 31525 31528 31531 31533 31536 31539 31544 31548 31552 31556 31560 31565 31570 31576 31581 31584 31587 31591 31594 31598 31603 31607 31609 31611 31614 31619 31623 31626 31629 31633
2127.4 31633 31638 31642 31645 31648 31652 31657 31661 31665 31669 31674 31679 31684 31688 31692 31696 31702 31706 31709 31709 31707 31709 31719 31729 31736 31741 31746 31750 31753 31755 31759 31764 31767 31771 31774 31776 31778 31780 31784 31788 31792 31794 31794 31795 31796 31799 31803 31806 31808 31810 31812 31815 31818 31821 31823 31825 31828 31831 31833 31835 31837 31838 31839 31840 31841 31843 31845 31847 31849 31850 31851 31852 31854
2274.2 31854 31855 31856 31858 31860 31862 31863 31864 31863 31861 31858 31857 31856 31854 31851 31846 31840 31834 31830 31826 31822 31816 31807 31795 31783 31776 31770 31761 31751 31745 31739 31727 31712 31702 31697 31709 31746 31784 31791 31772 31747 31727 31712 31707 31709 31713 31719 31731 31746
2372.1 31746 31763 31781 31800 31821 31840 31854 31864 31870 31871 31870 31869 31868 31867 31867 31866 31864 31862 31860 31858 31857 31856 31855 31853 31851 31848 31845 31844 31844 31844 31843 31842 31840 31837 31836 31835 31832 31829 31827 31825 31824 31823 31821 31819 31816 31814 31811 31809 31809 31807 31805 31802 31799 31797 31795 31794 31792 31790 31787
2490.4 31787 31785 31782 31779 31776 31775 31774 31772 31770 31767 31765 31764 31761 31759 31758 31758 31756 31753 31750 31749 31747 31743 31742 31741 31740 31738 31736 31733 31731 31729 31728 31726 31724 31723 31722 31720 31718 31716 31715 31712 31709 31707 31706 31706 31704 31700 31697 31695 31693 31692 31691 31688 31685 31682 31680 31677 31673 31670 31669 31667 31665 31661 31656 31652
2618.9 31652 31649 31647 31644 31642 31639 31637 31634 31631 31628 31625 31622 31617 31614 31611 31605 31601 31599 31596 31591 31587 31584 31581 31579 31576 31572 31569 31567 31565 31562 31557 31551 31545 31540 31536 31533 31529 31523 31520 31516 31512 31506 31500 31496 31491 31484 31477 31472 31469 31466 31463 31458 31453 31448 31442 31436 31432 31430 31427 31423 31420 31416 31413 31411 31407
$$ packed form
1788.8C1981Lj7RJ1nqLPKqTjKlTmj2Tpj2mR%nkj0k4j2NLmoj0j1Trqj7k4rOLnoTpTo
1886.7C1741j0p%klkTlTmnj%lj1o%lJLlmnlToj1p%TlTolTmnTrqljmTlUnTopnjTlmUl
2007C1520kT%mqrj4k4k2MK6J6PNMKJKJKJLKULTJTKLTKLTNMVNTONLTMLMNMKTLNMLTM
2127.4C1633NMLTMNMUNUMUOML%kKJ0TPNTMLKMNLMLKUMUK%JTLMLKULUKTLTKUJVKVJUK
2274.2C1854JTKUJTjkljTklnoTmUorj2Tporj0oTj2j5j0nJ2L7L8Pj9k5k0j5nKMOJ2J5
2372.1C1746J7J8J9K1J9J4J0OJjV%jkVjUkTlTj%TjTkljTlTkTjTkTlklk%kTlTkTjkTl
2490.4C1787klUjTkTlkjlkj%klTjkmjUkTlkTjkTjTkUjlTkj%kmlkTjTlUklmljkTmnm
2618.9C1652lklklklWnlTomklnmlTklmlkTlnoTnmlmolmToTmnpTnlUnUoTmklmlmlkm
$$ plain form
2749.4 31407 31400 31394 31389 31382 31375 31368 31362 31356 31350 31343 31336 31330 31323 31314 31303 31292 31284 31278 31275 31268 31256 31245 31236 31225 31209 31193 31178 31164 31150 31135 31117 31096 31078 31061 31043 31021 30998 30975 30951 30927 30902 30875 30845
2837.1 30845 30809 30765 30718 30673 30631 30594 30570 30561 30566 30578 30592 30600 30601 30603 30605 30609 30614 30613 30600 30583 30567 30551 30532 30511 30488 30465 30441 30420 30399 30374 30349 30327 30304 30279 30253 30229
2910.6 30229 30203 30170 30136 30107 30092 30094 30112 30144 30188 30231 30271 30314 30356 30394 30430 30463 30488 30501 30512 30525 30537 30544 30553 30565 30578 30589 30598 30605 30613 30625 30640 30659 30685
2977.9 30685 30719 30748 30767 30783 30797 30813 30824 30826 30822 30814 30799 30784 30771 30759 30751 30748 30745 30734 30716 30698 30681 30669 30657 30643 30630 30622 30618 30610 30594 30583 30580 30575 30561 30544 30534 30529 30524 30517
3055.4 30517 30510 30502 30496 30494 30496 30494 30482 30469 30465 30466 30468 30462 30450 30437 30423 30406 30390 30370 30349 30334 30324 30310 30289 30269 30256 30244 30226 30209 30199 30190 30173 30145 30109 30076 30052
3126.7 30052 30033 30010 29984 29960 29940 29920 29893 29860 29829 29803 29780 29759 29731 29693 29654 29619 29585 29551 29516 29481 29446 29411 29374 29332 29288 29247 29208 29167 29126 29086 29044 28998 28950 28898
3196.1 28898 28845 28797 28752 28706 28660 28613 28565 28518 28470 28421 28371 28319 28267 28216 28166 28118 28072 28026 27972 27913 27859 27812 27767 27722 27677 27630 27582 27539 27499 27456 27411 27368 27329
3263.4 27329 27292 27262 27235 27200 27152 27102 27055 27010 26965 26917 26868 26823 26781 26736 26682 26619 26553 26487 26426 26372 26310 26228 26132 26036 25946 25859 25769 25677 25585 25490 25385
$$ packed form
2749.4C1407ponpUoUpToprj1Tqolpj2j1rj1j6Tj5j4Tj5j8k1j8j7j8k2k3Tk4Tk5k7l0
2837.1C0845l6m4m7m5m2l7k4rNJ2J4QJKTMNjj3j7j6Tj9k1k3Tk4k1Tk5Tk2k3k5k6k4
2910.6C0229k6l3l4k9j5KJ8L2M4M3M0M3M2L8L6L3K5J3J1J3J2PRJ2J3J1RPQJ2J5J9K6
2977.9C0685L4K9J9J6J4J6J1Kmqj5Tj3j2qlTj1j8Tj7j2Tj4j3qmqj6j1lnj4j7j0nTp
3055.4C0517pqokKkj2j3mJKoj2j3j4j7j6k0k1j5j0j4k1k0j3j2j8j7j0rj7k8l6l3k4
3126.7C0052j9k3k6k4k0Tk7l3l1k6k3k1k8l8l9l5l4Tl5Vl7m2m4m1l9m1Tm0m2m6m8n2
3196.1B8898n3m8m5m6Tm7m8m7m8m9n0n2Tn1n0m8m6Tn4n9n4m7m5Um7m8m3m0m3m5m3l9
3263.4B7329l7l0k7l5m8n0m7m5Tm8m9m5m2m5n4o3o6To1n4o2q2r6Tr0q7r0r2Tr5j05
$$ plain form
3326.6 25385 25272 25159 25049 24941 24835 24722 24596 24464 24330 24198 24074 23942 23791 23638 23494 23356 23212 23067 22933 22805 22668
3369.5 22668 22515 22363 22228 22106 21989 21872 21760 21659 21578 21511 21439 21349 21264 21202 21149 21079 20992 20916 20855 20798 20742 20686 20634 20591 20551 20518 20495
3424.5 20495 20483 20479 20475 20473 20479 20483 20479 20479 20495 20521 20552 20591 20635 20680 20728 20785 20849 20909 20971 21046 21127 21195 21247 21299 21367 21450 21528 21591 21659 21739 21817 21890 21968 22050
3493.9 22050 22135 22221 22304 22379 22448 22519 22597 22686 22783 22872 22951 23035 23129 23226 23313 23391 23476 23575 23680 23784 23883 23980 24085 24193 24290 24381 24478 24577
3551 24577 24677 24785 24899 25014 25131 25236 25315 25406 25540 25681 25805 25926 26053 26185 26327 26463 26566 26660 26793 26935 27055 27177
3595.8 27177 27310 27436 27560 27682 27780 27860 27946 28028 28099 28144 28168 28255 28428 28614 28748 28845 28989 29150 29283 29396 29493 29585 29678 29752
3644.8 29752 29773 29775 29850 29969 30058 30145 30253 30345 30419 30490 30533 30551 30605 30656 30664 30710 30788 30849 30897 30920 30896 30852 30852 30892 30941 30987 31029 31089 31190 31297
3706 31297 31373 31413 31463 31557 31646 31703 31735 31756 31770 31794 31836 31864 31851 31818 31824 31886 31934 31906 31854 31874 31880 31841 31858 31914 31937 31933 31947 31966 31967 31960 31946 31950 31978 31973
$$ packed form
3326.6B5385j13Tj10j08j06j13j26j32j34j32j24j32j51j53j44j38j44j45j34j28j37
3369.5B2668j53j52j35j22j17Tj12j01q1o7p2r0q5o2n3p0q7p6o1n7n6Tn2m3m0l3k3
3424.5B0495j2mTkOMm%J6K6L1L9M4M5M8N7O4O0O2P5Q1O8N2TO8Q3P8O3O8Q0P8P3P8Q2
3493.9B2050Q5Q6Q3P5O9P1P8Q9R7Q9P9Q4R4R7Q7P8Q5R9J05J04R9R7J05J08R7R1R7R9
3551B4577J00J08J14J15J17J05P9R1J34J41J24J21J27J32J42J36J03R4J33J42J20J22
3595.8B7177J33J26J24J22R8Q0Q6Q2P1M5K4Q7J73J86J34R7J44J61J33J13R7R2R3P4
3644.8B9752K1KP5J19Q9Q7J08R2P4P1M3J8N4N1QM6P8O1M8K3k4m4%M0M9M6M2O0J01J07
3706C1297P6M0N0R4Q9N7L2K1J4K4M2K8j3l3OO2M8k8n2K0Ol9J7N6K3mJ4J9Jpj4MK8n
$$ plain form
3775.3 31973 31994 31977 31976 31976 31974 31982 31993 31990 31997 31984 31976 31948 31920 31935 31936 31932 31967 32000 31985 31952 31939 31908 31896 31930 31955 31966 31969 31970 31970 31943 31903 31895 31909 31935 31973 31938 31965
3850.8 31965 31851 31813 31882 31938 31947 31927 31919 31922 31901 31885 31896 31920 31938 31926 31919 31924 31918 31928 31933 31919 31933 31958 31951 31918 31887 31875 31895 31930 31952 31962 31959 31939 31923 31928
3920.1 31928 31936 31936 31941 31950 31945 31937 31943 31953 31958 31955 31949 31951 31953 31947 31948 31958 31966 31969 31969 31966 31967 31973 31975 31975 31974 31973 31972 31975 31980 31983 31988 31993 31991 31987 31988 31993 31998 32000
3997.6 32000
$$ packed form
3775.3C1973K1j7j%kQJ1lPj3qk8TJ5JmL5L3j5l3j3l1j2L4K5J1LJ%k7m0qJ4K6L8l5K7
3850.8C1965j14l8O9N6Rk0qLk1j6J1K4J8j2pNoJ0Nj4J4K5pl3l1j2K0L5K2J0lk0j6N
3920.1C1928Q%NRnqOJ0NloKToJJ0QL%lJOK%jULNLNTkmJNTK
3997.6C2000
##END=$$ End of the data block
