##TITLE=Turfa - pH 2.5 $$ Begin of the data block
##JCAMP-DX=5.00 $$ ACD/DocManager Library v 5.00
##DATE=03 May 2017 08:39:08
##DATA TYPE=INFRARED SPECTRUM
##DATA CLASS=XYDATA
##ORIGIN=Marcelo Quint
##OWNER=
##NPOINTS=1765
##FIRSTX=399.77209473
##LASTX=3997.72216797
##MAXX=3997.72216797
##MINX=399.77209473
##MAXY=0.69504941
##MINY=0.38563204
##XFACTOR=1.0000000000
##YFACTOR=0.0000217203
##FIRSTY=0.59700280
##DELTAX=2.03965425
##XUNITS=1/CM
##YUNITS=ARBITRARY UNITS
##XYDATA=(X++(Y..Y))
399.8B7486J88M3j18j96k28k24j97k13k55k04j26j01p9q2p2k9j4k5k9o4j10j27j58
$$ 27486 27674 27717 27599 27403 27175 26951 26754 26541 26286 26082 25956 25855 25776 25694 25622 25593 25579 25554 25525 25461 25351 25224 25066
446.7B5066j92k04k38k73k86k89k80k77k80k63j86p9K9J50K55L30L96M42M38L98L48
$$ 25066 24874 24670 24432 24159 23873 23584 23304 23027 22747 22484 22298 22219 22248 22398 22653 22983 23379 23821 24259 24657 25005
489.5B5005K73J95J27N9Nj7l6n5To4p7p3p9r5q0p2q5q0o7Tm5kK8O7J15J41J61J75J62
$$ 25005 25278 25473 25600 25659 25664 25647 25611 25556 25501 25437 25360 25287 25208 25113 25033 24961 24876 24796 24729 24662 24617 24615 24643 24710 24825 24966 25127 25302 25464
548.7B5464J48J49J33J18J25J27J29J42J44J37J45J46J29J32J34J18J24J31J17J13
$$ 25464 25612 25761 25894 26012 26137 26264 26393 26535 26679 26816 26961 27107 27236 27368 27502 27620 27744 27875 27992 28105
589.5B8105J22J16J10J13J00Q7R2Q8Q0Q7Q1O1N7N4M5M3L2J3K5N0N5TO0N1M5TL1L0M9
$$ 28105 28227 28343 28453 28566 28666 28753 28845 28933 29013 29100 29181 29242 29299 29353 29398 29441 29473 29486 29511 29561 29616 29671 29731 29782 29827 29872 29903 29933 29982
648.6B9982N3M7N3M4K7L2K9Jl6k1K4K1Mj2k2k0l3m4m6n9o7l3L3J03J43J34R5P5O9M9
$$ 29982 30035 30082 30135 30179 30206 30238 30267 30268 30232 30211 30235 30256 30260 30248 30226 30206 30173 30129 30083 30024 29957 29924 29957 30060 30203 30337 30432 30507 30576 30625
709.8C0625L3K5Mj4Tk0k5k0k5m0m2n6p8p9Tq5p0m8m2l3j4TrOKlKj3m8o8r3j13q2j3
$$ 30625 30658 30683 30687 30673 30659 30639 30614 30594 30569 30529 30487 30431 30353 30274 30195 30110 30040 29992 29950 29917 29903 29889 29880 29886 29888 29885 29887 29874 29826 29758 29665 29552 29470 29457
779.1B9457L9N8L2k4n7p5j04j01l6N3J51K32K43K08J73J36R6Q1O8M6M4M5K9K3K8J7
$$ 29457 29496 29554 29586 29562 29505 29430 29326 29225 29189 29242 29393 29625 29868 30076 30249 30385 30481 30562 30630 30676 30720 30765 30794 30817 30845 30862
832.2C0862J2J8QLOj0l1l0l8n2n3o3q1Tq2r5r3Tj09j16j05r7p9n6m8m6m4n9p5q0r6
$$ 30862 30874 30892 30900 30903 30909 30899 30868 30838 30800 30748 30695 30632 30551 30470 30388 30293 30200 30107 29998 29882 29777 29680 29601 29545 29497 29451 29407 29348 29273 29193 29097
895.4B9097j16j23j34j54j59j56j46j04m9j4OJ5Kj3k2l7n2n6o2o3n0m1l9l7m1n8p2
$$ 29097 28981 28858 28724 28570 28411 28255 28109 28005 27956 27942 27948 27963 27965 27952 27930 27893 27841 27785 27723 27660 27610 27569 27530 27493 27452 27394 27322
950.5B7322q6j07j20j31j48j61j72j86k01k09k22k39k51k60k70k77k83k91k94k97l07
$$ 27322 27236 27129 27009 26878 26730 26569 26397 26211 26010 25801 25579 25340 25089 24829 24559 24282 23999 23708 23414 23117 22810
993.3B2810l17l23l27l22l01k65k18j66j28j12j14j26j43j59j76j85j80j57j25q4m2
$$ 22810 22493 22170 21843 21521 21220 20955 20737 20571 20443 20331 20217 20091 19948 19789 19613 19428 19248 19091 18966 18882 18840
1036.1A8840rJ6L3M7N6O9Q9J08J25J33J35J32J29J23J13J03Q3N9L7K1OLRK0L9O5Q8
$$ 18840 18831 18847 18880 18927 18983 19052 19141 19249 19374 19507 19642 19774 19903 20026 20139 20242 20325 20384 20421 20442 20448 20451 20460 20480 20519 20584 20672
1091.2B0672J07J22J32J38J44J49J50J54J48J40J41J52J69J82J91J84J74J66J67J69
$$ 20672 20779 20901 21033 21171 21315 21464 21614 21768 21916 22056 22197 22349 22518 22700 22891 23075 23249 23415 23582 23751
1132B3751J61J44J26J15J05R5Q9Q2TQ8TP4M7J6KK0N1O8P8Q6Q4Q0TP8P9Q2P8P3P2P3
$$ 23751 23912 24056 24182 24297 24402 24497 24586 24668 24750 24838 24926 25000 25047 25063 25065 25085 25136 25204 25282 25368 25452 25532 25612 25690 25769 25851 25929 26002 26074 26147
1193.2B6147O8O9P1O9P2P8TQ0Q4Q3Q0Q2Q0P6TP4P2P3P1O5O4O6O0N7O0N6N2N4N0M6TM3
$$ 26147 26215 26284 26355 26424 26496 26574 26652 26732 26816 26899 26979 27061 27141 27217 27293 27367 27439 27512 27583 27648 27712 27778 27838 27895 27955 28011 28063 28117 28167 28213 28259 28302
1258.5B8302L7L8L7L2L6M2M3M8M9M4M0M2L6L3L6L3K7K6TK1K2J9J4UPQJ1QJ2K2K0J6
$$ 28302 28339 28377 28414 28446 28482 28524 28567 28615 28664 28708 28748 28790 28826 28859 28895 28928 28955 28981 29007 29028 29050 29069 29083 29097 29111 29118 29126 29137 29145 29157 29179 29199 29215
1325.8B9215J9J6J1J0JnJ1K9K4J5J0QPQMjj3j5j%j7k8l2k1OJ3qk3NN5P0L7pk5j1J0
$$ 29215 29234 29250 29261 29271 29272 29267 29278 29307 29331 29346 29356 29364 29371 29379 29383 29382 29369 29354 29353 29353 29336 29308 29276 29255 29261 29274 29266 29243 29248 29303 29373 29410 29403 29378 29367 29377
1399.2B9377J8J0QJ5Qjrk5m3k7KJmj2j9rj2j9J5L9K6J1JNK2K3%qO7J11P8O0P7O9L0
$$ 29377 29395 29405 29413 29428 29436 29435 29426 29401 29358 29331 29333 29334 29330 29318 29299 29290 29278 29259 29274 29313 29339 29350 29351 29356 29378 29401 29401 29393 29460 29571 29649 29709 29786 29855 29885
1470.6B9885K0N0O7N3L2K2Qj6j4K9M1Oj0J8K7no6n9M3N3J0k5k9Tl1mKlpl7n0l1o4j17
$$ 29885 29905 29955 30022 30075 30107 30129 30137 30121 30107 30136 30177 30183 30173 30191 30218 30213 30147 30088 30131 30184 30194 30169 30140 30111 30080 30076 30078 30075 30068 30031 29981 29950 29886 29769
1539.9B9769n6QKk7n3o3p4j02j37n6J7k4o6q6p5n3p9r8n6m4o7q2q5q8r3r4r2q7q9r2
$$ 29769 29713 29721 29723 29696 29643 29580 29506 29404 29267 29211 29228 29204 29138 29052 28977 28924 28845 28747 28691 28647 28580 28498 28413 28325 28232 28138 28046 27959 27870 27778
1601.1B7778r2Tr0q5q1q2r7p4j4oqJ1K5L6M2TQ9J55J57J36J13J27J87J63J46K56TJ90
$$ 27778 27686 27594 27504 27419 27338 27256 27159 27085 27071 27065 27057 27068 27093 27129 27171 27213 27302 27457 27614 27750 27863 27990 28177 28340 28486 28742 28998 29188
1658.2B9188J59J61J67J31J00J17J19J02J05Q7M4RM9J03P8N4K9pj2J3N8P6O0O5O7M8
$$ 29188 29347 29508 29675 29806 29906 30023 30142 30244 30349 30436 30480 30489 30538 30641 30719 30773 30802 30795 30783 30796 30854 30930 30990 31055 31122 31170
1711.3C1170J9lL0R7R2O1M9L5J6LJ3O2O1L6L3TJ9KJ2M4M0J3QLNJ9Mk1k6oL1L3J1nK
$$ 31170 31189 31186 31216 31313 31405 31466 31515 31550 31566 31569 31582 31644 31705 31741 31774 31807 31826 31828 31840 31884 31924 31937 31945 31948 31953 31972 31976 31955 31929 31923 31954 31987 31998 31993 31995
1782.7C1995N%j5l4k1J0Rj4j3NOj1j7j3mTqj2j7k4k6k1j5KOmj2j6k9l7j3RKj3j7j8
$$ 31995 32000 32000 31985 31951 31930 31940 31949 31935 31922 31927 31933 31922 31905 31892 31888 31884 31876 31864 31847 31823 31797 31776 31761 31763 31769 31765 31753 31737 31708 31671 31658 31667 31669 31656 31639 31621
1856.1C1621k2k1j7k4l9l6pQJj0j4Tj5j7Tj9j4mqj1pnj1j3Upnj5k2j1prkTj0j1j0j2
$$ 31621 31599 31578 31561 31537 31498 31462 31455 31463 31464 31454 31440 31426 31411 31394 31377 31358 31344 31340 31332 31321 31314 31309 31298 31285 31272 31259 31252 31247 31232 31210 31199 31192 31183 31181 31179 31169 31158 31148 31136
1935.6C1136j3j8k2j3jnj0Tj2j3j1j3j5Tj6j2rqj2Uj3j2j1j5j6Tj2opj1j3j2j0j2j1
$$ 31136 31123 31105 31083 31070 31069 31064 31054 31044 31032 31019 31008 30995 30980 30965 30949 30937 30928 30920 30908 30896 30884 30871 30859 30848 30833 30817 30801 30789 30783 30776 30765 30752 30740 30730 30718 30707
2009.1C0707j0Tj3j4j3j7k6TlJ2MmnTpTonqrpToTpqToTqTpUoTmoTmkopnoTmopnpTm
$$ 30707 30697 30687 30674 30660 30647 30630 30604 30578 30575 30587 30591 30587 30582 30577 30570 30563 30557 30552 30544 30535 30528 30521 30515 30509 30502 30494 30486 30480 30474 30466 30458 30451 30444 30437 30431 30425 30421 30415 30409 30405 30403 30397 30390 30385 30379 30373 30369 30363 30356 30351 30344 30337 30333
2117.2C0333pqnmqpopomponpnmqonopnoj0rqlkmponrpnpToTqpTroprqprqpqonprpq
$$ 30333 30326 30318 30313 30309 30301 30294 30288 30281 30275 30271 30264 30258 30253 30246 30241 30237 30229 30223 30218 30212 30205 30200 30194 30184 30175 30167 30164 30162 30158 30151 30145 30140 30131 30124 30119 30112 30105 30099 30093 30085 30078 30071 30062 30056 30049 30040 30032 30025 30016 30008 30001 29993 29987 29982 29975 29966 29959 29951
2235.5B9951qpoqpqrqrj0qpj0roqVj0pqTrj0j2Uj3j2j4j7Uk1k4k2j9Tk3k9l0k4k1k4
$$ 29951 29943 29936 29930 29922 29915 29907 29898 29890 29881 29871 29863 29856 29846 29837 29831 29823 29815 29807 29799 29789 29782 29774 29766 29757 29747 29735 29723 29711 29698 29686 29672 29655 29638 29621 29600 29576 29554 29535 29516 29493 29464 29434 29410 29389 29365
2327.2B9365k8k4k1j9j7j6j3%K4L2Ol4n4n0l6j9lNJ3K2K7K9TL0K7K4K0J1L%orqTrq
$$ 29365 29337 29313 29292 29273 29256 29240 29227 29227 29251 29283 29289 29255 29201 29151 29115 29096 29093 29098 29111 29133 29160 29189 29218 29248 29275 29299 29319 29330 29333 29333 29327 29318 29310 29302 29293 29285
2400.7B9285rj1rqTrj0rqpqrj0rTpqTrTqj0j1j0qTrUqTrj0rqprqTj0qUrTj1rTpqj0
$$ 29285 29276 29265 29256 29248 29240 29231 29221 29212 29204 29197 29189 29180 29170 29161 29152 29145 29137 29129 29120 29111 29103 29093 29082 29072 29064 29056 29047 29038 29029 29021 29013 29004 28994 28985 28977 28970 28961 28953 28945 28935 28927 28919 28911 28902 28893 28882 28873 28864 28857 28849 28839
2504.7B8839j0qpqrTqTrUqTrTqTrUpqj0roqprj0rqUrqUrUqUrj0rUqprTqrWj0j1roq
$$ 28839 28829 28821 28814 28806 28797 28788 28780 28772 28763 28754 28745 28737 28729 28720 28711 28703 28695 28686 28677 28668 28661 28653 28643 28634 28628 28620 28613 28604 28594 28585 28577 28569 28561 28552 28544 28536 28528 28519 28510 28501 28493 28485 28477 28468 28458 28449 28440 28431 28423 28416 28407 28398 28390 28381 28372 28363 28354 28345 28335 28324 28315 28309 28301
2633.2B8301rTqj1rTj0j1j0TqTrVj0rUqrqj1Tj0rTj1j0rj2Tj1j0rj1Tj2Tj0Uj1j0Tj1
$$ 28301 28292 28283 28275 28264 28255 28246 28236 28225 28215 28205 28197 28189 28180 28171 28162 28153 28143 28134 28125 28116 28108 28099 28091 28080 28069 28059 28050 28041 28030 28020 28011 27999 27987 27976 27966 27957 27946 27935 27923 27911 27901 27891 27881 27870 27860 27850 27839
2729B7839j0TqrTj0j1qTj0j4Tj0Tj2Tj1j3Uj1j0j2j4j5j4j5j2j1j3j5j6j5Tj7k0j9
$$ 27839 27829 27819 27811 27802 27793 27783 27772 27764 27756 27746 27732 27718 27708 27698 27686 27674 27663 27650 27637 27624 27613 27603 27591 27577 27562 27548 27533 27521 27510 27497 27482 27466 27451 27436 27419 27399 27380
2804.5B7380j9Tk0k2Uk3k4Uk5k7k8k9l0l1l5m2m3m1m0l6k7j4mJL%oqTompj7k0k1k2
$$ 27380 27361 27342 27322 27300 27278 27256 27233 27209 27185 27161 27136 27109 27081 27052 27022 26991 26956 26914 26871 26830 26790 26754 26727 26713 26709 26710 26713 26713 26707 26699 26691 26685 26681 26674 26657 26637 26616 26594
2882B6594k5k7k8k7k5k3k5k7Tk4Tk5k6Tk7l1l5l2k2rPK1L1L3L1UL0K7K4J5O%KTlmk
$$ 26594 26569 26542 26514 26487 26462 26439 26414 26387 26360 26336 26312 26287 26261 26235 26208 26177 26142 26110 26088 26079 26086 26107 26138 26171 26202 26233 26264 26294 26321 26345 26360 26366 26366 26368 26370 26367 26363 26361
2959.5B6361lqj4j8j7j3%J3K8L8TL1K4J9J7J1Mmrj5j6j5j2j0prj5j9Uj7j5j6Tj2rj1
$$ 26361 26358 26350 26336 26318 26301 26288 26288 26301 26329 26367 26405 26436 26460 26479 26496 26507 26511 26507 26498 26483 26467 26452 26440 26430 26423 26414 26399 26380 26361 26342 26325 26310 26294 26278 26266 26257 26246
3035B6246j6j3pj0j6j8j5j1j2TrTpomnj2j5j2okqj5j6j5j6j5j9k2j9j3j4k1Tj6j5j9
$$ 26246 26230 26217 26210 26200 26184 26166 26151 26140 26128 26116 26107 26098 26091 26085 26081 26076 26064 26049 26037 26031 26029 26021 26006 25990 25975 25959 25944 25925 25903 25884 25871 25857 25836 25815 25799 25784 25765
3110.4B5765j9j3Tj8k6l2l0k4k0k2k5k4k0Tk6l1l0k6k2j9k6l5l6l2l0l1l2Tl4l5l4
$$ 25765 25746 25733 25720 25702 25676 25644 25614 25590 25570 25548 25523 25499 25479 25459 25433 25402 25372 25346 25324 25305 25279 25244 25208 25176 25146 25115 25083 25051 25017 24982 24948
3173.7B4948l3l4l6l7Vl6l9m2m3m4m0Tl9Tm2m3m1l9m1m2m4m5m6m4m1l8Tm5m8m7m3m2
$$ 24948 24915 24881 24845 24808 24771 24734 24697 24661 24622 24580 24537 24493 24453 24413 24374 24335 24293 24250 24209 24170 24129 24087 24043 23998 23952 23908 23867 23829 23791 23746 23698 23651 23608 23566
3243B3566l8l6l9m2l9l3l6m0l6l3Tl0k6l0l9m1Tm3m1l8m0m2l9l8m3n1n9Tn1m4n2o6
$$ 23566 23528 23492 23453 23411 23372 23339 23303 23263 23227 23194 23161 23131 23105 23075 23036 22995 22954 22911 22870 22832 22792 22750 22711 22673 22630 22579 22520 22461 22410 22366 22314 22248
3308.3B2248p7Tp4p2Tp3Tp6q2r0r1q9q5q4r0r9j03j04j03r7j04j17j21j13j07j09j12
$$ 22248 22171 22094 22020 21948 21876 21803 21730 21654 21572 21482 21391 21302 21217 21133 21043 20944 20841 20737 20634 20537 20433 20316 20195 20082 19975 19866 19754
3363.3A9754j05r9j07j18j16j03r6r2r1q5p7o4n1n4o7o6n0m3n5o6n7m5m2m0m2Tl6k9
$$ 19754 19649 19550 19443 19325 19209 19106 19010 18918 18827 18742 18665 18601 18550 18496 18429 18363 18313 18270 18215 18149 18092 18047 18005 17965 17923 17881 17845 17816
3420.4A7816k5j8j0mlkPNmTRJ9K5K9L3L6L8M1M5M4M7N8O2M9L7L9N1N9N8M9N0N6N5TN9
$$ 17816 17791 17773 17763 17759 17756 17754 17761 17766 17762 17758 17767 17786 17811 17840 17873 17909 17947 17988 18033 18077 18124 18182 18244 18293 18330 18369 18420 18479 18537 18586 18636 18692 18747 18802 18861
3491.8A8861O1O2O0N6N8N7N3N6O5P0O8N9N7O2O7O6O1O5P1P4P5P3O8P0P3P0O9TP0P4
$$ 18861 18922 18984 19044 19100 19158 19215 19268 19324 19389 19459 19527 19586 19643 19705 19772 19838 19899 19964 20035 20109 20184 20257 20325 20395 20468 20538 20607 20676 20746 20820
3553B0820Q0P8P5P2O0N3Q0J10J03Q5Q0Q4R0R2Q0O4P0R2Q9P8Q0Q5Q3Q0P0N2M6M9L9J7
$$ 20820 20900 20978 21053 21125 21185 21238 21318 21428 21531 21616 21696 21780 21870 21962 22042 22106 22176 22268 22357 22435 22515 22600 22683 22763 22833 22885 22931 22980 23019 23036
3614.2B3036pjO8J28J22Q7R2J33J25R8Q1O8N7M3J5j1J4P9Q5O8P9Q7O9M7L0J0J1L8L2
$$ 23036 23029 23028 23096 23224 23346 23433 23525 23658 23783 23881 23962 24030 24087 24130 24145 24134 24148 24227 24312 24380 24459 24546 24615 24662 24692 24702 24713 24751 24783
3673.3B4783K7N8N9L5J1j8m2l7kK1K4K3L3O1Q5P6N1M3P0Q8O6L4J6RJ1J8J7ol0j8K4
$$ 24783 24810 24868 24927 24962 24973 24955 24913 24876 24874 24895 24919 24942 24975 25036 25121 25197 25248 25291 25361 25449 25515 25549 25565 25574 25585 25603 25620 25614 25584 25566 25590
3736.6B5590L8Pl3l1KpnL4L7QjJ2Qj0j5pJ0J6Jj4j0kolMJpj8k6k5k6j7NMRJ8Jk8l5
$$ 25590 25628 25635 25602 25571 25573 25566 25561 25595 25632 25640 25639 25651 25659 25649 25634 25627 25637 25653 25654 25640 25630 25628 25622 25619 25623 25624 25617 25599 25573 25548 25522 25505 25510 25514 25523 25541 25542 25514 25479
3816.1B5479k3j9PK4Rnj2j8j9k5k0LJ9K1J0j9n9o4J2N0K1j3k6j3pj3kJ2J4Jj9j5lk
$$ 25479 25456 25437 25444 25468 25477 25472 25460 25442 25423 25398 25378 25381 25400 25421 25431 25412 25353 25289 25301 25351 25372 25359 25333 25320 25313 25300 25298 25310 25324 25325 25306 25291 25288 25286
3885.5B5286Mmj1LKk2l4k5jK4K7J1lj5k0j0%lpmoj2jJ1Mqj4j1lTpkJkmopomlmUnTl
$$ 25286 25290 25286 25275 25278 25280 25258 25224 25199 25198 25222 25249 25260 25257 25242 25222 25212 25212 25209 25202 25198 25192 25180 25179 25190 25194 25186 25172 25161 25158 25155 25148 25146 25147 25145 25141 25135 25128 25122 25118 25115 25111 25107 25103 25098 25093 25090
3979.3B5090jknqromkT
$$ 25090 25089 25087 25082 25074 25065 25059 25055 25053 25051
3997.6B5051
$$ 25051
##END=$$ End of the data block
