##TITLE=$$ Begin of the data block
##JCAMP-DX=5.00 $$ ACD/SpecManager v 10.08
##SPECTROMETER/DATA SYSTEM=Alpha
##DATE=10 Nov 2014 10:35:34
##DATA TYPE=INFRARED SPECTRUM
##DATA CLASS=XYDATA
##ORIGIN=
##OWNER=
##NPOINTS=1765
##FIRSTX=399.76428223
##LASTX=3997.64306641
##MAXX=3997.64306641
##MINX=399.76428223
##MAXY=0.76390123
##MINY=0.40935588
##XFACTOR=1.0000000000
##YFACTOR=1.000000000000000e-9
##FIRSTY=0.60996538
##DELTAX=2.03961372
##XUNITS=1/CM
##YUNITS=ARBITRARY UNITS
##XYDATA=(X++(Y..Y))
$$ plain form
399.8 609965384 606425345 604348838 606675565 605887711 602799058 603775859 603767931 600209773 600270092
418.1 600270092 602384567 599606276 598308265 599654496 597468257 595390856 598098993 598974288 596623182
436.5 596623182 597740412 599087775 596312940 595896006 598082781 596012354 593649209 595496714 595340073
454.8 595340073 592544496 593487918 593996823 590472519 589562535 591477871 589844942 587983549 589973092
473.2 589973092 589536667 586619318 587685823 589255929 586787939 586146295 588024497 586294532 584299684
491.5 584299684 586139679 585740387 582630932 583130181 584043384 580931008 579782724 581433892 579459369
509.9 579459369 576609254 577542126 577010393 573474526 573340297 574564338 572329760 571328342 573448002
528.3 573448002 572696865 570532441 571956933 572909474 570989549 571979463 575044632 574622810 574203014
$$ packed form
399.8F09965384l540039k076507K326727p87854l088653R76801p928l558158O0319
418.1F00270092K114475k778291j298011J346231k186239k077401K708137Q75295k351106
436.5E96623182J117230J347363k774835m16934K186775k070427k363145J847505j56641
454.8E95340073k795577R43422N08905l524304r09984J915336j632929j861393J989543
473.2E89973092m36425k917349J066505J570106k467990o41644J878202j729965j994848
491.5E84299684J839995l99292l109455M99249R13203l112376j148284J651168j974523
509.9E79459369k850115R32872n31733l535867j34229J224041k234578j001418K119660
528.3E73448002p51137k164424J424492R52541j919925R89914L065169m21822m19796
$$ plain form
546.6 574203014 576767027 576928496 574835181 575805843 576997936 575051069 574913204 577027619 576025844
565 576025844 574411154 575984180 576017022 573514581 573977292 575716972 574344397 573838234 576193571
583.3 576193571 576333940 574970186 576464593 577502310 575595200 575647652 577525318 576526701 575425208
601.7 575425208 577319503 577589333 575644076 576463401 578011692 576526403 576020002 578092456 578051925
620 578051925 577224672 579719245 581807077 581055403 582144022 584703267 584302127 583939850 586642087
638.4 586642087 587848127 586932421 588667035 591076076 590584397 591197371 594091952 594413161 593441546
656.8 593441546 595161557 596148431 594552934 594502330 595767617 595012188 595954597 599410832 600883186
675.1 600883186 600401580 602431715 604938686 604460001 604840159 607395411 607615292 606660545 608251333
$$ packed form
546.6E74203014K564013J61469k093315R70662J192093j946867j37865K114415j001775
565E76025844j614690J573026L2842k502441M62711J739680j372575n06163K355337
583.3E76193571J40369j363754J494407J037717j907110N2452J877666r98617j101493
601.7E75425208J894295K69830j945257Q19325J548291j485289n06401K072454m0531
620E78051925q27253K494573K087832p51674J088619K559245m01140l62277K702237
638.4E86642087J206040r15706J734614K409041m91679O12974K894581L21209r71615
656.8E93441546J720011R86874j595497n0604J265287p55429R42409L456235J472354
675.1F00883186m81606K030135K506971m78685L80158K555252K19881r54747J590788
$$ plain form
693.5 608251333 609157979 607601225 608078837 610285759 610147834 610211730 613069355 614624023 614319980
711.8 614319980 616454780 619352758 619688392 620945394 624632418 626420736 627085030 630274653 633055389
730.2 633055389 633141100 634498060 637230933 637424350 637303889 639733195 640981674 640194118 641492963
748.5 641492963 643440902 642686129 642381787 644097328 643980503 642715275 643836141 644739449 643255472
766.9 643255472 643131495 644592941 643813550 642576993 643964410 645122468 645116925 647710025 651909947
785.3 651909947 654153049 656664312 660984337 663385153 663976192 666385412 668668628 668274879 668442428
803.6 668442428 669925392 669100642 667256832 667553663 667481124 665801108 666052222 667770028 667590499
822 667590499 667353630 669036746 669696629 669167995 670775771 673183680 673910320 675497234 678633273
$$ packed form
693.5F08251333R06646j556754M77612K206922j37925O3896K857625J554668l04043
711.8F14319980K134800K897978L35634J257002L687024J788318O64294L189623K780736
730.2F33055389Q5711J356960K732873J93417j20461K429306J248479p87556J298845
748.5F41492963J947939p54773l04342J715541j16825j265228J120866R03308j483977
766.9F43255472j23977J461446p79391j236557J387417J158058n543K593100M199922
785.3F51909947K243102K511263M320025K400816N91039K409220K283216l93749J67549
803.6F68442428J482964q24750j843810K96831p2539j680016K51114J717806j79529
822F67590499k36869J683116O59883n28634J607776K407909P26640J586914L136039
$$ plain form
840.3 678633273 679706693 679360509 680570662 681051672 679170966 678277314 678626716 677309930 675938725
858.7 675938725 676666975 676850259 675862014 676795304 678640664 678664804 679098964 681288779 682039678 681323230
879.1 681323230 681823611 681735516 679274976 677332759 676512420 674125433 671465397 670939565 670256793
897.4 670256793 668251336 667557240 667551994 665516973 663052619 661728323 659110069 655169189 652784705
915.8 652784705 651035666 648112893 646365821 646720648 646430314 645662665 646453619 646914482 645404398
934.1 645404398 644238949 643623710 641113639 637873828 635845661 633034468 628834188 625851333 623565435
952.5 623565435 619765460 616068363 613712132 610361874 605981052 602911651 599871278 594904840
968.8 594904840 589867949 585444152 579513550 572810948 567457497 562064648 555624187 550440073
$$ packed form
840.3F78633273J073420l46184J210153M81010j880706q93652L49402j316786j371205
858.7F75938725P28250J83284r88245R33290J845360K4140M34160K189815P50899p16448
879.1F81323230N00381q8095k460540j942217q20339k386987k660036n25832o82772
897.4F70256793k005457o94096n246k035021k464354j324296k618254l940880k384484
915.8F52784705j749039k922773j747072L54827k90334p67649P90954M60863j510084
934.1F45404398j165449o15239k510071l239811k028167k811193m200280k982855k285898
952.5F23565435l799975l697097k356231l350258m380822l069401l040373m966438
968.8E94904840n036891m423797n930602o702602n353451n392849o440461n184114
$$ plain form
985.1 550440073 546852469 542851985 539272547 537511766 535706758 533000886 531240940 529963315
1001.4 529963315 527298272 524492919 522724807 520285189 517163455 515440822 514360249 512372315
1017.8 512372315 510985434 510819077 509946406 508690774 508810759 509119153 508451939 508516967 509452283
1036.1 509452283 509165645 508175611 507927179 507005095 504866540 503659129 503394186 502419233 501919687
1054.5 501919687 503088892 504105091 504543006 506186962 508204758 508778393 509143591 510046899 509716392
1072.8 509716392 508681595 509385467 511130273 512539864 515115798 519021213 521845996 523743868
1089.2 523743868 526249826 527814686 527444601 527348280 527824402 527097404 526447356 527670205 529076278
1107.5 529076278 529946089 532280147 535528004 537616134 539766669 542995393 545113206 545991838 547945678
$$ packed form
985.1E50440073l587604m000484l579438j760781j805008k705872j759946j277625
1001.4E29963315k665043k805353j768112k439618l121734j722633j080573j987934
1017.8E12372315j386881j66357q72671j255632J19985L08394o67214O5028R35316
1036.1E09452283k86638r90034k48432r22084k138555j207411k64943r74953m99546
1054.5E01919687J169205J016199M37915J643956K017796N73635L65198R03308l30507
1072.8E09716392j034797P03872J744806J409591K575934L905415K824783J897872
1089.2E23743868K505958J564860l70085r6321M76122p26998o50048J222849J406073
1107.5E29076278Q69811K334058L247857K088130K150535L228724K117813Q78632J953840
$$ plain form
1125.9 547945678 550140083 550961792 552178383 554297209 554885685 554310083 554727912 554924190 553830624
1144.2 553830624 553810120 555303097 555983603 556584477 558995724 561458945 562992573 566063404 570694566
1162.6 570694566 574665546 579281151 586065233 592472076 597643793 604085505 610902905 615586638
1178.9 615586638 619988143 625428438 629224002 631418884 634689987 637520909 637864947 638165772 639184594
1197.3 639184594 638233364 636361122 636324286 636231482 634633243 634213686 634891272 633731008 631971657
1215.6 631971657 631644785 630414665 627512515 625796318 624788642 622094095 619576514 618889987 617556334
1234 617556334 615291297 614738107 614840448 613503516 612846792 613871276 613858461 613018274 613815904 614705265
1254.4 614705265 613906145 613866508 615298271 615587413 615535200 617355049 618984520 619069636 620194912
$$ packed form
1125.9E47945678K194405Q21709J216591K118826N88476n75602M17829J96278j093566
1144.2E53830624k0504J492977O80506O00874K411247K463221J533628L070831M631162
1162.6E70694566L970980M615605O784082O406843N171717O441712O817400M683733
1178.9F15586638M401505N440295L795564K194882L271103K830922L44038L00825J018822
1197.3F39184594r51230j872242l6836r2804j598239m19557O77586j160264j759351
1215.6F31971657l26872j230120k902150j716197j007676k694547k517581o86527j333653
1234F17556334k265037n53190J02341j336932o56724J024484j2815q40187P97630Q89361
1254.4F14705265p99120l9637J431763K89142n2213J819849J629471Q5116J125276
$$ plain form
1272.7 620194912 622265279 622576416 622390568 623700023 624324977 623528838 623995304 625089586 624272704
1291.1 624272704 623260438 623592794 622766972 620565474 619679809 619056106 616578460 614334285 613432467
1309.4 613432467 611385286 608543158 607467532 606737733 604627550 603434801 603600144 602489710 600766480
1327.8 600766480 600581646 600189745 598368824 597580433 598040342 597301841 596549809 597543240 598042965
1346.2 598042965 597140074 597211540 597838700 596827805 595753133 596111774 595612228 593679786 592867315
1364.5 592867315 592362642 590254724 588510692 588122368 586501122 583679855 581116974 575967669 568208873
1382.9 568208873 565336764 570156515 575039089 576235890 576671958 576277554 574323535 573107839 572932065
1401.2 572932065 571788788 570491374 570802629 571013451 570191681 570453346 571791649 572130024 572353244
$$ packed form
1272.7F20194912K070367L11137j85848J309455O24954p96139M66466J094282q16882
1291.1F24272704j012266L32356q25822k201498q85665o23703k477646k244175r01818
1309.4F13432467k047181k842128j075626p29799k110183j192749J65343j110434j723230
1327.8F00766480j84834l91901j820921p88391M59909p38501p52032R93431M99725
1346.2E98042965r02891P1466O27160j010895j074672L58641m99546j932442q12471
1364.5E92867315n04673k107918j744032l88324j621246k821267k562881n149305p758796
1382.9E68208873k872109M819751M882574J196801M36068l94404j954019j215696j75774
1401.2E72932065j143277j297414L11255K10822q21770K61665J338303L38375K23220
$$ plain form
1419.6 572353244 573955715 575087190 575528264 577237308 579613447 580546021 581200600 583108246 584410906
1437.9 584410906 584672928 586043894 587578893 587537766 587615609 588847458 589144826 588705480 590061605
1456.3 590061605 592521429 593542993 595220983 598393381 600957930 603229880 607609570 613726199
1472.6 613726199 618967175 624244690 629482269 632793903 635411620 638855219 641342759 641792893
1488.9 641792893 642443359 642985523 641471088 639064968 637630522 635430813 632250011 629585862 626712859
1507.3 626712859 623120487 620882392 619820356 617911398 615270615 614202440 613559723 611575902
1523.6 611575902 610072672 609106839 607037604 604437113 602852583 601627946 599490762 597069323
1539.9 597069323 595260680 592879951 590992272 590685248 590324700 589324117 589470088 590627909 590543866
$$ packed form
1419.6E72353244J602471J131475M41074J709044K376139R32574O54579J907646J302660
1437.9E84410906K62022J370966J534999m1127P7843J231849K97368m39346J356125
1456.3E90061605K459824J021564J677990L172398K564549K271950M379690O116629
1472.6F13726199N240976N277515N237579L311634K617717L443599K487540M50134
1488.9F41792893O50466N42164j514435k406120j434446k199709l180802k664149k873003
1507.3F26712859l592372k238095j062036j908958k640783j068175o42717j983821
1523.6F11575902j503230r65833k069235k600491j584530j224637k137184k421439
1539.9E97069323j808643k380729j887679l07024l60548j000583J45971J157821q4043
$$ plain form
1558.3 590543866 589972019 590382874 589930475 588664711 588295281 588313103 587088406 585765660 585201621
1576.6 585201621 583785951 581674993 580354333 578917801 576077878 573389053 571541548 568899333
1593 568899333 565811634 563951612 562230408 559516966 557326078 555963337 553726435 551061332 549438298
1611.3 549438298 547813416 545023263 542304993 540588498 538256228 535382450 533291399 530834079
1627.6 530834079 527768493 525952697 524981380 523045659 521507740 521354437 520999372 520200908 520226240
1646 520226240 520910919 520804167 520814538 522086143 522699475 523052633 524649262 527046859 528980851
1664.3 528980851 531063259 534292221 537643194 540244222 543906569 548214912 551398039 554633379
1680.7 554633379 559074104 564193070 568757474 573602319 578554690 582509816 587534130 594220161
$$ packed form
1558.3E90543866n71847M10855m52399j265764l69430J7822j224697j322746n64039
1576.6E85201621j415670k110958j320660j436532k839923k688825j847505k642215
1593E68899333l087699j860022j721204k713442k190888j362741k236902k665103j623034
1611.3E49438298j624882k790153k718270j716495k332270k873778k091051k457320
1627.6E30834079l065586j815796r71317j935721j537919j53303l55065p98464K5332
1646E20226240O84679j06752J0371J271605O13332L53158J596629K397597J933992
1664.3E28980851K082408L228962L350973K601028L662347M308343L183127L235340
1680.7E54633379M440725N118966M564404M844845M952371L955126N024314O686031
$$ plain form
1697 594220161 599742353 605177820 610399425 614342570 617574811 621043265 624391079 626359940 627752602
1715.3 627752602 630084097 631840765 632730901 634323180 636014044 636574984 637263715 638829887 639762759
1733.7 639762759 640242934 641776562 643551171 644839048 646957517 650246739 653259277 656462371
1750 656462371 661065996 665227890 668542266 672723353 677494168 681504905 685086787 689186633 692904234
1768.4 692904234 695502639 698658824 701985896 703808963 705502629 708115220 710095406 711171627
1784.7 711171627 713079035 715327382 716512859 717768013 719808042 721019626 721634746 723234653
1801 723234653 724978089 725672662 726701319 728460729 729368627 729841948 731325686 732737780 733210504
1819.4 733210504 734145999 735631466 736177623 736436546 737723589 738803267 739044428 739890754 741173506
$$ packed form
1697E94220161N522192N435467N221605L943145L232241L468454L347814J968861J392662
1715.3F27752602K331495J756668Q90136J592279J690864N60940O88731J566172R32872
1733.7F39762759M80175J533628J774609J287877K118469L289222L012538L203094
1750F56462371M603625M161894L314376M181087M770815M010737L581882M099846L717601
1768.4F92904234K598405L156185L327072J823067J693666K612591J980186J076221
1784.7G11171627J907408K248347J185477J255154K040029J211584O15120J599907
1801G23234653J743436O94573J028657J759410R07898M73321J483738J412094M72724
1819.4G33210504R35495J485467N46157K58923J287043J079678K41161Q46326J282752
$$ plain form
1837.7 741173506 741527498 741722047 742837071 743663788 743829191 744707942 745765150 745828152 746080637
1856.1 746080637 747238338 747828066 747833788 748666823 749605596 749494612 749735236 750803769 751136839 751054525
1876.5 751054525 751841724 752506614 752254784 752562106 753585875 753775477 753687441 754504919 754977822 754653275
1896.9 754653275 755079389 756007433 756021976 755976379 756774783 757079065 756700695 757175386 757996440 757884145
1917.3 757884145 757885456 758630574 758712649 758317292 758842051 759493947 759244561 759274006 759931087 759849787
1937.7 759849787 759385884 759820163 760258377 759884179 759980738 760610461 760406852 759992898 760532796 760896564
1958.1 760896564 760476232 760616362 761191666 760897636 760538459 761101961 761344016 760907948 761102915 761566699
1978.5 761566699 761184454 760969818 761584520 761659443 761145830 761370778 761703908 761183977 761012316 761585712
$$ packed form
1837.7G41173506L53992J94549J115024Q26717J65403Q78751J057208O3002K52485
1856.1G46080637J157701N89728N722Q33035R38773j10984K40624J068533L33070q2314
1876.5G51054525P87199O64890k51830L07322J023769J89602q8036Q17478M72903l24547
1896.9G54653275M26114R28044J4543m5597P98404L04282l78370M74691Q21054j12295
1917.3G57884145J311P45118Q2075l95357N24759O51896k49386K9445O57081q1300
1937.7G59849787m63903M34279M38214l74198R6559O29723k03609m13954N39898L63768
1958.1G60896564m20332J40130N75304k94030l59177N63502K42055m36068J94967M63784
1978.5G61566699l82245k14636O14702P4923n13613K24948L33130n19931j71661N73396
$$ plain form
1998.8 761585712 761501193 760978997 761270642 761505425 760878623 760702968 761183023 760916829 760338306 760574460
2019.2 760574460 760582089 759824514 759720385 760172248 759792566 759293377 759600282 759529293 758812070 758847177
2039.6 758847177 759268880 758830488 758455575 758875072 758811951 758199096 758384526 758787811 758333802 758104384
2060 758104384 758609772 758488059 757896662 758152962 758493721 758041739 757954001 758450568 758202374 757663727
2080.4 757663727 758017600 758301318 757831931 757832885 758276284 757921398 757502377 757979810 758167565 757633626
2100.8 757633626 757701337 758139491 757772088 757457495 757970870 758053780 757506669 757675767 758103251 757708430
2121.2 757708430 757515430 758104324 758180141 757758856 758042753 758389652 757960081 757900834 758541763 758533120
2141.6 758533120 758137643 758529663 758871615 758450389 758489966 759112120 759029269 758745611 759278297 759596586
$$ packed form
1998.8G61585712q4519n22196K91645K34783o26802j75655M80055k66194n78523K36154
2019.2G60574460P629p57575j04129M51863l79682m99189L06905p0989p17223L5107
2039.6G58847177M21703m38392l74913M19497o3121o12855J85430M03285m54009k29418
2060G58104384N05388j21713n91397K56300L40759m51982q7738M96567k48194n38647
2080.4G57663727L53873K83718m69387R54M43399l54886m19021M77433J87755n33939
2100.8G57633626O7711M38154l67403l14593N13375Q2910n47111J69098M27484l94821
2121.2G57708430j93000N88894P5817m21285K83897L46899m29571n9247O40929q643
2141.6G58533120l95477L92020L41952m21226L9577O22154q2851k83658N32686L18289
$$ plain form
2162 759596586 759172916 759308815 759924233 759794414 759629071 760258019 760482907 760036409 760290027 760910332
2182.4 760910332 760737777 760640025 761288226 761443675 761031032 761380970 761973143 761738062 761670232 762266576
2202.8 762266576 762262821 761854053 762292445 762787819 762433350 762401283 762991309 762903869 762518346 762993872
2223.2 762993872 763406456 763000607 762978733 763467491 763256133 762910783 763414800 763700247 763258994 763341248
2243.6 763341248 763797283 763472557 763138115 763643205 763839424 763382971 763502181 763901234 763526261 763230801
2264 763230801 763682067 763717294 763229549 763385832 763663352 763180554 762975574 763469875 763419807 762939513
2284.4 762939513 763102829 763221979 762575269 762302995 762673676 762431622 761850595 761923254 761823833 761005640
2304.8 761005640 760676563 760908067 760450661 759737551 759710729 759405613 758313715 757772565 757871151 757354617
$$ packed form
2162G59596586m23670J35899O15418j29819j65343O28948K24888m46498K53618O20305
2182.4G60910332j72555r7752O48201J55449m12643L49938N92173k35081o7830N96344
2202.8G62266576l755m08768M38392M95374l54469l2067N90026q7440l85523M75526
2223.2G62993872M12584m05849k1874M88758k11358l45350N04017K85447m41253Q2254
2243.6G63341248M56035l24726l34442N05090J96219m56453J19210L99053l74973k95460
2264G63230801M51266L5227m87745J56283K77520m82798k04980M94301n0068m80294
2284.4G62939513J63316J19150o46710k72274L70681k42054n81027P2659r9421q18193
2304.8G61005640l29077K31504m57406p13110k6822l05116j091898n41150R8586n16534
$$ plain form
2325.2 757354617 756631374 756484985 756087184 755213737 754988968 755112946 754590869 754167140 754372120 754334748
2345.6 754334748 754151523 754251719 753963649 752655387 751298368 750673354 749880195 749241650 749746203
2363.9 749746203 750308454 750204921 750514269 751156211 751110315 751072049 751817644 752295613 752055466 752115309
2384.3 752115309 752356708 751827061 751205206 751303971 751156688 750411749 750140727 750099301 749339223 748658299
2404.7 748658299 748709440 748410881 747560620 747217238 747045994 746225834 745582581 745549977 745019913 744035900
2425.1 744035900 743687928 743482351 742653370 742109060 742152214 741648018 740752757 740441144 740105629 739202678
2445.5 739202678 738672316 738585830 737931848 737073600 736813068 736396253 735436738 734912694 734731972 733976603
2465.9 733976603 733155012 732874513 732323647 731348634 730905056 730707943 729881704 729041934 728752732 728183806
$$ packed form
2325.2G57354617p23243j46389l97801q73447k24769J23978n22077m23729K04980l7372
2345.6G54334748j83225J00196k88070j308262j357019o25014p93159o38545N04553
2363.9G49746203N62251j03533L09348O41942m5896l8266P45595M77969k40147N9843
2384.3G52115309K41399n29647o21855R8765j47283p44939k71022m1426p60078o80924
2404.7G48658299N1141k98559q50261l43382j71244q20160o43253l2604n30064r84013
2425.1G44035900l47972k05577q28981n44310M3154n04196q95261l11613l35515r02951
2445.5G39202678n30362q6486o53982q58248k60532m16815r59515n24044j80722p55369
2465.9G33976603q21591k80499n50866r75013m43578j97113q26239q39770k89202n68926
$$ plain form
2486.3 728183806 727249086 726859212 726632714 725813568 725115001 724879980 724243522 723377764 723112404 722878337
2506.7 722878337 722088099 721506953 721298277 720653594 719880283 719718099 719505787 718729615 718193173 717983723
2527.1 717983723 717303634 716554224 716442764 716216385 715409935 714864731 714601457 713891983 713202715 713058233
2547.5 713058233 712684035 711854577 711374164 711058438 710275769 709638119 709537387 709131122 708322704 707885027
2567.9 707885027 707520604 706689715 706073463 705933452 705420375 704584122 704126358 703640044 702750385 702182829
2588.3 702182829 702006936 701410830 700586796 700136423 699585021 698685706 698161304 697943389 697272182 696464121
2608.7 696464121 696045220 695461631 694543898 694007099 693676114 692870140 692049146 691655934 691028237 690065145
2629.1 690065145 689497828 689087689 688227654 687406659 686940491 686221778 685304940 684802771 684338570 683425963
$$ packed form
2486.3G28183806r34720l89874k26498q19146o98567k35021o36458q65758k65360k34067
2506.7G22878337p90238n81146k08676o44683p73311j62184k12312p76172n36442k09450
2527.1G17983723o80089p49410j11460k26379q06450n45204k63274p09474o89268j44482
2547.5G13058233l74198q29458m80413l15726p82669o37650j00732m06265q08418m37677
2567.9G07885027l64423q30889o16252j40011n13077q36253m57764m86314q89659n67556
2588.3G02182829j75893n96106q24034m50373n51402q99315n24402k17915o71207q08061
2608.7F96464121m18901n83589r17733n36799l30985q05974q20994l93212o27697r63092
2629.1F90065145n67317m10139q60035q20995m66168p18713r16838n02169m64201r12607
$$ plain form
2649.5 683425963 682631791 682159543 681387901 680508494 680111587 679687321 678786635 678008795 677492738 676700771
2669.9 676700771 675912797 675572634 675076604 674138904 673434675 672957420 672164381 671418428 671092927 670611739
2690.3 670611739 669789910 669184387 668689013 667870760 667135715 666770875 666221499 665380478 664745688 664170563
2710.7 664170563 663332999 662658632 662286937 661651611 660819232 660310328 659825742 659017742 658364773 657984674
2731.1 657984674 657343447 656579435 656155467 655701458 654965758 654480398 654249787 653714776 653039098 652593613
2751.4 652593613 652055264 651330352 650868356 650508583 649815679 649137616 648732245 648148298 647397876 646962941
2771.8 646962941 646583438 645812631 645010829 644436181 643718183 642899692 642376006 641857743 640961289 640091479
2792.2 640091479 639451861 638617575 637692392 637030542 636273265 635201216 634242654 633411944 632303298
$$ packed form
2649.5F83425963p94172m72248p71642q79407l96907m24266r00686p77840n16057p91967
2669.9F76700771p87974l40163m96030r37700p04229m77255p93039p45953l25501m81188
2690.3F70611739q21829o05523m95374q18253p35045l64840n49376q41021o34790n75125
2710.7F64170563q37564o74367l71695o35326q32379n08904m84586q08000o52969l80099
2731.1F57984674o41227p64012m23968m54009p35700m85360k30611n35011o75678m45485
2751.4F52593613n38349p24912m61996l59773o92904o78063m05371n83947p50422m34935
2771.8F46962941l79503p70807q01802n74648p17998q18491n23686n18263q96454q69810
2792.2F40091479o39618q34286r25183o61850p57277j072049r58562q30710j108646
$$ plain form
2810.6 632303298 631142020 630304337 629398048 628162920 626997411 625898242 624536514 623175859 622055054
2828.9 622055054 620750070 619120002 617555976 615952671 613901019 611546814 609005332 605895042
2845.3 605895042 602380931 599306226 597037613 595565259 595032394 595129311 595085979 594711661 594253302
2863.6 594253302 593486965 592266321 591099203 590223014 589306831 588387728 587769568 587214589 586515129
2882 586515129 585966587 585475862 584615052 583565176 582658172 581676245 580515027 579494536 578558445
2900.3 578558445 577324748 575895488 574451566 572717309 570635319 568442225 565998673 563242733
2916.6 563242733 560743928 558895648 557527483 556679368 556584954 556938529 557352245 558095336 559313595
2935 559313595 560623109 562061667 563909888 565787852 567248583 568414569 569347441 569886148 570234597
$$ packed form
2810.6F32303298j161278q37683r06289j235128j165509j099169j361728j360655j120805
2828.9F22055054j304984j630068j564026j603305k051652k354205k541482l110290
2845.3F05895042l514111l074705k268613j472354n32865R6917m3332l74318m58359
2863.6E94253302p66337j220644j167118q76189r16183r19103o18160n54979o99460
2882E86515129n48542m90725q60810j049876r07004r81927j161218j020491r36091
2900.3E78558445j233697j429260j443922j734257k081990k193094k443552k755940
2916.6E63242733k498805j848280j368165q48115r4414L53575M13716P43091J218259
2935E59313595J309514J438558J848221J877964J460731J165986R32872N38707L48449
$$ plain form
2953.4 570234597 570712507 571221948 571753621 572654366 573899627 575200737 576755643 578735590 580714881
2971.7 580714881 582454085 584174514 585827947 587181687 588362455 589507341 590411007 591081619 591838181
2990.1 591838181 592526495 592808902 592948496 593060613 592771053 592200637 591737270 591237366 590602398 590172708
3010.5 590172708 589904964 589323282 588470817 587714195 586926520 585991383 585192561 584448159 583465874 582478106
3030.9 582478106 581721902 580826104 579668641 578746796 578012228 576987088 575825512 574809372 573754013
3049.2 573754013 572635055 571695447 570800424 569672942 568513274 567545414 566581249 565631866 564897537
3067.6 564897537 564110518 563049376 562098205 561447740 560746372 559897900 559121013 558315694 557328105
3085.9 557328105 556417584 555639088 554684579 553687155 552927792 552189887 551270127 550323069 549417555 548485160
$$ packed form
2953.4E70234597M77910N09441N31673R00745J245261J301110J554906J979947J979291
2971.7E80714881J739204J720429J653433J353740J180768J144886R03666O70612P56562
2990.1E91838181O88314K82407J39594J12117k89560n70416m63367m99904o34968m29690
3010.5E90172708k67744n81682q52465p56622p87675r35137p98822p44402r82285r87768
3030.9E82478106p56204q95798j157463r21845p34568j025140j161576j016140j055359
3049.2E73754013j118958r39608q95023j127482j159668r67860r64165r49383p34329
3067.6E64897537p87019j061142r51171o50465p01368q48472p76887q05319r87589
3085.9E57328105r10521p78496r54509r97424p59363p37905r19760r47058r05514r32395
$$ plain form
3106.3 548485160 547631681 546848536 545918941 544927895 544097245 543225050 542054236 540863812 539908350
3124.7 539908350 538907290 537770271 536716163 535642147 534450829 533397555 532489061 531344056
3141 531344056 530009925 528865218 527793646 526645482 525672138 524756312 523495436 522086799 520892084
3159.4 520892084 519730091 518460691 517319620 516277313 515048862 513733208 512550712 511347115
3175.7 511347115 510071635 508964777 507948697 506771922 505555451 504458189 503316879 502108157
3192 502108157 501031160 499981195 498766333 497558832 496489644 495392352 494270265 493283331 492321789
3210.3 492321789 491249442 490224957 489279687 488211393 487122297 486198604 485235214 484100938 483051389
3228.7 483051389 482172936 481236488 480195612 479187429 478170007 477095783 476131618 475247443 474209934
$$ packed form
3106.3E48485160q53479p83145r29595r91046q30650q72195j170814j190424r55462
3124.7E39908350j001060j137019j054108j074016j191318j053274r08494j145005
3141E31344056j334131j144707j071572j148164r73344r15826j260876j408637j194715
3159.4E20892084j161993j269400j141071j042307j228451j315654j182496j203597
3175.7E11347115j275480j106858j016080j176775j216471j097262j141310j208722
3192E02108157j076997j049965j214862j207501j069188j097292j122087r86934r61542
3210.3D92321789j072347j024485r45270j068294j089096r23693r63390j134276j049549
3228.7D83051389q78453r36448j040876j008183j017422j074224r64165q84175j037509
$$ plain form
3247.1 474209934 473102480 472134799 471198171 470152557 469123751 468135208 467089325 466133147 465324014
3265.4 465324014 464445055 463492990 462629050 461764932 460760534 459816724 459087789 458288372 457332164
3283.8 457332164 456533253 455883682 455201030 454599053 454076320 453380495 452510744 451742023 451145977 450589210
3304.2 450589210 450011373 449307770 448372662 447406739 446647972 445901990 444986403 444127679 443394005 442567766
3324.6 442567766 441639066 440730423 439791709 438814461 437972307 437242985 436394691 435420394 434458882 433449984
3345 433449984 432458431 431715965 430970997 429906338 428802490 427913964 427069038 426191032 425424576 424786836
3365.4 424786836 424121410 423288018 422250628 421157718 420293272 419682980 419046015 418247491 417455107
3383.7 417455107 416816413 416320592 415960997 415616632 415041536 414347649 413926989 413686454 413162798 412406892
$$ packed form
3247.1D74209934j107454r67681r36628j045614j028806r88543j045883r56178q09133
3265.4D65324014q78959r52065q63940q64118j004398r43810p28935p99417r56208
3283.8D57332164p98911o49571o82652o01977n22733o95825q69751p68721n96046n56767
3304.2D50589210n77837p03603r35108r65923p58767p45982r15587q58724p33674q26239
3324.6D42567766r28700r08643r38714r77248q42154p29322q48294r74297r61512j008898
3345D33449984r91553p42466p44968j064659j103848q88526q44926q78006p66456o37740
3365.4D24786836o65426q33392j037390j092910q64446o10292o36965p98524p92384
3383.7D17455107o38694m95821l59595l44365n75096o93887m20660k40535n23656p55906
$$ plain form
3404.1 412406892 411862433 411534309 411192387 410863936 410501033 410027176 409713030 409657031 409551352 409370154
3424.5 409370154 409355879 409491956 409598976 409764946 410089761 410283804 410194546 410131961 410272717 410538703
3444.9 410538703 410944879 411406666 411791325 412177920 412671775 413281262 413983345 414713293 415460736 416271687
3465.3 416271687 417148083 417964101 418526590 418986708 419679284 420641422 421610922 422401249 423176706 424108803
3485.7 424108803 425095469 426092684 427121371 428133756 429226190 430353045 431353062 432357967 433468163
3504 433468163 434510648 435464472 436568886 437907428 439187676 440283954 441464037 442808181 444208652
3522.4 444208652 445554227 446791053 448035985 449430019 450991184 452629268 454194635 455649644
3538.7 455649644 457203507 458936214 460737348 462488979 464067698 465567797 467245549 469042450
$$ packed form
3404.1D12406892n44459l28124l41922l28451l62903m73857l14146n5999j05679j81198
3424.5D09370154j4275J36077J07020J65970L24815J94043q9258o2585J40756K65986
3444.9D10538703M06176M61787L84659L86595M93855O09487P02083P29948P47443Q10951
3465.3D16271687Q76396Q16018N62489M60118O92576R62138R69500P90327P75457R32097
3485.7D24108803R86666R97215J028687J012385J092434J126855J000017J004905J110196
3504D33468163J042485R53824J104414J338542J280248J096278J180083J344144J400471
3522.4D44208652J345575J236826J244932J394034J561165J638084J565367J455009
3538.7D55649644J553863J732707J801134J751631J578719J500099J677752J796901
$$ plain form
3555 469042450 470831424 472799093 474931538 476820379 478496879 480668306 483195335 485350370 487365842
3573.4 487365842 489643693 492036134 494455934 496978372 499394059 501649380 504202187 507015884
3589.7 507015884 509474277 511786222 514390230 517160177 519931436 522786438 525570095 528082073
3606 528082073 530658841 533473432 536327541 539294481 542226076 545213580 548526049 551552594 554014981
3624.4 554014981 556209505 559071362 562869966 566176534 569054961 571888685 574665844 577477217
3640.7 577477217 580290616 582976818 585600615 588667631 592066586 594749868 596966326 599674582
3657 599674582 602605522 605070353 607142746 609038353 610743105 612571239 614851356 616860628 618700564
3675.4 618700564 620669246 622298360 623781145 625280559 626715839 628251791 629806995 631006062
$$ packed form
3555D69042450J788974J967669K132445J888841J676500K171427K527029K155035K015472
3573.4D87365842K277851K392441K419800K522438K415687K255321K552807K813697
3589.7E07015884K458393K311945K604008K769947K771259K855002K783657K511978
3606E28082073K576768K814591K854109K966940K931595K987504L312469L026545K462387
3624.4E54014981K194524K861857L798604L306568K878427K833724K777159K811373
3640.7E77477217K813399K686202K623797L067016L398955K683282K216458K708256
3657E99674582K930940K464831K072393J895607J704752J828134K280117K009272J839936
3675.4F18700564J968682J629114J482785J499414J435280J535952J555204J199067
$$ plain form
3691.7 631006062 632055998 633094728 633985758 634813309 635816336 636851668 637647390 638284802 638848066
3710 638848066 639534473 640516877 641457200 642114699 642524123 642850935 643201411 643683672 644346952 644968510
3730.4 644968510 645409048 645826280 646512508 647244453 647514284 647386014 647675991 648372352 648552477 648648620
3750.8 648648620 649244189 649862766 650272667 650638998 651027441 651274204 651442766 651643872 651854753 652225018
3771.2 652225018 652693450 653041422 653282583 653533041 653765321 653918326 654137552 654429674 654624641 654717267
3791.6 654717267 654781878 654942393 655209959 655309975 655428767 655676901 655708253 655809939 656084061 656268895
3812 656268895 656357467 656554341 656718493 656583369 656705678 657043338 657198429 657316208 657398462 657474577
3832.4 657474577 657563746 657434583 657250106 657386482 657651484 657861948 658003688 658007503 657589078 656882286
$$ packed form
3691.7F31006062J049936J038730Q91030Q27551J003027J035332P95722O37412N63264
3710F38848066O86407R82404R40323O57499M09424L26812L50476M82261O63280O21558
3730.4F44968510M40538M17232O86228P31945K69831j28270K89977O96361J80125R6143
3750.8F48648620N95569O18577M09901L66331L88443K46763J68562K01106K10881L70265
3771.2F52225018M68432L47972K41161K50458K32280J53005K19226K92122J94967R2626
3791.6F54717267O4611J60515K67566J00016J18792K48134L1352J01686K74122J84834
3812F56268895Q8572J96874J64152j35124J22309L37660J55091J17779Q2254P6115
3832.4F57474577Q9169j29163j84477J36376K65002K10464J41740L815m18425p06792
$$ plain form
3852.8 656882286 657175124 658018470 658378124 658323467 658143759 658138931 658136725 658021688 658163249 658351779
3873.2 658351779 658393443 658316076 658086360 658053458 658254862 658457637 658510566 658271432 658098519 658247769
3893.6 658247769 658326864 658196747 658088446 657987058 657820821 657797337 657821000 657772422 657780826 657769084 657617986
3916 657617986 657466531 657429338 657390535 657330573 657362044 657337546 657141924 656978190 656957448 656913579 656818151
3938.5 656818151 656769574 656750619 656682134 656511784 656324387 656204164 656158507 656195819 656217217 656117380 655935287
3960.9 655935287 655762076 655634046 655579567 655617356 655624688 655491590 655332685 655233622 655154347 655156910 655263066
3983.3 655263066 655255616 655059278 654899478 654826403 654751480 654737055 654772460
3997.6 654772460
$$ packed form
3852.8F56882286K92838Q43346L59654n4657j79708m828k206j15037J41561J88530
3873.2F58351779M1664p7367k29716l2902K01404K02775N2929k39134j72913J49250
3893.6F58247769P9095j30117j08301j01388j66237k3484K3663m8578Q404j1742j51098
3916F57617986j51455l7193l8803n9962L1471k4498j95622j63734k0742m3869r5428
3938.5F56818151m8577j8955o8485j70350j87397j20223m5657L7312K1398r9837j82093
3960.9F55935287j73211j28030n4479L7789P332j33098j58905r9063p9275K563J06156
3983.3F55263066p450j96338j59800p3075p4923j4425L5405
3997.6F54772460
##END=$$ End of the data block
