##TITLE=$$ Begin of the data block
##JCAMP-DX=5.00 $$ ACD/SpecManager v 10.08
##SPECTROMETER/DATA SYSTEM=Alpha
##DATE=10 Nov 2014 10:35:34
##DATA TYPE=INFRARED SPECTRUM
##DATA CLASS=XYDATA
##ORIGIN=
##OWNER=
##NPOINTS=1765
##FIRSTX=399.76428223
##LASTX=3997.64306641
##MAXX=3997.64306641
##MINX=399.76428223
##MAXY=0.76499170
##MINY=0.40738606
##XFACTOR=1.0000000000
##YFACTOR=1.000000000000000e-9
##FIRSTY=0.60933161
##DELTAX=2.03961372
##XUNITS=1/CM
##YUNITS=ARBITRARY UNITS
##XYDATA=(X++(Y..Y))
399.8F09331608l128231j778185K402961r75549l514588N84483l874l438950k9206
418.1E99450469K123296k654969j152277J585483k119124k216518K320409J32740k935648
436.5E94533861J107812J830101k215743j90974K228439k001464k288342J853645k05874
454.8E94651461l033638O08623P31766k919436o92129J649559k026320j947760K366364
473.2E89388490k17736l206909N97716J236438k455413k83539K137363j839578k232790
491.5E83124042J778304k21014k987981L45588Q26240k986670j148879J512289k002538
509.9E78239381k689480J181244l80337l663480l77298J180590k141595q99971K236307
528.3E72685361o84500k223253J243293Q06034j791835J238585L191053m47034o54221
$$ plain form
399.8 609331608 606203377 604425192 606828153 605852604 602338016 602922499 602918625 599479675 599450469
418.1 599450469 601573765 598918796 597766519 599352002 597232878 595016360 597336769 597469509 594533861
436.5 594533861 595641673 597471774 595256031 595065057 597293496 595292032 593003690 594857335 594651461
454.8 594651461 591617823 592226446 592958212 590038776 589346647 590996206 588969886 587022126 589388490
473.2 589388490 589170754 585963845 586561561 587797999 585342586 585059047 587196410 585356832 583124042
491.5 583124042 584902346 584681332 581693351 582038939 582865179 579878509 578729630 580241919 578239381
509.9 578239381 575549901 576731145 576350808 572687328 572310030 573490620 571349025 570449054 572685361
528.3 572685361 572000861 569777608 571020901 571826935 570035100 571273685 574464738 574017704 573363483
546.6E73363483K422273K09272k060890J175523J429259k017796l10063K078712j041591
565E75248182j743972J466274n722k469600N66900J864076j332223n16892K420306
583.3E75497329J59502j451552J456738J046300j864910J62065J917958j079977j190424
601.7E74653029J772702J34111j868725J074672J632094j650930o40213K111316O4671
620E77282727p95722K427220K036333p53701J101256K595663l67820l40104K669155
638.4E85855007J123607r04143J822234K519548m06623N64038K818645K90751j021385
656.8E92661679J695454J031339j551926l6597J248240q36551R32217L509223J510680
675.1F00163758m59314J984716K406835m93526M18544K516091J68204q89659J762331
$$ plain form
546.6 573363483 575785756 575995028 573934138 575109661 576538920 574521124 574211061 576289773 575248182
565 575248182 573504210 574970484 574964762 572495162 573062062 574926138 573593915 573077023 575497329
583.3 575497329 575656831 574205279 575662017 576708317 574843407 575005472 576923430 575843453 574653029
601.7 574653029 576425731 576559842 574691117 575765789 577397883 575746953 575106740 577218056 577282727
620 577282727 576487005 578914225 580950558 580196857 581298113 583893776 583525956 583185852 585855007
638.4 585855007 586978614 586074471 587896705 590416253 590009630 590573668 593392313 593683064 592661679
656.8 592661679 594357133 595388472 593836546 593799949 595048189 594211638 595143855 598653078 600163758
675.1 600163758 599704444 601689160 604095995 603602469 604021013 606537104 606705308 605815649 607577980
693.5F07577980J019835j597047L88503K152622k10702m4167K814114J576364k77996
711.8F13399506K197623K943814K88844J241982L759801J805484O20962L189385K804100
730.2F32251501J06812J424789K850831K60591j93596K319932J278579o55710J364171
748.5F41007900J950264p70330l60728J716495o8724j314402J059652R73940j383484
766.9F42810583r6917J467407p95543j281500J338362J104951n066K640545M161775
785.3F51344597K129495K491355M409135K475917O36935K482951K331853m06325J37448
803.6F68033361J469017p69973j755595L25858j30355j816690J15275J677096j41561
822F67006433j63853J758873P10845m63426J695693K452433O89566J502693L104508
$$ plain form
693.5 607577980 608597815 607000768 607389271 609541893 609331191 609287024 612101138 613677502 613399506
711.8 613399506 615597129 618540943 618829787 620071769 623831570 625637054 626258016 629447401 632251501
730.2 632251501 632358313 633783102 636633933 636894524 636700928 639020860 640299439 639643729 641007900
748.5 641007900 642958164 642187834 641827106 643543601 643474877 642160475 643220127 644194067 642810583
766.9 642810583 642713666 644181073 643385530 642104030 643442392 644547343 644542277 647182822 651344597
785.3 651344597 653474092 655965447 660374582 662850499 663487434 665970385 668302238 667895913 668033361
803.6 668033361 669502378 668732405 666976810 667302668 667172313 665355623 665470898 667147994 667006433
822 667006433 666842580 668601453 669312298 668848872 670544565 672996998 673686564 675189257 678293765
840.3F78293765J137912l17752J167654N05448j835466r29713L27110j256465j306117
858.7F75786376P10487R0301j032650J013696J954496L2544L51608K163708Q19802
877F81890368o97493M43995j16527k498448j982272p80880k345443k664506n21779
895.4F70727015o60897k004623o98745q35k043784k457320j284004k574145l958047
913.7F55044615k419829j716137k902031j756370L86894k70188p77126P74622M12882
932.1F46777332j528084j134575o22451k561748l266037j987815k740800m172206l003061
950.5F25760555k270579l745079l703892k415359l362477m369319l111064l074467
966.8E99708319m937053m995942m394114n937815o759584n386829n373478o406844
$$ plain form
840.3 678293765 679431677 679113925 680281579 680787027 678951561 678021848 678348958 677092493 675786376
858.7 675786376 676496863 676587164 675554514 676568210 678522706 678555250 678906858 681070566 681890368
877 681890368 681192875 681636870 681520343 679021895 677039623 676258743 673913300 671248794 670727015
895.4 670727015 670066118 668061495 667362750 667361915 665318131 662860811 661576807 659002662 655044615
913.7 655044615 652624786 650908649 648006618 646250248 646637142 646366954 645589828 646364450 646777332
932.1 646777332 645249248 644114673 643492222 640930474 637664437 635676622 632935822 628763616 625760555
950.5 625760555 623489976 619744897 616041005 613625646 610263169 605893850 602782786 599708319
966.8 599708319 594771266 589775324 585381210 579443395 572683811 567296982 561923504 555516660
983.1E55516660n157649l574968m002571l583550j749695j786053k679944j720547
999.4E31261683j255155k703548k863526j771331k417445l133178j769185j079678
1015.7E14268637j918197j349688j49369q50916j272499J04010L17335o85930K1875
1034.1E08485258R31561k56479r64642k33948r37700k175153j215934k34902r45270
1052.4E02452791m93229J181305R94801L27409J599311K131164O67096L65793Q97468
1070.8E10123909l15965j002133P29859J727701J377522K554119L874660K793669J895547
1089.2E23758888K544999J609922l71218j16229M79937p25687o73652J195014J403749
1107.5E29105723Q79109K323925L236950K095043K152145L202379K104461R18925K002776
$$ plain form
983.1 555516660 550359011 546784043 542781472 539197922 537448227 535662174 532982230 531261683
999.4 531261683 530006528 527302980 524439454 522668123 520250678 517117500 515348315 514268637
1015.7 514268637 512350440 511000752 510851383 510000467 508727968 508831978 509149313 508463383 508485258
1034.1 508485258 509416819 509160340 508195698 507961750 507024050 504848897 503632963 503398061 502452791
1052.4 502452791 501959562 503140867 504135668 504463077 506062388 508193552 508860648 509226441 510123909
1070.8 510123909 509807944 508805811 509535670 511263371 512640893 515195012 519069672 521863341 523758888
1089.2 523758888 526303887 527913809 527542591 527426362 527906299 527180612 526506960 527701974 529105723
1107.5 529105723 529984832 532308757 535545707 537640750 539792895 542995274 545099735 546018660 548021436
1125.9E48021436K223134Q53479J244008K132952N84484o00458M20511K21729j116633
1144.2E53984642p5400J471400O80149N82755K393901K472043J543224L055990M624784
1162.6E70733488L990590M641712O807446O429911N205691O469309O820500M675090
1178.9F15773737M391849N442203L810107K196133L269971K835333L16560K67089J022816
1197.3F39325798r28760j875103o8604j04070j572907m01855O67394j178980j782239
1215.6F32080674l31104j212358k908468j737655j001000k670526k506793o86049j341820
1234F17684901k282858n47528J28507j349270o94275J030803K4974q30531P84635Q81851
1254.4F14831209q04484l2961J463115L23415m8637J795053J594305M5776J102269
$$ plain form
1125.9 548021436 550244570 551098049 552342057 554475009 555059493 554459035 554879546 555101275 553984642
1144.2 553984642 553909242 555380642 556060791 556643546 559037447 561509490 563052714 566108704 570733488
1162.6 570733488 574724078 579365790 586173236 592603147 597808838 604278147 611098647 615773737
1178.9 615773737 620165586 625607789 629417896 631614029 634884000 637719333 638035893 638302982 639325798
1197.3 639325798 638397038 636521935 636453331 636349261 634776354 634374499 635041893 633862913 632080674
1215.6 632080674 631749570 630537212 627628744 625891089 624890089 622219563 619712770 619026721 617684901
1234 617684901 615402043 614854515 614983022 613633752 612939477 613970280 613995254 613164723 613949358 614831209
1254.4 614831209 614026725 613993764 615456879 615780294 615731657 617526710 619121015 619166791 620269060
1272.7F20269060K084255L27170k07841J291871O58333p47084M74214J059652q49665
1291.1F24359965j007855L61979q11457k229095r36150o24836k438247k234340r11593
1309.4F13528371k063692k874553j101196p38382k108336j180887J80304j103878j728952
1327.8F00808799j87099l81887j807093p87258M33266p55370p27236J027047N23329
1346.2E98146498q89718Q4400O52492j011372j120329L21389n02646j913727p86364
1364.5E92980623m92990k114236j757622l76463j559198k744376k459228m972339p606804
1382.9E68897367k910078M626512M731596J106739L28541m76420j956821j147806r2268
1401.2E73107362j130522j317441L21686K10285q40365K48968J287580K18451J77681
$$ plain form
1272.7 620269060 622353315 622680485 622472644 623764515 624422848 623675764 624149978 625209630 624359965
1291.1 624359965 623352110 623714089 622902632 620673537 619737387 619112551 616674304 614439964 613528371
1309.4 613528371 611464679 608590126 607488930 606750548 604642212 603461325 603641629 602537751 600808799
1327.8 600808799 600621700 600239813 598432720 597645462 598078728 597323358 596596122 597623169 598146498
1346.2 598146498 597256780 597341180 597993672 596982300 595861971 596183360 595680714 593766987 592980623
1364.5 592980623 592487633 590373397 588615775 588239312 586680114 583935738 581476510 576504171 568897367
1382.9 568897367 565987289 570613801 575345397 576452136 576780677 576304257 574347436 573199630 573107362
1401.2 573107362 571976840 570659399 570981085 571191370 570351005 570599973 571887553 572106004 572283685
1419.6E72283685J677275J167893M14789J667559K369285R54151O14405J831710J363754
1437.9E84344506L65019J376867J517594m5836Q5891J274526K97844n78642J124442
1456.3E89762211K436101J148641J682520L142476K649367K301574M241347N995512
1472.6F13359749N321205N443215N361617L352225K598464L378868K369106L33667
1488.9F41518116O80268O53803j527965k489686j357376k069295l246903k988100l047169
1507.3F26125693l338396k055943j065314k030551k781928j151979o40273j868248
1523.6F11193061j365364q40842k018273k695740j689195j251996k297997k682925
1539.9E96350729j742601k132893j724541k57075l69727j051665J3531R31680k94447
$$ plain form
1419.6 572283685 573960960 575128853 575543642 577211201 579580486 580534637 581149042 582980752 584344506
1437.9 584344506 584709525 586086392 587603986 587558150 587644041 588918567 589216411 588637769 589762211
1456.3 589762211 592198312 593346953 595029473 598171949 600821316 603122890 607364237 613359749
1472.6 613359749 618680954 624124169 629485786 632838011 635436475 638815343 641184449 641518116
1488.9 641518116 642198384 642852187 641324222 638834536 637477160 635407865 632160962 629172862 626125693
1507.3 626125693 622787297 620731354 619666040 617635489 614853561 613701582 613061309 611193061
1523.6 611193061 609827697 608986855 606968582 604272842 602583647 601331651 599033654 596350729
1539.9 596350729 594608128 592475235 590750694 590493619 590123892 589072227 589085758 590017438 589722991
1558.3E89722991l56853P10487l66866j309574m31418O5982j155496j395404o01292
1576.6E84882557j291632k052546j332938j422644k810717k683639j851082k652586
1593E68784773l122151j875221j721442k766609k275110j404881k244711k660215j619935
1611.3E49094498j701176k966285k821088j695394k360225k938211k112925k435863
1627.6E30063331l033161j872838j155555k064705j382708O0916k79129q91745j17421
1646E19326985P33435j8775o2108J316368Q36134M59433J583755K387404K008796K100110
1666.4E30671537L128529L340482K702236L723801M392445L251552L154397M219175
1682.7E58584154N066216M805445N038441N045771L932417M838883O479383N452991
$$ plain form
1558.3 589722991 589366138 590076625 589709759 588400185 587968767 588034749 586879253 585483849 584882557
1576.6 584882557 583590925 581538379 580205441 578782797 575972080 573288441 571437359 568784773
1593 568784773 565662622 563787401 562065959 559299350 557024240 555619359 553374648 550714433 549094498
1611.3 549094498 547393322 544427037 541605949 539910555 537550330 534612119 532499194 530063331
1627.6 530063331 527030170 525157332 524001777 521937072 520554364 520615280 520336151 519444406 519326985
1646 519326985 520060420 520041645 519979537 521295905 522132039 522591472 524175227 526562631 528571427 530671537
1666.4 530671537 533800066 537140548 539842784 543566585 547959030 551210582 554364979 558584154
1682.7 558584154 563650370 568455815 573494256 578540027 582472444 587311327 593790710 599243701
1699E99243701N554020N408525M060507L330589L543615L361046J896322J218975K266228
1717.4F29883528J986563J099229J656771J715242N55993O17742J422703Q13186N51582
1735.7F40302539J638651J846432J355231K133191L252387K944529L186882M707396
1752F61367238M263222L342390M176974M741788M007518L642500M115283L636480K480626
1770.4F95774019L171623L517389J938402J671911K591312K017796J118540J928092
1786.7G13729084K200543J049579J180648K116263J294256O33299J609325J808048
1803G25621045P83383J066566J741171Q97169M92811J495719J396358M49062R14454
1821.4G34857738J444876N01156K16484J291931J201510L43085Q67068J303435L40104
$$ plain form
1699 599243701 604797721 610206246 614266753 617597342 621140957 624502003 626398325 627617300 629883528
1717.4 629883528 631870091 632969320 634626091 636341333 636897326 637515068 638937771 639750957 640302539
1735.7 640302539 641941190 643787622 645142853 647276044 650528431 653472960 656659842 661367238
1752 661367238 665630460 668972850 673149824 677891612 681899130 685541630 689656913 693293393 695774019
1770.4 695774019 698945642 702463031 704401433 706073344 708664656 710682452 711800992 713729084
1786.7 713729084 715929627 716979206 718159854 720276117 721570373 722203672 723812997 725621045
1803 725621045 726404428 727470994 729212165 730109334 730602145 732097864 733494222 733943284 734857738
1821.4 734857738 736302614 736803770 737020254 738312185 739513695 739856780 740723848 742027283 742367387
1839.8G42367387P8559J005172Q63970K44140R49383J131416O1333J96218J148105
1858.1G48045683O19113J0372P96973Q51810j86383L06785J195967L81410r0540P97034
1878.5G52728224P01785k36392K89440J000226J59442j01507Q28147M90129l08990
1896.9G55550504M16577R23514L5942m2081P79390L05355l60668M86076Q30531j39356
1917.3G58785784m8995P39455J13368l64184N45383O70254k58744j3947O46352l9220
1937.7G60775506m52101L92497M26650l57986J04785O59764j59740m00186N20349L33130
1958.1G61842668m38213J63912O02663l12149l71218N82039K31326m71175K00629M88341
1978.5G62518823l89397k28822O27041Q9168n38289J88589L42369m79281j55807N68986
$$ plain form
1839.8 742367387 742445946 743451118 744315088 744559228 745508611 746640027 746701360 746897578 748045683
1858.1 748045683 748664796 748675168 749472141 750323951 750137568 750444353 751640320 752021730 751931190 752728224
1878.5 752728224 753430009 753193617 753483057 754483283 754642725 754541218 755369365 755859494 755550504
1896.9 755550504 755967081 756890595 756926537 756884456 757663846 757969201 757608533 758094609 758925140 758785784
1917.3 758785784 758736789 759476244 759589612 759225428 759770811 760441065 760182321 760168374 760814726 760775506
1937.7 760775506 760323405 760715902 761142552 760784566 760889351 761549115 761389375 760989189 761509538 761842668
1958.1 761842668 761404455 761568367 762171030 761858881 761487663 762069702 762301028 761829853 762030482 762518823
1978.5 762518823 762129426 761900604 762527645 762616813 762078524 762267113 762609482 762130201 761974394 762543380
1998.8G62543380o2823m94719K72572J98544o39022j83463M66049k68400n60939K73049
2019.2G61544228N1379p48337j32441M40299l83973n24878L16977j4722o91593J4305
2039.6G59871244M01617m43221l78608M29272m0650o19650J60515L86298m83274k59281
2060G59024262M94779j24872n82934K86520L74556m43995r9540M88341k55347n30660
2080.4G58631110M03047L09288n18799m4524M55916l31342m26472M61400J89066n34117
2100.8G58594573O9797M58419l76642l70502N01990J46270m99606J67727M22537l99351
2121.2G58715212k01821N93066P5281m23789L16739L86178m24802q1837O12020k0563
2141.6G59545684m02093L89337L65079l88920N3227O21795r5308l27170N00322L36289
$$ plain form
1998.8 762543380 762480557 761985838 762258410 762456954 761817932 761634469 762100518 761832118 761271179 761544228
2019.2 761544228 761595607 760847270 760714829 761155128 760771155 760246277 760563254 760548532 759856939 759871244
2039.6 759871244 760272861 759829640 759451032 759880304 759839654 759220004 759380519 759766817 759283543 759024262
2060 759024262 759519041 759394169 758811235 759097755 759472311 759028316 758928776 759417117 759161770 758631110
2080.4 758631110 759034157 759343445 758824646 758780122 759236038 758904696 758478224 758939624 759128690 758594573
2100.8 758594573 758664370 759122789 758746147 758375645 758877635 759023905 758524299 758692026 759114563 758715212
2121.2 758715212 758513391 759106457 759181738 758757949 759074688 759460866 759036064 758954227 759566247 759545684
2141.6 759545684 759143591 759532928 759898007 759509087 759562314 760184109 760088801 759761631 760261953 760598242
2162G60598242m01497J47820O42896j08421j86324N99920K29240m36604K68340O82235
2182.4G62035847j12415j10328O07371J32263m43518L17633O13094j84536o9082N61178
2202.8G63347507j1027m09425M27485N21600l00825k5928N54562j02878l88979M61936
2223.2G64074028M00602m00126J3352N16832k38955l93927N12600L46839m15921N8770
2243.6G64474094M55379l02314l38316M72128J69337m55082J25051L91424l68595k41697
2264G64381409N17428L9875n32627J42336K97606n02229k45213N10573q404m68970
2284.4G64131784J65880J17600o60479k66612M05908k19524n93602P7426n1737p95007
2304.8G62311637l62634K04086m38452o95348n0723l15547j035810m74929J19388n44846
$$ plain form
2162 760598242 760196745 760344565 760987461 760879040 760692716 761292636 761521876 761085272 761353612 762035847
2182.4 762035847 761923432 761813104 762420475 762552738 762109220 762426853 763039947 762855411 762786329 763347507
2202.8 763347507 763336480 762927055 763354540 763876140 763575315 763549387 764103949 764001071 763612092 764074028
2223.2 764074028 764474630 764074504 764087856 764604688 764365733 763971806 764484406 764831245 764415324 764474094
2243.6 764474094 764929473 764627159 764288843 764760971 764930308 764475226 764600277 764991701 764623106 764381409
2264 764381409 764898837 764938712 764406085 764548421 764846027 764343798 764098585 764609158 764600754 764131784
2284.4 764131784 764297664 764415264 763754785 763488173 763894081 763674557 763080955 763158381 763106644 762311637
2304.8 762311637 761949003 762153089 761714637 761019289 760968566 760653019 759617209 759142280 759261668 758716822
2325.2G58716822p46966j20401l78966q92103k88308N2512n53072m27305K73704M5896
2345.6G55681813j68622R5308l00884j351655j394629o00100p39395o34671M90368
2363.9G51077533N49733j51693K89023O71565P75J6689P48754M01973l29494J9252
2384.3G53294110K51711n15998o38783P8023j54138p65204l09050o2883p58469o69062
2404.7G49750257R2744k53677q49485l58105j87636q55505o74725l0577m96328r52899
2425.1G45184064l40998k08855q31723n56767J6212n16295q85427l13342l56078r27687
2445.5G40263104n23507m4823o39438q88348k92242m14788r47774n17189j43767p26700
2465.9G35124528q42213l01719n68032j007974m55320j92702q30412q44836l16262
$$ plain form
2325.2 758716822 757969856 757849455 757470489 756578386 756290078 756342590 755789518 755362213 755635917 755681813
2345.6 755681813 755513191 755608499 755307615 753955960 752561331 751961231 751221836 750587165 751077533
2363.9 751077533 751627266 751475573 751764596 752436161 752436936 752453625 753202379 753604352 753274858 753294110
2384.3 753294110 753545821 753029823 752391040 752469063 752314925 751549721 751240671 751177788 750419319 749750257
2404.7 749750257 749843001 749589324 748739839 748381734 748194098 747338593 746663868 746633291 746136963 745184064
2425.1 745184064 744843066 744634211 743802488 743245721 743261933 742745638 741860211 741546869 741190791 740263104
2445.5 740263104 739739597 739694774 739055336 738166988 737874746 737459958 736512184 735994995 735851228 735124528
2465.9 735124528 734282315 733980596 733412564 732404590 731949270 731756568 730926156 730081320 729765058
2484.3G29765058o18220r40919l25918j59383q04603p32481k59877o22153q67665k77936
2504.7G24155903k23041p97093o14881k12371o23644p72953j85847k41816p79271n15342
2525.1G19189644k04206o90043p47323j32918k83122q23915n14567k33889o95228o78837
2545.5G14185596j24515l56137q31724m73618k89559p75576o41465r9600m19497q24750
2565.8G09349155m45365l71397q31366o18994j50919n37336q71956m63069m54723q73328
2586.2G03730702n81085j73807n89729q52883m70221n35786q96692n41806k13743o66856
2606.6F98208094q40962m55857n91933r11653n17607k99096q01623q56936m23551o00159
2627F91908717r09209n54264m10378q42929q22544m95791p51495r33052m84407m29987
$$ plain form
2484.3 729765058 729146838 728205919 727880001 727720618 726916015 726183534 725923657 725301504 724433839 724155903
2504.7 724155903 723932862 723135769 722520888 722308517 721684873 720911920 720726073 720484257 719704986 719189644
2525.1 719189644 718985438 718295395 717548072 717415154 717132032 716308117 715793550 715559661 714864433 714185596
2545.5 714185596 714061081 713704944 712873220 712399602 712110043 711334467 710693002 710593402 710173905 709349155
2565.8 709349155 708903790 708532393 707701027 707082033 706931114 706393778 705521822 705058753 704604030 703730702
2586.2 703730702 703149617 702975810 702386081 701533198 701062977 700527191 699630499 699088693 698874950 698208094
2606.6 698208094 697367132 696911275 696319342 695407689 694890082 694590986 693789363 692932427 692508876 691908717
2627 691908717 690999508 690445244 690034866 689191937 688369393 687873602 687122107 686189055 685704648 685274661
2647.4F85274661q89361p82013m82500q14557r34780m35113m41850q94427p40767m88877
2667.8F78370416q01146q19146l72589m97699r23753p13646m79758p68065p34389l30568
2688.2F71929657m76241q28385o39796n20289p95126o69599l23117n89549r15587o52134
2708.6F65519834n26965p96795o80804m04120o76274q72731n38171m87566p80582o28233
2729F59127593l72708o15895p43150m55439n01633p62224m81069k13743n45203p01249
2749.4F53735280m54783n40972p25985m47750l35514o78063o82771m14431n81026p46668
2769.8F48127317m44710l89874p61330p75754n50330p22170q42869n34535n06699q69989
2790.2F41729057q62241o68049q58187r23098o51121p57634j092017r57310p88689
$$ plain form
2647.4 685274661 684385300 683603287 683120787 682306230 681371450 680936337 680494487 679600060 678859293 678370416
2667.8 678370416 677569270 676750124 676377535 675879836 674956083 674242437 673762679 672994614 672260225 671929657
2688.2 671929657 671453416 670625031 669985235 669464946 668669820 668000221 667677104 667087555 666171968 665519834
2708.6 665519834 664992869 664196074 663515270 663111150 662434876 661562145 661023974 660536408 659755826 659127593
2729 659127593 658754885 658138990 657395840 656940401 656438768 655676544 655195475 654981732 654436529 653735280
2749.4 653735280 653280497 652739525 652013540 651565790 651230276 650552213 649869442 649455011 648873985 648127317
2769.8 648127317 647682607 647292733 646531403 645755649 645205319 644483149 643640280 643105745 642599046 641729057
2790.2 641729057 640866816 640198767 639340580 638417482 637766361 637008727 635916710 634959400 634170711
2808.6F34170711j073837j180232r05931r37283j187861j114905j096070j375496j358211
2826.9F23940885j126826j336515j655817j575649j605689k037108k346635k542555
2843.2F09714091l106594l534377l121018k283097j436293m89711J35064l0637m01855
2861.6E95445573m94480q05378j242816j154781q69870r16123r04739o19352n51045
2879.9E87886989o83308n68032n19514q53360j014947q79586r76503j152933j029312
2898.3E80209494r97246j277148j392544j378417j712024k111793k212166k437234
2914.6E66690922k763927k489388j808167j358926q71837j06216L53754M00782O90996
2933E58737993J169384J344263J512707J872003J861214J443804J148939R24527N78940
$$ plain form
2808.6 634170711 633096874 631916642 631010711 630073428 628885567 627770662 626674592 625299096 623940885
2826.9 623940885 622814059 621477544 619821727 618246078 616640389 614603281 612256646 609714091
2843.2 609714091 606607497 603073120 599952102 597669005 596232712 595743001 595878065 595847428 595445573
2861.6 595445573 594951093 594145715 592902899 591748118 590878248 589962125 589057386 588438034 587886989
2879.9 587886989 587203681 586635649 586116135 585262775 584247828 583368242 582391739 581238806 580209494
2898.3 580209494 579212248 577935100 576542556 575164139 573452115 571340322 569128156 566690922
2914.6 566690922 563926995 561437607 559629440 558270514 557398677 557292461 557646215 558046997 558737993
2933 558737993 559907377 561251640 562764347 564636350 566497564 567941368 569090307 570014834 570593774
2951.3E70593774M03822M82023M84645N18382Q85546J223206J321733J604259J977802
2969.7E79495192J924276J685202J697838J671017J409351J249791J190662R11295
2986E91234624O59347P51376O80506K48015J08362J27017k55227n55754m90010n65528
3006.4E91942728o78540m15921k50339o00994q56459p20620p66397r45032q39412q13603
3026.8E85055411j017153r55582p29978r19998j178682r17554p24554j020014j179695
3045.1E76412201j044333j059294j107812r44733r32932j175165j153291r24468r48846
3063.5E67121327r37343p26580q05557j067162r54151o74367p30395q64804p68304
3081.9E59592664p89702r90569r28402p68125r27508j005113p69854p52509r67800
$$ plain form
2951.3 570593774 570997596 571479619 571964264 572482646 573368192 574591398 575913131 577517390 579495192
2969.7 579495192 581419468 583104670 584802508 586473525 587882876 589132667 590323329 591234624
2986 591234624 591893971 592645347 593325853 593573868 593682230 593809247 593554020 592998266 592508256 591942728
3006.4 591942728 591264188 590848267 590597928 589996934 589140475 588419855 587653458 586708426 585869014 585055411
3026.8 585055411 584038258 583082676 582352698 581432700 580254018 579336464 578611910 577591896 576412201
3045.1 576412201 575367868 574308574 573200762 572256029 571323097 570147932 568994641 568070173 567121327
3063.5 567121327 566183984 565457404 564651847 563584685 562630534 561956167 561225772 560360968 559592664
3081.9 559592664 558802962 557812393 556883991 556115866 555188358 554183245 553413391 552660882 551693082
3100.2E51693082r80139r23812r69768q65459p48694r00924r94027q36611q50737j155496
3120.6E42467415j220047j010060j040698j145958j055360j088620j210987j023948
3136.9E33671737q30949j105785j361966j213908j125992j174688j032174r79364j247525
3155.3E23599386j344263j173914j208007j332164j158178r94503j171708j311720
3171.6E13904929j218855j225353j280307j117230j033425j224101j296758j150012
3187.9E04358888j141131j196265j074434j059264j231789j198083j020283j068115
3204.2D95369524j140118j003951r77725j132816j116812r95010j061112j085966r20475
3222.6D85935539r36091j107544j021623q30591r12487j098991j087725j038402j078427
$$ plain form
3100.2 551693082 550712943 549789131 548819363 547953904 547205210 546304286 545310259 544473648 543622911 542467415
3120.6 542467415 541247368 540237308 539196610 538050652 536995292 535906672 534695685 533671737
3136.9 533671737 532840788 531735003 530373037 529159129 528033137 526858449 525826275 524846911 523599386
3155.3 523599386 522255123 521081209 519873202 518541038 517382860 516388357 515216649 513904929
3171.6 513904929 512686074 511460721 510180414 509063184 508029759 506805658 505508900 504358888
3187.9 504358888 503217757 502021492 500947058 499887794 498656005 497457922 496437639 495369524
3204.2 495369524 494229406 493225455 492247730 491114914 489998102 489003092 487941980 486856014 485935539
3222.6 485935539 484999448 483891904 482870281 482039690 481127203 480028212 478940487 477902085 476823658
3240.9D76823658r95577q91864r88513j055271r60141r60916j060844j038939j033067
3259.3D67838526j137614j057327q55685q55892q78364q00968q69363j006246q94397
3277.7D59482670p18951q32826r69142q34644p09712p02709o05375n65201p33972q48710
3298D51961428p61539o72459o42360n85943o64324r21428r89020q06987q10534r38475
3318.4D44168359q23021o94036q28326j005918j034141j007109r53973q11010p39456
3336.8D36271369q94010j023411r87709j032829j034677q15094p88837j042337j085192
3355.2D27567273q89957q45164r17136q38429p03633p18236q47727j031399j109033
3373.5D19666559r18478o74367o55294q02755p99954o32077n13554m00722l69459n98908
$$ plain form
3240.9 476823658 475828081 474936217 473947704 472892433 471932292 470971376 469910532 468871593 467838526
3259.3 467838526 466700912 465643585 464787900 463932008 463053644 462252676 461383313 460377067 459482670
3277.7 459482670 458763719 457930893 456961751 456127107 455417395 454714686 454109311 453544110 452810138 451961428
3298 451961428 451199889 450527430 449885070 449299127 448634803 447713375 446724355 445917368 445106834 444168359
3318.4 444168359 443345338 442651302 441822976 440817058 439782917 438775808 437821835 437010825 436271369
3336.8 436271369 435377359 434353948 433366239 432333410 431298733 430483639 429694802 428652465 427567273
3355.2 427567273 426677316 425832152 424915016 424076587 423372954 422654718 421806991 420775592 419666559
3373.5 419666559 418748081 418073714 417418420 416615665 415815711 415183634 414670080 414269358 413899899 413300991
3393.9D13300991p56890m90427k77817n34117p07775m60446l17902m06414l98695m19528
3414.3D08530980m93616l23832o2137o2466j54823m8041R2446Q1808J71840L64751
3434.7D08096910K41845q9436j05203J26064K67387L98904M83364M03344L78132N10365
3455.1D10711676O24984O77795O91950P10249Q16345R17941Q10564N21690M82738Q01563
3475.5D17767495J061857R90301P75129P66426R09179R50635J000285J087368J045405
3493.8D26354080J065404J127511J065999J084268J133710J012326R64790J156837
3510.2D34964925J351386J294792J152366J199753J333326J433432J388848J264125
3526.5D45382953J292824J458675J622528J683146J575917J452774J588374J796245
$$ plain form
3393.9 413300991 412544101 412053674 411775857 411241740 410533965 410073519 409755617 409349203 408950508 408530980
3414.3 408530980 408037364 407713532 407651395 407588929 407434106 407386065 407478511 407560319 407732159 408096910
3434.7 408096910 408338755 408249319 408144116 408270180 408537567 408936471 409419835 409823179 410201311 410711676
3455.1 410711676 411336660 412014455 412706405 413416654 414232999 415150940 415961504 416483194 416965932 417767495
3475.5 417767495 418829352 419819653 420594782 421361208 422270387 423221022 424221307 425308675 426354080
3493.8 426354080 427419484 428546995 429612994 430697262 431830972 432843298 433808088 434964925
3510.2 434964925 436316311 437611103 438763469 439963222 441296548 442729980 444118828 445382953
3526.5 445382953 446675777 448134452 449756980 451440126 453016043 454468817 456057191 457853436
3542.8D57853436J857490J810312J638830J548558J726032J828759J802683J980394
3559.1D72046494K134622J864850J644045K212584K639920K263874K121329K379626
3575.4D89307344K474219K458632K536326K437920K255350K520144K801359K511263
3591.7E09302557K415120K721906K866208K812028K886355K847374K587259K632319
3608.1E31071126K836466K881825L004849K963007L043413L440142L207683K612829
3624.4E55061340K226174K772987L801406L438532K979159K895415K832353K838612
3640.7E78845978K789378K582610K455473L016412L613114K899170K310574K802611
3657F01315320L032207K500474K090395J915455J639068J675308K189636J967967J810073
$$ plain form
3542.8 457853436 459710926 461521238 463160068 464708626 466434658 468263417 470066100 472046494
3559.1 472046494 474181116 476045966 477690011 479902595 482542515 484806389 486927718 489307344
3575.4 489307344 491781563 494240195 496776521 499214441 501469791 503989935 506791294 509302557
3591.7 509302557 511717677 514439583 517305791 520117819 523004174 525851548 528438807 531071126
3608.1 531071126 533907592 536789417 539794266 542757273 545800686 549240828 552448511 555061340
3624.4 555061340 557287514 560060501 563861907 567300439 570279598 573175013 576007366 578845978
3640.7 578845978 581635356 584217966 586673439 589689851 593302965 596202135 598512709 601315320
3657 601315320 604347527 606848001 608938396 610853851 612492919 614168227 616357863 618325830 620135903
3675.4F20135903K090574J832127J623869J531899J378358J427531J474500J262605
3691.7F32757366J146257J094102R50933Q34107R82702J122296Q39055M57942L71993
3710F40556753P81536J188099J019359O07967L15845L20852M27246N02110N82277M97282
3730.4F46799326L47316L86179P28309Q31187L41713j29998K25246O34134R7156N5670
3750.8F50316238P48098P69258M29034M00007N14686L25561J46031J31011J83880M92633
3771.2F54456437O19411L38853J24156J96397K53022J40548K03192L42548L06964K07007
3791.6F57188535K2292n9307P0751j0848J04964L35931Q0348J50203L90291K62440
3812F58535600L1948M9472M8697j83285K19345M70281K20895J99795J22308J7047p808
$$ plain form
3675.4 620135903 622226477 624058604 625682473 627214372 628592730 630020261 631494761 632757366
3691.7 632757366 633903623 634997725 635948658 636782765 637765467 638887763 639726818 640184760 640556753
3710 640556753 641338289 642526388 643545747 644153714 644469559 644790411 645217657 645719767 646302044 646799326
3730.4 646799326 647146642 647532821 648261130 649092317 649434030 649304032 649529278 650163412 650260568 650316238
3750.8 650316238 651064336 651833594 652262628 652662635 653177321 653502882 653648913 653779924 653963804 654456437
3771.2 654456437 655075848 655414701 655538857 655735254 655988276 656128824 656332016 656674564 656981528 657188535
3791.6 657188535 657210827 657151520 657222271 657211423 657316387 657652318 657732666 657882869 658273160 658535600
3812 658535600 658567548 658617020 658665717 658482432 658701777 659172058 659392953 659592748 659715056 659732103 659724295
3834.4F59724295j95980j84953J62959L31819L54469K43902q1301o37948p97332M72308
3854.8F59392238R66429L14415j67072k68161m828N5492j22845R1314K31266J56522
3875.2F60644770p75k11716q523J55627J00792O7591k13384j91331J90437J02281k20835
3897.7F60414934k85625j82987n8114J29402J78158R7453N6208o9738k41875j80304
3918.1F59857512N483j1980m8340N7101p331j94728j65642Q584M470r9540q0645j2636
3942.5F59312308r1613k46882k09153p2896M709N1558m113j20461j54316j03057p5996
3965F58290088l9995J20p5400j58012j16408p5161p9453J5735J03653n4539k57551
3987.4F57553077j78099P510J5974m7028j6868
$$ plain form
3834.4 659724295 659528315 659343362 659506321 659838140 660192609 660436511 660355210 659717262 658919930 659392238
3854.8 659392238 660358667 660673082 660506010 660237849 660233021 660288513 660165668 660256982 660488248 660644770
3875.2 660644770 660643995 660432279 660423756 660579383 660680175 660747766 660534382 660343051 660533488 660635769 660414934
3897.7 660414934 660129309 659946322 659888208 660017610 660195768 660293221 660349429 660279691 660037816 659857512
3918.1 659857512 659862995 659851015 659802675 659859776 659852445 659657717 659492075 659500659 659505129 659405589 659324944 659312308
3942.5 659312308 659220695 658973813 658764660 658691764 658696473 658748031 658743918 658623457 658469141 658366084 658290088
3965 658290088 658250093 658250213 658174813 658016801 657900393 657825232 657745779 657761514 657865167 657810628 657553077
3987.4 657553077 657374978 657382488 657398462 657351434 657334566
3997.6F57334566
$$ plain form
3997.6 657334566
##END=$$ End of the data block
