##TITLE=$$ Begin of the data block
##JCAMP-DX=5.00 $$ ACD/SpecManager v 10.08
##SPECTROMETER/DATA SYSTEM=Alpha
##DATE=11 Nov 2014 09:02:30
##DATA TYPE=INFRARED SPECTRUM
##DATA CLASS=XYDATA
##ORIGIN=
##OWNER=
##NPOINTS=1765
##FIRSTX=399.76428223
##LASTX=3997.64306641
##MAXX=3997.64306641
##MINX=399.76428223
##MAXY=0.77914506
##MINY=0.37875143
##XFACTOR=1.0000000000
##YFACTOR=1.000000000000000e-9
##FIRSTY=0.60073489
##DELTAX=2.03961372
##XUNITS=1/CM
##YUNITS=ARBITRARY UNITS
##XYDATA=(X++(Y..Y))
399.8F00734890l061474k138078m75526l79860j612664j521527m7624M45425r97364
418.1E90946198k259315r18984k04086j169920j615584p38800L12746J57475q69035
436.5E83640695p19905N95092Q25704l89994j060962n34654K62797J24812j038492
454.8E81705093j506924o16431k96295j231611j666009q01683M2260m70877j521587
473.2E73635936j272261j78576K45214l82364j079083p82668j6809n4776r37820j256943
493.6E67919850n60403j70886p58827j428067j211524o79076q54671j666904k040744
511.9E58548748j487255r75489j367271j964331j501739m22120j78277q56519j060069
530.3E48735678l72886L10421L47793J60694O23464J458824J529813N63502l35872
$$ plain form
399.8 600734890 597673416 595535338 595059812 594679952 593067288 591545761 591498137 591943562 590946198
418.1 590946198 588686883 587767899 587563813 586393893 584778309 584039509 584352255 584509730 583640695
436.5 583640695 582920790 583515882 584341586 583951592 582890630 582355976 582618773 582743585 581705093
454.8 581705093 580198169 579581738 579285443 578053832 576387823 575586140 575628400 575157523 573635936
473.2 573635936 572363675 572185099 572430313 572047949 570968866 570186198 570169389 570114613 569176793 567919850
493.6 567919850 567359447 567188561 566429734 565001667 563790143 563111067 562256396 560589492 558548748
511.9 558548748 557061493 556086004 554718733 552754402 551252663 550830543 550652266 549795747 548735678
530.3 548735678 548362792 548673213 549021006 549181700 549805164 551263988 552793801 553357303 553021431
548.7E53021431j31369L74318J2874q03709p81536J46866L87370n63502j237035q51214
569.1E49574494l40640m92215o96600j04487Q41558J027227M11927N1618M35293P35700
589.4E51443875K25305m54843l08752L53039M99427j29402n79417k25126J85311L5524
609.8E51044941l51965k77460L40938Q54850R78291J001954J242817J554370J429260
628.2E57817996R68098Q78930J160682J254498J084149R71318J067936J293242J439810
646.6E67936659J371384J172184J068056J146436J018941N30064K18749L69192N03718
664.9E75335383M95851Q17895J196504J429915J562477J416802J315475J417040J458466
683.3E86445808J150370O75201N24700O64890N45263Q2135j75952J32620O38962Q84533
$$ plain form
548.7 553021431 552890062 553264380 553277254 552473545 551692009 551838875 552226245 551662743 550425708 549574494
569.1 549574494 549233854 548741639 548045039 547940552 548782110 549809337 550221264 550272882 550708175 551443875
589.4 551443875 551669180 551214337 550905585 551258624 551758051 551628649 551049232 550824106 551009417 551044941
609.8 551044941 550692976 550415516 550756454 551611304 552589595 553591549 554834366 556388736 557817996
628.2 557817996 558786094 559665024 560825706 562080204 563164353 564135671 565203607 566496849 567936659
646.6 567936659 569308043 570480227 571548283 572694719 573713660 574243724 574462473 574831665 575335383
664.9 575335383 575831234 576649129 577845633 579275548 580838025 582254827 583570302 584987342 586445808
683.3 586445808 587596178 588271379 588796079 589460969 590006232 590088367 589912415 590045035 590683997 591568530
703.7E91568530J004576J293421J629472J777112J717389J641750J895547K394796
720F04922593K575278K410769K459288K652109K417087J795888J398564J447141J541972
738.3F23620689J257062P79867P20382R55760Q21889K70962n1617J09315J71900j59979
758.7F28496230l21508j252L62516M09126K32458K74718O52909Q72076P38084Q87096
779.1F32602453J804292K854169L196657L004193K958178L097237K876520K130270
795.4F54523969J449287J303970J317859P80821j44601n27859k26676m1246l86656
813.8F58048868n79774K2888Q21352P83741L8624k68697L65078J099408J085579Q03649
834.2F62220716J120031J806438J825989R35137Q8751p6175j40726p53939j386583
$$ plain form
703.7 591568530 592573106 593866527 595495999 597273111 598990500 600632250 602527797 604922593
720 604922593 607497871 609908640 612367928 615020037 617437124 619233012 620631576 622078717 623620689
738.3 623620689 624877751 625657618 626378000 627333760 628155649 628426611 628374994 628484309 628656209 628496230
758.7 628496230 628174722 628173470 628535986 628945112 629177570 629452288 630105197 630977273 631715357 632602453
779.1 632602453 634406745 637260914 640457571 643461764 646419942 649517179 652393699 654523969
795.4 654523969 655973256 657277226 658595085 659375906 659231305 658703446 658476770 658435524 658048868
813.8 658048868 657469094 657491982 658313334 659097075 659135699 658867002 659232080 660331488 661417067 662220716
834.2 662220716 663340747 665147185 666973174 667908311 667997062 667920887 667780161 667026222 665639639
852.6F65639639j185417m61757j87278m08232k83003N55455J424611J505554R63866
870.9F67563438O39141P55012O65844j06037j147330j690566j705647j897514k441883
889.3F60634458k606392k032041j313270j091599j213789j118124q50021j038432j922071
907.6F47448719k818406l057242k906262k946079l121853k746642j601755n30303l40223
926F27379954o72877o56843l15726m87387j431644k294779k398848k280593k750278
944.3F14090979l578782l876388l499508l288627l760039m289926m180192l755570
960.7E83861947l800809m393280m848122m916370n217791o151259p137000p412196
977E39985120p157683p134914p399738p215858o273627n146772m452139m097223l570974
$$ plain form
852.6 665639639 664454222 663992465 663805187 663396955 663113952 663669407 665094018 666599572 667563438
870.9 667563438 668202579 668957591 669623435 669517398 668370068 666679502 664973855 663076341 660634458
889.3 660634458 658028066 655996025 654682755 653591156 652377367 651259243 650409222 649370790 647448719
907.6 647448719 644630313 641573071 638666809 635720730 632598877 629852235 628250480 627720177 627379954
926 627379954 626707077 626050234 625734508 625247121 623815477 621520698 619121850 616841257 614090979
944.3 614090979 610512197 606635809 603136301 599847674 596087635 591797709 587617517 583861947
960.7 583861947 580061138 575667858 570819736 565903366 560685575 554534316 547397316 539985120
977 539985120 532827437 525692523 518292785 511076927 504803300 499656528 495204389 491107166 487536192
995.3D87536192k875477k541930k725601k974212k934605k773374k809614k954930
1011.6D64946449k735317k081543j467228j205593j121521q60483l65585M8429J30206
1030D55287814N6565R6261J80215k5332n90533j111746j213282j013577q69244p17312
1050.4D50079829k10554N98341J269579J540393J596630J808792K001047J604259O14166
1068.8D60902482m07397q80749o27756N8979R55790K065957L151774L768206L682733
1087.1D72670019L144562K615034K103657J312554M11481p2092L7342N01424R99659
1105.5D83723640J456917K035469K720832L199488L228277K946675K725810K618790
1121.8E04655898K338886J931310J819193K128303K283335J782715R39429K55763j54256
$$ plain form
995.3 487536192 484660715 482118785 479393184 476418972 473484367 470710993 467901379 464946449
1011.6 464946449 462211132 460129589 458662361 457456768 456335247 455474764 455109179 455157608 455287814
1030 455287814 455344379 455440640 455620855 455595523 455004990 453893244 452679962 451666385 450797141 450079829
1050.4 450079829 449869275 450467616 451737195 453277588 454874218 456683010 458684057 460288316 460902482
1068.8 460902482 460495085 459614336 458986580 459045559 460001349 462067306 465219080 468987286 472670019
1087.1 472670019 475814581 478429615 480533272 481845826 482257307 482185215 482222557 482723981 483723640
1105.5 483723640 485180557 487216026 489936858 493136346 496364623 499311298 502037108 504655898
1121.8 504655898 506994784 508926094 510745287 512873590 515156925 516939640 517879069 518134832 517980576
1140.1E17980576m35710o33955n51820n8949O78479J341999J797199K307952L132939
1158.5E25558710M109383M959821N673945O436229P251203P805586P844865P521570
1174.8E77161312P207334O957114O410122N450249M522562L983914L502012K565384
1191.1F17760003J298129K96712j95205n38051r99034j304090j097738o02663m36962
1209.5F14181101q01086j239240j372099j464665j896978k475082k665103k391279
1225.8E99875569k127111k164542k182961j772284j142741q43048q73088p09892j68681
1244.2E87891221L54409M69268L33428L75390O58453Q17716O76274N97835R09745J337230
1264.6E94420969J426399J204133J090288J281500J397133J052022M99308K84851M50849
$$ plain form
1140.1 517980576 517544866 516910911 516359091 516300142 516978621 518320620 520117819 522425771 525558710
1158.5 525558710 529668093 534627914 540301859 546738088 553989291 561794877 569639742 577161312
1174.8 577161312 584368646 591325760 597735882 603186131 607708693 611692607 615194619 617760003
1191.1 617760003 619058132 619354844 619159639 618621588 617622554 616318464 615220726 614618063 614181101
1209.5 614181101 613380015 612140775 610768676 609304011 607407033 604931951 602266848 599875569
1225.8 599875569 597748458 595583916 593400955 591628671 590485930 589642882 588769794 588059902 587891221
1244.2 587891221 588245630 588714898 589048326 589423716 590082169 590899885 591576159 592173994 593083739 594420969
1264.6 594420969 595847368 597051501 598141789 599423289 600820422 601872444 602371752 602656603 603107452
1282.9F03107452N07296J99437j69933k70426l04878o73413j293540j677871j674116
1301.3E97750008j677811k012551k421737k470851k232134k052724k018333j896977
1317.6E80966890j445770r10938q28266j134396j291990j112163r16183r58681j040161
1336E71328342p86185j36376L35932L00944J99616L37839M63963K53975j46270l48508
1356.4E71803272l51072m93168q37744j098036j134933j038432r47952j098931j288891
1374.7E63514113j248657j555205k765357l554285j908362R32873J616120K06828j017094
1393.1E54220974j590251j628578j567602j514793j427233j167476p39873n40793m77552
1411.4E43566823l15130n5194L66748R93132J217723J394272J744151J769543J637161
$$ plain form
1282.9 603107452 603614748 603814185 603644252 603373826 603068948 602395535 601101995 599424124 597750008
1301.3 597750008 596072197 594059646 591637909 589167058 586934924 584882200 582863867 580966890
1317.6 580966890 579521120 578610182 577781916 576647520 575355530 574243367 573327184 572368503 571328342
1336 571328342 570542157 570405781 570741713 571042657 571242273 571580112 572044075 572298050 572151780 571803272
1356.4 571803272 571452200 570959032 570121288 569023252 567888319 566849887 565901935 564803004 563514113
1374.7 563514113 562265456 560710251 557944894 554390609 552482247 553415120 555031240 555238068 554220974
1393.1 554220974 552630723 551002145 549434543 547919750 546492517 545325041 544585168 544044375 543566823
1411.4 543566823 543251693 543196499 543563247 544556379 545774102 547168374 548912525 550682068 552319229
1429.8E52319229J376032J017273J091301J353145R93788O58930N92649N77867N30660
1448.1E60510874L98457K12669K75314J208544K685487K571941K304256L124952L948748
1466.5E77241242L907621M575014O809771P684767O362498N059183M170358L486752
1482.8F19297206K401889J146495J20103n63621j182735k156377l297627l609657l264368
1501.2F08891308l125429l899216n057931l721714k701462k812028k873301k447963
1517.5E82252264j595378j054764j040280j420676j755417j640677j615107j780451
1533.8E70349514j640200j587391j680672j106560n47469k86579M4822M74692P65204
1552.2E64785361P13468N71787J261235K254486J142978K91705P9275K6464n0187n22733
$$ plain form
1429.8 552319229 553695261 554712534 555803835 557156980 558150768 558809698 559402347 559980214 560510874
1448.1 560510874 560909331 561122000 561397314 562605858 565291345 567863286 570167542 573292494 577241242
1466.5 577241242 581148863 585723877 592533648 600218415 606580913 611640096 615810454 619297206
1482.8 619297206 621699095 622845590 622965693 622402072 621219337 619062960 615765333 612155676 608891308
1501.2 608891308 605765879 601866663 596808732 593087018 590385556 587573528 584700227 582252264
1517.5 582252264 580656886 579602122 578561842 577141166 575385749 573745072 572129965 570349514
1533.8 570349514 568709314 567121923 565441251 564334691 563787222 563500643 563545465 564020157 564785361
1552.2 564785361 565498829 566070616 567331851 569586337 570729315 571021020 571100295 571126759 571076572 570553839
1572.6E70553839j232028j721024j648128j918853k614379l073632l275395l471076
1588.9E51599324l808141m000187l837407l435492l244281l404558l501117l312766
1605.2E23055375l202975l413081l564597l502607l721714m070520l431499l291816
1621.5D94856566l790498l604084l445893l439695k861917k344847k195447j505703
1637.8D71668482q70407n85943l70145j25855K24530K58416M42744J418650J534283
1656.2D73594755J269579J607597K405673K949506K650350K999634M105300M162818
1672.5D95745212M515439N184889M752994M357039N199492P502020P014394N859553
1688.8E40131032O266594N884290O330848P187247P254899Q244693O507218N107164
$$ plain form
1572.6 570553839 569321811 567600787 565952659 564033806 561419427 558345795 555070400 551599324
1588.9 551599324 547791183 543790996 539953589 536518097 533273816 529869258 526368141 523055375
1605.2 523055375 519852400 516439319 512874722 509372115 505650401 501579881 498148382 494856566
1621.5 494856566 491066068 487461984 484016091 480576396 477714479 475369632 473174185 471668482
1637.8 471668482 470798075 470212132 469841987 469716132 469940662 470199078 470641822 472060472 473594755
1656.2 473594755 474864334 476471931 478877604 481827110 484477460 487477094 491582394 495745212
1672.5 495745212 500260651 505445540 510198534 514555573 519755065 527257085 534271479 540131032
1688.8 540131032 546397626 552281916 558612764 565800011 573054910 581299603 587806821 592913985
1705.1E92913985N209029M343986L314555K532840K151251K594828K634406J797200
1721.5F17492080J375019J369417J234293J035511Q40605J235246J792133J542569
1737.8F27916873J722455K235054K605618L058433L582239M462302N109310M724622
1754.1F55416906M708707M950285M746258N081892M864216M079402L726125L539443
1770.4F91113234L873765L782392K854883K376020K393127K355516K228081K014935
1786.7G12991953J571476J476884K029538K006531J493931J414478J711726J800954
1803G26497471J510859J291334J318753J467705J386523J152933J129985J256943J142919
1821.4G38155425R06825R09984R44495J096904J255751R95338P88629Q80599Q12948
$$ plain form
1705.1 592913985 598123014 602467000 605781555 608314395 610465646 613060474 615694880 617492080
1721.5 617492080 618867099 620236516 621470809 622506320 623346925 624582171 626374304 627916873
1737.8 627916873 629639328 631874382 634480000 637538433 641120672 645582974 650692284 655416906
1754.1 655416906 660125613 665075898 669822156 674904048 679768264 683847666 687573791 691113234
1770.4 691113234 694986999 698769391 701624274 704000294 706393421 708748937 710977018 712991953
1786.7 712991953 714563429 716040313 718069851 720076382 721570313 722984791 724696517 726497471
1803 726497471 728008330 729299664 730618417 732086122 733472645 734625578 735755563 737012506 738155425
1821.4 738155425 739062250 739972234 740916729 742013633 743269384 744264722 745053351 745933950 746746898
1839.8G46746898N37634O54995J065314J033604Q12888O52492N99861O79255O97017
1858.1G53479958O17742N19931M39704L98219N57124P48694O45936N56409N69403M98712
1878.5G59031832L85761M14253N23925M71651L71337M28319M57168M26829M14073L41356
1898.9G63266504L20673L81231L88980K91169K43306L31700L45289K09213J69694K78950
1919.3G66226709L07202L64006L75807K17915J33633J81794K20061J62661Q2910K9564
1939.7G68302262Q0466K14040K01047R8467R9837J47343J46330J27792J14560J39773
1960.1G69671917J51753O7652L814R2984J89721J61469N9843j371N8651J33932J26302
1982.5G70716667M3273k7180l0517K3484R1076O4731M053L3617O0856k6464j03057
$$ plain form
1839.8 746746898 747284532 747939527 749004841 750038445 750851333 751503825 752103686 752782941 753479958
1858.1 753479958 754097700 754617631 755057335 755455554 756012678 756761372 757407308 757963717 758533120 759031832
1878.5 759031832 759417593 759831846 760355771 760827422 761198759 761627078 762084246 762511075 762925148 763266504
1898.9 763266504 763587177 763968408 764357388 764648557 764891863 765223563 765568852 765778065 765947759 766226709
1919.3 766226709 766533911 766897917 767273724 767491639 767625272 767807066 768027127 768189788 768272698 768302262
1939.7 768302262 768382728 768596768 768797815 768896282 768996119 769143462 769289792 769417584 769532144 769671917
1960.1 769671917 769823670 769891322 769895136 769988120 770177841 770339310 770399153 770397782 770456433 770590365 770716667
1982.5 770716667 770759940 770732760 770702243 770725727 770816803 770881534 770885587 770919204 770980060 770953596 770850539
2005G70850539p0452K861j3829j37806k02894r9540j371q4161k05100k15053j37151
2027.4G69686043p9274j04487j61946j39415n5611l2008q3267j40369j07229j4246
2047.8G68768191l576r8944j21474K6465J47700O1869p3969l4988J10388J34170k3663
2070.2G68892169j20461J1742J76370J10925p0513o6280J21951K02715J3113j52826
2090.6G69118905j4305K10106J63257p2062j24573Q0466K34127J01209j01030l7968
2111G69558132J87277K08378k38j11938O3301K67684J62840p9095l4631K45750K98083
2133.5G70765543M3452j07348P4208L12924K49505j2636n7340J91987L43382J57654
2153.9G71961331n8114N2035L16441L13639M3691m1426K13087M24564L00526N7221
$$ plain form
2005 770850539 770780087 770782948 770769119 770631313 770428419 770328879 770327508 770243347 770038247 769823194 769686043
2027.4 769686043 769606769 769502282 769340336 769200921 769145310 769113302 769030035 768889666 768782437 768768191
2047.8 768768191 768764615 768665671 768544197 768570662 768718362 768780231 768706262 768671274 768781662 768915832 768892169
2070.2 768892169 768771708 768783450 768959820 769070745 769000232 768933952 769055903 769258618 769271731 769118905
2090.6 769118905 769104600 769314706 769477963 769405901 769281328 769361794 769595921 769697130 769596100 769558132
2111 769558132 769745409 769953787 769953549 769841611 769904912 770172596 770335436 770256341 770221710 770467460 770765543
2133.5 770765543 770808995 770701647 770775855 771088779 771338284 771325648 771268308 771460295 771803677 771961331
2153.9 771961331 771903217 771955252 772271693 772585332 772629023 772587597 772800684 773225248 773525774 773582995
2174.3G73582995Q5056L25262L71039J23501j1444K15113M32074K85149l338n901K65598
2196.7G75665104L76821J61946j6213J19865L41356K90752M4047k6464J53959K83122
2217.1G77394295J47700m3333n9K04861K67923R4235n4002L4809J96934J53780l3975
2239.5G78363168n9485J14679J99020P1943o3658j9610J32978J59204Q524o8248O2526
2262G78901041J53064N1797q1122p0811O2526J18077J0490j08957o0916N7220K7359
2284.4G79059768j24872k25544j69575o6579r3579k16842k59220j61529r3937j92821
2304.8G77455270l10182l03269k20895j86741l04699m60148m35114k48968j55747k39492
2325.2G74590015l09705k70307k24591k73883l24667k67922j71721j20998m3332O8068
$$ plain form
2174.3 773582995 773668051 773993313 774364352 774487853 774476409 774691522 775123596 775408745 775405407 775399506 775665104
2196.7 775665104 776041925 776203871 776187658 776307523 776648879 776939631 776983678 776957214 777111173 777394295
2217.1 777394295 777541995 777498662 777498603 777703464 777971387 778065622 778011620 778046429 778243363 778397143 778363168
2239.5 778363168 778303683 778418362 778617382 778689325 778625667 778606057 778739035 778898239 778906763 778838515 778901041
2262 778901041 779054105 779105902 779024780 778953969 779016495 779134572 779145062 779036105 778975189 779032409 779059768
2284.4 779059768 778934896 778709352 778539777 778473198 778379619 778162777 777903557 777742028 777648091 777455270
2304.8 777455270 777145088 776841819 776620924 776434183 776129484 775669336 775234222 774985254 774829507 774590015
2325.2 774590015 774280310 774010003 773785412 773511529 773186862 772918940 772747219 772626221 772582889 772650957
2345.6G72650957j73151o56903q42750o63281m50015k89678k18511k60353k12669n4718
2366G68828928M7505J13130J38700N7042L099L8207L1888r6738k34783k48909k18212
2388.4G68459857k85745l95358m13418l29434k80142l84510n11110m90486l87252l52621
2408.8G64629781m32849n19931m78566l99530m47273n74052o03259m85837l97504m67777
2429.2G59823203n80490n68687m63903m44532n44488n92292n14269m66942n36323o18696
2449.6G54492581o06179n16117m97162n77331o30557o20366n61952n54979o47962o77049
2470G48602927n74172m95791n66423o62327o41346n77092n66185o15596o46890n97238
2490.4G42659867n30362n22197n86271o30259n53430m86493n48422o10411n53012m36127
$$ plain form
2345.6 772650957 772477806 771820903 770978153 770314872 769864857 769575179 769356668 769096315 768883646 768828928
2366 768828928 768876433 768989563 769128263 769185305 769188404 769226611 769258499 769161761 768926978 768678069 768459857
2388.4 768459857 768174112 767778754 767365336 767035902 766755760 766371250 765860140 765369654 764982402 764629781
2408.8 764629781 764196932 763677001 763198435 762798905 762351632 761777580 761174321 760688484 760290980 759823203
2429.2 759823203 759242713 758674026 758210123 757765591 757221103 756628811 756114542 755647600 755111277 754492581
2449.6 754492581 753886402 753370285 752873123 752295792 751665235 751044869 750482917 749927938 749279976 748602927
2470 748602927 748028755 747532964 746966541 746304214 745662868 745085776 744519591 743903995 743257105 742659867
2490.4 742659867 742129505 741607308 741021037 740390778 739837348 739350855 738802433 738192022 737639010 737202883
2510.8G37202883m02212n07296o06179n34832m20630m60625n69463n61058m44770l98099
2531.2G32297719m85898n94675n91219m80353m29690m92573n51939n36323m71711m54843
2551.6G27208495n25713n82278n38826m86373n39303o19173n81086m61459m30823n37753
2572G21905708o39617o17683n53072n74410o29484o06358n36680n28872n98789o74486
2592.4G15946257o59466n46992n10811o25432p06136o49929n82576o24537p12812o93679
2612.8G09633887n93722n58794o36339p50839p49529o39915o11127p12573p99179p80106
2633.2G02801764p08342o91831p46369p69496p01308o49214p34091q22782p69496o78361
2653.5F95530474o85334p64310p87437p19846o44505o57797p39932p51674o71744o60718
$$ plain form
2510.8 737202883 736800671 736293375 735687196 735152364 734731734 734271109 733701646 733140588 732695818 732297719
2531.2 732297719 731811821 731217146 730625927 730145574 729715884 729223311 728671372 728135049 727663338 727208495
2551.6 727208495 726682782 726100504 725561678 725075305 724536002 723916829 723335743 722874284 722443461 721905708
2572 721905708 721266091 720648408 720095336 719520926 718891442 718285084 717748404 717219532 716620743 715946257
2592.4 715946257 715286791 714739799 714228988 713603556 712897420 712247491 711664915 711040378 710327566 709633887
2612.8 709633887 709040165 708481371 707845032 707094193 706344664 705704749 705093622 704381049 703581870 702801764
2633.2 702801764 702093422 701401591 700655222 699885726 699184418 698535204 697801113 696978331 696208835 695530474
2653.5 695530474 694845140 694080830 693293393 692573547 691929042 691271245 690531313 689779639 689107895 688447177
2673.9F88447177p32183p56323p03872o21557o23941p16746p34806o51062o09517o72817
2694.3F81624353p37429p07686o52313o77168p58052q04782p67171p12276p34687p74681
2714.7F74298108p48694p18713p24733p32005p27594p01665o58274o61492p14660p06673
2735.1F67203605o01888n18083n34415n83947o10173n94616n73098o16014o42360n71847
2755.5F61357164n18560n93483o83725o52671n80907n95093o67572o94454o67810o85215
2775.9F55017674p37429p41899p55787p92622p88689q09371q78036r17018r14693r04858
2796.3F46777272r31501r99332j054465j082719j109183j134812j161099j213014j283646
2814.7F36807501j334309j342118j344204j404107j538634j705170j796901j804173
$$ plain form
2673.9 688447177 687714994 686958671 686254799 685633242 685009301 684292555 683557749 682906687 682297170 681624353
2694.3 681624353 680886924 680179238 679526925 678849757 678091705 677286923 676519752 675807476 675072789 674298108
2714.7 674298108 673549414 672830701 672105968 671373963 670646369 669944704 669286430 668624938 667910278 667203605
2735.1 667203605 666601717 666083634 665549219 664965272 664355099 663760483 663187385 662571371 661929011 661357164
2755.5 661357164 660838604 660245121 659561396 658908725 658327818 657732725 657065153 656370699 655702889 655017674
2775.9 655017674 654280245 653538346 652782559 651989937 651201248 650391877 649513841 648596823 647682130 646777272
2796.3 646777272 645845771 644846439 643791974 642709255 641600072 640465260 639304161 638091147 636807501
2814.7 636807501 635473192 634131074 632786870 631382763 629844129 628138959 626342058 624537885
2831F24537885j884818k126336k418399k710402l116548l659844m231274m572750m333794
2849.3E95483720l431618k173304j000345k15829P5162r9123n71370j072109j432240
2867.7E85562944j568496j427889j168430r35733p03394n81682o80625q52228r62317
2886.1E76682150j069605j210332j326859j379013j428843j548111j641691j698136
2902.4E65379560j829386k040028k340377k752900l234982l662825l805459l550231
2918.7E42163372k992570k186001j214206k63393N24998J092195J549602K003372K346396
2937E43023765K543211K672196K626538K290010J754761J217723Q59439O83010O33478
2955.4E58304131P63416J094580J512826J871228K160549K402902K584934K710402
$$ plain form
2831 624537885 622653067 620526731 618108332 615397930 612281382 608621538 604390264 599817514 595483720
2849.3 595483720 592052102 589878798 588878453 588662624 588737786 588638663 588067293 586995184 585562944
2867.7 585562944 583994448 582566559 581398129 580462396 579759002 579177320 578496695 577644467 576682150
2886.1 576682150 575612545 574402213 573075354 571696341 570267498 568719387 567077696 565379560
2902.4 565379560 563550174 561510146 559169769 556416869 553181887 549519062 545713603 542163372
2918.7 542163372 539170802 536984801 535770595 535507202 536032200 537124395 538673997 540677369 543023765
2937 543023765 545566976 548239172 550865710 553155720 554910481 556128204 556987643 557670653 558304131
2955.4 558304131 559067547 560162127 561674953 563546181 565706730 568109632 570694566 573404968
2971.7E73404968K697944K543092K406299K297342K099216J852393J671613J535415
2988E90508282J375437J136363Q32140N68449K91229l5823k75910l92437m14967l99947
3008.4E93192816m09603m89951o63876q10087q58724r07421r54509r81331j058519
3026.8E86058795j109659j063466j018107j077950j190067j188576j120269j143336
3043.1E77147365j237512j311004j274884j198649j221359j274347j288057j247644
3059.4E67093909j143694j064122j058996j089155j098335j054347r86456q93534q06033
3077.8E57899237q75235j027405j050115r85145r29475r15408r73285j040876r95337
3096.1E49106956q80599r07839j067161j114130j021684r88304j080275j119375j041770
$$ plain form
2971.7 573404968 576102912 578646004 581052303 583349645 585448861 587301254 588972867 590508282
2988 590508282 591883719 593020082 593852222 594420671 594711900 594676077 594400167 594007730 593592763 593192816
3008.4 593192816 592783213 592293262 591629386 590819299 589960575 589053154 588098645 587117314 586058795
3026.8 586058795 584949136 583885670 582867563 581789613 580599546 579410970 578290701 577147365
3043.1 577147365 575909853 574598849 573323965 572125316 570903957 569629610 568341553 567093909
3059.4 567093909 565950215 564886093 563827097 562737942 561639607 560585260 559598804 558705270 557899237
3077.8 557899237 557024002 555996597 554946482 553961337 553031862 552116454 551143169 550102293 549106956
3096.1 549106956 548226357 547318518 546251357 545137227 544115543 543127239 542046964 540927589 539885819
3114.5E39885819j016498j095891j255750j401127j374542j255036j229524j293004
3130.8E29964447j337707j331985j288831j279474j366078j438976j430154j402914
3147.1E19088328j359701j339853j419723j499474j482129j454711j467288j460790
3163.4E07604659j449645j482069j492203j457870j443982j467913j497746j487642
3179.8D95825589j452923j428247j417309j414060j410991j412958j408398j389444
3196.1D84491259j378000j372874j352042j328855j312375j278312j224309j204908
3212.4D74039584j230120j252234j258224j229078j178980j199245j248330j209706
3228.7D64233667j130283j129717j230299j287371j243651j231164j269251j269966
$$ plain form
3114.5 539885819 538869321 537773430 536517680 535116553 533742011 532486975 531257451 529964447
3130.8 529964447 528626740 527294755 526005924 524726450 523360372 521921396 520491242 519088328
3147.1 519088328 517728627 516388774 514969051 513469577 511987448 510532737 509065449 507604659
3163.4 507604659 506155014 504672945 503180742 501722872 500278890 498810977 497313231 495825589
3179.8 495825589 494372666 492944419 491527110 490113050 488702059 487289101 485880703 484491259
3196.1 484491259 483113259 481740385 480388343 479059488 477747113 476468801 475244492 474039584
3212.4 474039584 472809464 471557230 470299006 469069928 467890948 466691703 465443373 464233667
3228.7 464233667 463103384 461973667 460743368 459455997 458212346 456981182 455711931 454441965
3245D54441965j252413j273722j266718j228272j238555j265496j246214j209557j195461
3263.4D43265557j174509j121730j072228j102477j162320j139910j061052j014620
3279.7D34416711j029849j002013q93951q35389q21918p99596q04395q12232q05825
3298D26611543p87169p33376o59257o55979p89016r47714r55731q60899q35270q79526
3318.4D18507606r12577r03100r26345j057029j116365j027942j004368j025021r86189
3336.8D09548670j009703j075923j068175j062602j078725j050591j033932j076102
3353.1D01092917j133293j106411j004965r44197r39041r42081r34989r67294j057326
3371.5C92063320j039982r17524q67665q37088q09490p94799p13735n38230l77685
$$ plain form
3245 454441965 453189552 451915830 450649112 449420840 448182285 446916789 445670575 444461018 443265557
3263.4 443265557 442091048 440969318 439897090 438794613 437632293 436492383 435431331 434416711
3279.7 434416711 433386862 432384849 431490898 430655509 429833591 429033995 428229600 427417368 426611543
3298 426611543 425824374 425090998 424431741 423775762 422986746 422039032 421083301 420222402 419387132 418507606
3318.4 418507606 417595029 416691929 415765584 414708555 413592190 412564248 411559880 410534859 409548670
3336.8 409548670 408538967 407463044 406394869 405332267 404253542 403202951 402169019 401092917
3353.1 401092917 399959624 398853213 397848248 396904051 395965010 395022929 394087940 393120646 392063320
3371.5 392063320 391023338 390105814 389238149 388401061 387591571 386796772 386083037 385544807 385167122
3389.8C85167122m75407p19726p14272m29362k54870m53561p07656o14465l53783k28226
3410.2C80215794k77549l65347l34382k37882j63913q5294K6315J89245L37631L24398
3430.6C79629016L13580M03255L35455J41323J42365L86924N99802O68406O96361P29472
3451C84045959P49260P94530R22411J051754J020640R98229J178533J308799J120776
3469.4C93190891Q32468Q73774J131594J336307J369416J230210J235187J383692J331270
3487.7D03914809J240790J371235J543134J625896J544207J426339J472235J518249
3504D15656894J446516J476079J683891J847476J750707J540154J542271J759261J998364
3522.4D30701613J973212J780093J811236J975507K042561K104521K137929K081454
$$ plain form
3389.8 385167122 384691715 383971989 383257717 382828355 382573485 382119924 381412268 380797803 380444020 380215794
3410.2 380215794 379938245 379572898 379238516 379000634 378836721 378751427 378777742 378966987 379304618 379629016
3430.6 379629016 379942596 380345851 380681306 380822629 380964994 381351918 381951720 382620126 383316487 384045959
3451 384045959 384795219 385589749 386512160 387563914 388584554 389582783 390761316 392070115 393190891
3469.4 393190891 394023359 394897133 396028727 397365034 398734450 399964660 401199847 402583539 403914809
3487.7 403914809 405155599 406526834 408069968 409695864 411240071 412666410 414138645 415656894
3504 415656894 417103410 418579489 420263380 422110856 423861563 425401717 426943988 428703249 430701613
3522.4 430701613 432674825 434454918 436266154 438241661 440284222 442388743 444526672 446608126
3538.7D46608126K151519K292842K309710K231210K206117K286196K420664K475917
3555D64982301K488643K585351K591700K365291K404064L157437L511518L034562K784282
3573.4D89905149K928585L098756L220856L224164L054798L100633L594518L726184
3589.7E15853643L278852L261626L604233L705025L683030L639400L361523L192127
3606E43579459L591418L838838L661394L613651L502190L862083M510462L840208K723813
3624.4E76723516K615213M169703N119324L839433L337264L484666L434599L373027
3640.7F06096745L053665K497613K695561M373848M967511L210664K557814L403604
3657F32857025L373563K636433K341151K031505J713335K279342K733588K031624K631188
$$ plain form
3538.7 446608126 448759645 451052487 453362197 455593407 457799524 460085720 462506384 464982301
3555 464982301 467470944 470056295 472647995 475013286 477417350 480574787 484086305 487120867 489905149
3573.4 489905149 492833734 495932490 499153346 502377510 505432308 508532941 512127459 515853643
3589.7 515853643 519132495 522394121 525998354 529703379 533386409 537025809 540387332 543579459
3606 543579459 547170877 551009715 554671109 558284760 561786950 565649033 570159495 573999703 576723516
3624.4 576723516 579338729 583508432 588627756 592467189 595804453 599289119 602723718 606096745
3640.7 606096745 609150410 611648023 614343584 618717432 623684943 626895607 629453421 632857025
3657 632857025 636230588 638867021 641208172 643239677 644953012 647232354 649965942 651997566 654628754
3675.4F54628754L280997K195239J601517J419842J236678J688301K444804K177656
3691.7F70673788J452744J100480R49919R94146J320541J230359O13868M18306R94086
3710F79748237J801551J513540O13809L29792N31316O90222P00831P38621M94600O4492
3730.4F87227011K52008J075268J542807Q01682l38018l59177Q69214Q79228K05934
3748.8F92155957J031161J406490M62294P8082N28038P91788L92914K25424L87848
3767.1F97459996O07729P74324M41193K0862J18494N23865N07534K74300L99053N08368
3787.5G01635718L90530J25110j18255m411L3140N960N97060O24716L41833O81937
3807.9G04313338L15070m03822l61919L03388L77357L17692Q63970M51326p3731m3869
$$ plain form
3675.4 654628754 657909751 660104990 661706507 663126349 664363027 666051328 668496132 670673788
3691.7 670673788 672126532 673227012 674176931 675171077 676491618 677721977 678335845 678754151 679748237
3710 679748237 681549788 683063328 683677137 684006929 684538245 685228467 685929298 686667919 687162519 687227011
3730.4 687227011 687479019 688554287 690097094 690898776 690560758 690201581 691070795 691950023 692155957
3748.8 692155957 693187118 694593608 695055902 695133984 695662022 696453810 696846724 697072148 697459996
3767.1 697459996 698067725 698842049 699283242 699304104 699422598 699946463 700453997 700728297 701127350 701635718
3787.5 701635718 702026248 702151358 702033103 702028692 702061832 702067792 702664852 703289568 703631401 704313338
3807.9 704313338 704628408 704224586 703862667 704166055 704543412 704861104 705725074 706176400 706102669 706058800
3828.3G06058800r1314p8321J3233K28703N53369M95672L55304L17275j06513p80464
3848.7G06965744r47535N18561K033114O56367n56112n62846l8147L17275K4379K5033
3869.1G08435833M98832M03046R3222k46823k48194K05577K60234L83198K65002k21789
3889.5G09828138P9036K75970l46542o61731l02374K58565O88195O91057J87635j57416
3909.9G10540533k07722k82526j55091J88767J76549p6532m17J25587j04129j44423
3930.3G10060596K21611K73942p2896k47717j79231j9729J6153o0320L0458R6917j1683
3952.7G10108101l9518L3677L9816K1815M3094Q345m5478k7359j3232q583P7963J04248
3977.2G10302889k8789n2809N2809k622j13368o3181Q523p331m172L4213
$$ plain form
3828.3 706058800 705967486 705889165 705902398 706131101 706684470 707180142 707535446 707852721 707746208 706965744
3848.7 706965744 706018209 706536770 708569884 709226251 708670139 708107293 708069146 708386421 708410800 708435833
3869.1 708435833 708934665 709337711 709430933 709184110 708935916 709141493 709401727 709784925 710049927 709828138
3889.5 709828138 709907174 710183144 709836602 709174871 708872497 709131062 709819257 710510314 710697949 710540533
3909.9 710540533 710332811 710050285 709895194 710083961 710260510 710183978 710183561 710309148 710205019 710060596
3930.3 710060596 710282207 710556149 710483253 710235536 710056305 710036576 710052729 709992409 710022867 710119784 710108101
3952.7 710108101 710068583 710102260 710142076 710163891 710206985 710215330 710169852 710142493 710129261 710120678 710198641 710302889
3977.2 710302889 710274100 710221291 710274100 710271478 710158110 710094929 710103452 710096121 710091949 710126162
3997.6G10126162
$$ plain form
3997.6 710126162
##END=$$ End of the data block
