##TITLE=$$ Begin of the data block
##JCAMP-DX=5.00 $$ ACD/SpecManager v 10.08
##SPECTROMETER/DATA SYSTEM=Alpha
##DATE=11 Nov 2014 09:02:30
##DATA TYPE=INFRARED SPECTRUM
##DATA CLASS=XYDATA
##ORIGIN=
##OWNER=
##NPOINTS=1765
##FIRSTX=399.76428223
##LASTX=3997.64306641
##MAXX=3997.64306641
##MINX=399.76428223
##MAXY=0.78127182
##MINY=0.37478721
##XFACTOR=1.0000000000
##YFACTOR=1.000000000000000e-9
##FIRSTY=0.59711915
##DELTAX=2.03961372
##XUNITS=1/CM
##YUNITS=ARBITRARY UNITS
##XYDATA=(X++(Y..Y))
399.8E97119153k456248j502693m2021k59876j708508j890004n95867J47044r53555
418.1E87857425k103150p53641J82748q46326j931846j082004M79281M78089n05745
436.5E81774831o50525J79350N87106j31965p56979k87175L95179l6419j204669j581907
456.9E78286827o80089j32382r62735j762688j218319k06589m26770j306474j101255
475.2E70489526k04444J24395l05057p33673o03676j90974j82807q31842j232565o77109
495.6E65651774k58803q43644j427174j064181n55277q42333j649618k010524j558304
514E55441916j123786j418591j835346j401365m42266j75595r00507j261771m24743
532.3E46457946N42999M97341K9742M59970J596450J785279N97298m34637j66416M40418
$$ plain form
399.8 597119153 594662905 593160212 593118191 592858315 591149807 589259803 588663936 588810980 587857425
418.1 587857425 585754275 585000634 585183382 584337056 582405210 581323206 581802487 582280576 581774831
436.5 581774831 581124306 581303656 581890762 581758797 581001818 580714643 581109822 581073403 579868734 578286827
456.9 578286827 577606738 577474356 576511621 574748933 573530614 573324025 572897255 571590781 570489526
475.2 570489526 570285082 570409477 570104420 569370747 568767071 568576097 568393290 567561448 566328883 565651774
495.6 565651774 565392971 564549327 563122153 562057972 561502695 560660362 559010744 557000220 555441916
514 555441916 554318130 552899539 551064193 549662828 549220562 549044967 548144460 546882689 546457946
532.3 546457946 547000945 547498286 547528028 547987998 549584448 551369727 551967025 551532388 551365972 551806390
552.7E51806390J4425r43959r40204K0027L21865n06937j162708r15944m25458m59195
573.1E46808302p36534k37882R19640J231432M68254N1737N15341Q19147L06547l25501
593.5E49820483l07203J53661L54290J3769l14653r9719K29776L5405l50833j67667
613.9E49367309M43220Q31306Q56697R48310J360595J693428J546383J090765Q73744
632.3E59011757J085580J303375J176536R32455J031756J390994J489162J279950J128078
650.6E69829643J241803J323998R64224M45664K56121M17292N44429O47366R91941
669E76662481J145363J330197J588463J511216J348317J372159J348972J100421Q17120
687.3E88224709P51853TM86612N3704j55628J57714O56545Q57950R27865J231730J706302
$$ plain form
552.7 551806390 551820815 550876856 549936652 549956679 550278544 549771607 548608899 547692955 547267497 546808302
573.1 546808302 546071768 545833886 546753526 547984958 548453212 548504949 549020290 549839437 550145984 549820483
593.5 549820483 549513280 549666941 550021231 550035000 549720347 549620628 549850404 549885809 549534976 549367309
613.9 549367309 549810529 550641835 551498532 552446842 553807437 555500865 557047248 558138013 559011757
632.3 559011757 560097337 561400712 562577248 563509703 564541459 565932453 567421615 568701565 569829643
650.6 569829643 571071446 572395444 573359668 573805332 574061453 574478745 575023174 575670540 576662481
669 576662481 577807844 579138041 580726504 582237720 583586037 584958196 586307168 587407589 588224709
687.3 588224709 588976562 589728415 590215027 590268731 590113103 590270817 590927362 591785312 592713177 593944907 595651209
709.8E95651209J937986J747489J572132J940548K536953K605498K330362K401770
726.1F12723947K627551K479077J948773J484871J421213J432479J114070P33495P96616
744.5F26762092J052320Q56698K71737m112J38402J18315k16306l70979l7432M30525
764.9F29001260M89116J50501J29223O44922R86994Q09729Q67665J790642K907336
783.2F37777388L293455L028631K853274K986729K852023K110720J416087J317322
799.5F57635629J326204P81595j07825m96685k15650m1544m04179n78523K742P14838
819.9F58616602O86765M4406j73688M44412J068890J017511P97391J172125J812637
838.3F65487051J720727Q67784J65581P689j65581q17359j433492j281023n39779j13309
$$ plain form
709.8 595651209 597589195 599336684 600908816 602849364 605386317 607991815 610322177 612723947
726.1 612723947 615351498 617830575 619779348 621264219 622685432 624117911 625231981 625965476 626762092
744.5 626762092 627814412 628671110 628942847 628938735 629077137 629195452 628979146 628608167 628570735 629001260
764.9 629001260 629490376 629640877 629770100 630415022 631402016 632211745 633079410 634870052 637777388
783.2 637777388 641070843 644099474 646952748 649939477 652791500 654902220 656318307 657635629
799.5 657635629 658961833 659743428 659635603 659138918 658923268 658881724 658477545 657899022 657901764 658616602
819.9 658616602 659303367 659347773 659174085 659618497 660687387 661704898 662502289 663674414 665487051
838.3 665487051 667207778 668075562 668241143 668248832 668083251 667265892 665832400 664551377 664011598 663898289
858.7F63898289k62558k63930M12703J311123J520217R84728N93841P33495P19130
877F69647038k5511j082241j661539j735926j984537k520680k673865k091527j334667
895.4F54536545j087725j207173j136839q65638j017452j898229k841890l107428k916277
913.7F38457894k912938l072381k728880j658499o10292l48687o46591o79612l53158
932.1F25446856n20945j456320k287567k403259k296626k720476l535032l878712l525556
950.5F02822363l292918l727019m243493m173457l800989l842175m400551m853547
966.8E70488214m918873n225599o192505p159054p382632p134616p141769p405579
983.1E17927587p201731o233335n096972m420131m081547l572405k904475k547562
$$ plain form
858.7 663898289 663635731 663371801 663784504 665095627 666615844 667600572 668194413 668927908 669647038
877 669647038 669621527 668539286 666877747 665141821 663157284 660636604 657962739 655871212 654536545
895.4 654536545 653448820 652241647 651104808 650239170 649221718 647323489 644481599 641374171 638457894
913.7 638457894 635544956 632472575 629743695 628085196 627474904 627126217 626479626 625800014 625446856
932.1 625446856 624925911 623469591 621182024 618778765 616482139 613761663 610226631 606347919 602822363
950.5 602822363 599529445 595802426 591558933 587385476 583584487 579742312 575341761 570488214
966.8 570488214 565569341 560343742 554151237 546992183 539609551 532474935 525333166 517927587
983.1 517927587 510725856 504492521 499395549 494975418 490893871 487321466 484416991 481869429
999.4D81869429k660751k904207k929270k806097k790749k868176k685159k110004
1015.7D60115016j516879j235038j136005q49396l26961M8935P1675j3024O8069J94698
1036.1D55421090l4332o37353j123160j155793r59516q85516p37429j51277O73682
1054.5D50410396J278460J514822J613438J857728K029479J617789N91606m50641q87662
1072.8D59575415o34551L7104R45687K040684L107816L733039L665596L164381K647549
1091.2D78282720K119958J354635M75764l2186P4893N43207J008809J442879K016485
1109.6D87287164K715826L224730L260702K962560K708017K595664K345144J957000
1125.9E09056807J864194K152741K275825J794159R26316J96278j71065l88324o11186
$$ plain form
999.4 481869429 479208678 476304471 473375201 470569104 467778355 464910179 462225020 460115016
1015.7 460115016 458598137 457363099 456227094 455377698 455050737 455099672 455171347 455158323 455226392 455421090
1036.1 455421090 455386758 454749405 453626245 452470452 451510936 450625420 449887991 449736714 450410396
1054.5 450410396 451688856 453203678 454817116 456674844 458704323 460322112 460913718 460463077 459575415
1072.8 459575415 458940864 458977968 459923655 461964339 465072155 468805194 472470790 475635171 478282720
1091.2 478282720 480402678 481757313 482233077 482200891 482275784 482818991 483827800 485270679 487287164
1109.6 487287164 490002990 493227720 496488422 499450982 502158999 504754663 507099807 509056807
1125.9 509056807 510921001 513073742 515349567 517143726 518070042 518266320 518095255 517706931 517095745
1144.2E17095745n80550n4359P22051J359701J789331K284050L108859M121006M977703
1162.6E34823537N649149O386102P216036P787883P808685P483125P220626P006407
1178.9E91381550O447613N461276M517793L955722L458560K549469J295865K77757
1195.2F19345605k06589n31435r97484j323044j129866o03080l89814p76768j275241
1213.6F12112284j406610j453638j871944k477944k670467k344131k071858k170145
1229.9E95645547k208889j775264j140178q21709q11041o50525j30117L79682M57406
1248.2E88944912L11911L78072O64413Q36492P27832O33240Q84235J283824J387835
1266.6E96052766J189411J097142J291275J391769J036882M74155K66612M72664N53072
$$ plain form
1144.2 517095745 516515195 516460836 517182887 518542588 520331919 522615969 525724828 529845834 534823537
1162.6 534823537 540472686 546858788 554074824 561862707 569671392 577154517 584375143 591381550
1178.9 591381550 597829163 603290439 607808232 611763954 615222514 617771983 619067848 619345605
1195.2 619345605 619139016 618607581 617610097 616287053 615157187 614554107 614164293 613387525 612112284
1213.6 612112284 610705674 609252036 607380092 604902148 602231681 599887550 597815692 595645547
1229.9 595645547 593436658 591661394 590521216 589699507 588888466 588237941 588107824 588487506 588944912
1248.2 588944912 589256823 589634895 590299308 591135800 591863632 592496872 593381107 594664931 596052766
1266.6 596052766 597242177 598339319 599630594 601022363 602059245 602533400 602800012 603272676 603825748
1285F03825748K20060j89840l06011l48508p20263j338780j725554j694977j655460
1303.3E96066415j975774k409161k488315k218544j991213j988768j902938j441360
1319.6E79650342r24289q52108j136958j287401j085222q61168r31620j058817q07226
1338E70705533j29700L61920L19302K03669L40700M60684K50936j26004l15845l28601
1358.4E71742594m92453q40009j076698j114368j011432r06407j073361j235246j097560
1376.7E62895060j304031k361119l102064j838982M83751J126171l4690j148522j660109
1395.1E53055465j632929j574576j509010j386166j146793p49350n53191m82857l03209
1413.5E43717384m7624L44455R79782J237452J397252J724004J741171J606822J374364
$$ plain form
1285 603825748 604045808 603855968 603549957 603201449 602481186 601142406 599416852 597721875 596066415
1303.3 596066415 594090641 591681480 589193165 586974621 584983408 582994640 581091702 579650342
1319.6 579650342 578726053 577873945 576736987 575449586 574364364 573503196 572571576 571512759 570705533
1338 570705533 570575833 570937753 571257055 571460724 571801424 572262108 572513044 572387040 572071195 571742594
1358.4 571742594 571250141 570410132 569333434 568219066 567207634 566301227 565227866 563992620 562895060
1376.7 562895060 561591029 559229910 556127846 554288864 554772615 555898786 555864096 554715574 553055465
1395.1 553055465 551422536 549847960 548338950 546952784 545805991 545056641 544503450 544020593 543717384
1413.5 543717384 543669760 544014215 544993997 546231449 547628701 549352705 551093876 552700698 554075062
1431.8E54075062J040340J096129J328468R80020O73771O06716N73694N35846L99947
1450.2E61309993J83225K31504J162291K687573K634108K366543L175438L982067L895998
1468.5E81628740M506349O720543P646203O382406N099237M176557L447890K360285
1484.9F21968210J111209M7624o46889j207888k167761l316999l597677l251552l160417
1503.2F05777860m000366n144894l665507k615333k787649k878905k412617j549840
1519.5E80722749j033604j022756j376808j640439j513600j562417j755237j595974
1535.8E69221914j593113j700103r92537l80874j78277O5625M58896P69853P10368
1554.2E66381752N02587J117825K220273J205802L13104O2704k8491j11461n59568
$$ plain form
1431.8 554075062 555115402 556211531 557539999 558520019 559193790 559800506 560374200 560910046 561309993
1450.2 561309993 561493218 561724722 562887013 565574586 568208694 570575237 573750675 577732742 581628740
1468.5 581628740 586135089 592855632 600501835 606884241 611983478 616160035 619607925 621968210
1484.9 621968210 623079419 623127043 622480154 621272266 619104505 615787506 612189829 608938277 605777860
1503.2 605777860 601777494 596632600 592967093 590351760 587564111 584685206 582272589 580722749
1519.5 580722749 579689145 578666389 577289581 575649142 574135542 572573125 570817888 569221914
1535.8 569221914 567628801 565928698 564936161 564555287 564377010 564442635 564901531 565671384 566381752
1554.2 566381752 566884339 568002164 570222437 571428239 571741343 571804047 571775556 571664095 571104527
1572.6E71104527j271248j749933j672387j963675k676249l146291l352344l549516
1588.9E51722884l888368m089535l922879l513754l348946l526986l611565l425836
1605.2E22395015l330231l540099l679454l614485l858566m201055l478468l273546
1621.5D93419111l756613l608316l477931l430694k804369k284646k075136j306563
1637.8D70674843p09683m88848l12149j0401M53174M39674N46604J600117J735061
1656.2D73928392J376152J644582K440392L026844K722770L033638M106581M156112
1672.5D96435463M511357N181372M746437M331291N155563P517576P086039N892932
1688.8E40858030O284297N886793O284177P121384P235408Q322597O591558N130232
$$ plain form
1572.6 571104527 569833279 568083346 566410959 564447284 561771035 558624744 555272400 551722884
1588.9 551722884 547834516 543744981 539822102 536308348 532959402 529432416 525820851 522395015
1605.2 522395015 519064784 515524685 511845231 508230746 504372180 500171125 496692657 493419111
1621.5 493419111 489662498 486054182 482576251 479145557 476341188 474056542 471981406 470674843
1637.8 470674843 469965160 469476312 469164163 469153762 469606936 470046610 470593214 472193331 473928392
1656.2 473928392 475304544 476949126 479389518 482416362 485139132 488172770 492279351 496435463
1672.5 496435463 500946820 506128192 510874629 515205920 520361483 527879059 534965098 540858030
1688.8 540858030 547142327 553029120 559313297 566434681 573670089 581992686 588584244 593714476
1705.1E93714476N241334M391313L354609K570927K142787K551496K675831J879990
1721.5F18522763J421929J386881J234829J019478P98285J198113J837075J595497
1737.8F29014850J740098K260327K638817L056884L519535M388272N106271M746914
1754.1F56471968M716217M992664M808784N117476M882156M081786L716290L544271
1770.4F92331612L901124L831267K896548K366185K365708K361656K232432K008617
1786.7G14295149J579225J493156K044022K013028J507938J432240J710593J791775
1803G27867126J505197J282513J307726J476228J419067J183510J150429J257181J123250
1821.4G39572227Q98480R07541R16064J093626J322984J044810P88152Q96991Q33213
$$ plain form
1705.1 593714476 598955810 603347123 606701732 609272659 611415446 613966942 616642773 618522763
1721.5 618522763 619944692 621331573 622566402 623585880 624384165 625582278 627419353 629014850
1737.8 629014850 630754948 633015275 635654092 638710976 642230511 646618783 651725054 656471968
1754.1 656471968 661188185 666180849 670989633 676107109 680989265 685071051 688787341 692331612
1770.4 692331612 696232736 700064003 702960551 705326736 707692444 710054100 712286532 714295149
1786.7 714295149 715874374 717367530 719411552 721424580 722932518 724364758 726075351 727867126
1803 727867126 729372323 730654836 731962562 733438790 734857857 736041367 737191796 738448977 739572227
1821.4 739572227 740470707 741378248 742294312 743387938 744710922 745755732 746543884 747440875 748274088
1839.8G48274088M90844N62668J027048J062750Q54314O87539O26326O88732O89387
1858.1G54963696O01709N07295M30763L63767N06163P60138P12037N99801N68509M87447
1878.5G60501325L84748M20332N38886M71890L38375L97146M61519M66883M64320L57151
1898.9G64802575L11315L96431M07934K75850K32160L44754L41653J79470J35064K50101
1919.3G67677307K85208L62277M05133K54929J55509J87397K23577J78694Q8633j491
1939.7G69817173N9188K48670K43426J14381J16646J60814J07229M8160P4089J44779
1960.1G71134555J52290N4062j8597Q9705K20478J96218R1612P391M6075J38402J19328
1982.5G72231519O914m4763j5259M0949R5844O3300k682K2233O1571j1027r6738q4758
$$ plain form
1839.8 748274088 748764932 749327600 750354648 751417398 752271712 752959251 753585577 754274309 754963696
1858.1 754963696 755565405 756072700 756503463 756867230 757373393 758133531 758845568 759445369 760013878 760501325
1878.5 760501325 760886073 761306405 761845291 762317181 762655556 763052702 763514221 763981104 764445424 764802575
1898.9 764802575 765113890 765510321 765918255 766194105 766426265 766771019 767112672 767292142 767427206 767677307
1919.3 767677307 767962515 768324792 768729925 768984854 769140363 769327760 769551337 769730031 769818664 769817173
1939.7 769817173 769876361 770125031 770368457 770482838 770599484 770760298 770867527 770915687 770989776 771134555
1960.1 771134555 771286845 771340907 771322310 771412015 771632493 771828711 771920323 771927714 771973789 772112191 772231519
1982.5 772231519 772238433 772193670 772178411 772219360 772315204 772378504 772375822 772398055 772459626 772448599 772351861 772267103
2007G72267103k7180k8550j13189j71841r9361k4437j07825k10285j90378r6559n1797
2029.4G71145701j11818k00331j67668l5226o318j05262j74344j12533J6749M4465
2049.8G70293415o9499j06395M5419J58846M9472j02937o7055R0837J47105J7285q3387
2072.3G70373106K2590J74821J21355o8307q6367J13785K20656M6015j18375J1027
2092.7G70810306K15054J46746p9512j02640J30177K91586J19328j26421n4836K05934
2113.1G71555722K34425J907j28805M5061K60353J70111o4373l9696K17020L05772
2133.5G72557497R3937p2718R3937L40045K66492k4021o9439J92344L40343J55091
2153.9G73873508p2479M5120L40581L42787P7665J490K46286M20928K71142M8577Q7023
$$ plain form
2007 772267103 772239923 772211373 772098184 771926343 771826982 771802545 771694720 771484435 771294057 771197498 771145701
2029.4 771145701 771033883 770833552 770665884 770630658 770624340 770519078 770344734 770232201 770248950 770293415
2049.8 770293415 770223916 770117521 770162940 770321786 770371258 770268321 770201266 770292103 770439208 770456493 770373106
2072.3 770373106 770395696 770570517 770691872 770623565 770537198 770650983 770871639 770917654 770799279 770810306
2092.7 770810306 771025360 771172106 771092594 770989954 771120131 771411717 771531045 771404624 771349788 771555722
2113.1 771555722 771790147 771792054 771663249 771708310 771968663 772138774 772074401 772034705 772251725 772557497
2133.5 772557497 772651434 772578716 772672653 773012698 773279190 773255169 773185730 773378074 773718417 773873508
2153.9 773873508 773801029 773846149 774186730 774529517 774607182 774608672 774854958 775275886 775547028 775595605 775682628
2176.3G75682628L14772L61264J29521J0252K28345M18425K71261J7702J9193K71082
2196.7G77724445L99649J99914j1146Q0347L09527L01003N3883l5584J55389L03924
2217.1G79481351J70589l6717k324K07662K73645J03057n0068L3796K12371J83165
2237.5G80576527j4365q8214N0425J91331J17660m1068p451J48595J46806o378o6638
2259.9G81007230N6804J48653N9128o9856q0526L4153J04130R536j12593p9274M0352
2282.3G81117737M3392r0003k04861j61230n1201q2135k11716k45690j62780j18792
2302.7G79832721k08318l10600k91467j93298j74999l12984m38273m02033k60234j68205
2323.1G77072310k44677l57627k85745j51932k37763l83854l28958j71244q8156m9472
$$ plain form
2176.3 775682628 775997400 776358664 776488185 776498437 776726782 777145207 777416468 777434170 777453363 777724445
2196.7 777724445 778124094 778324008 778312862 778393209 778702736 779003739 779057622 779022038 779177427 779481351
2217.1 779481351 779651940 779615223 779612899 779820561 780094206 780197263 780147195 780180991 780393362 780576527
2237.5 780576527 780562162 780473948 780524373 780715704 780833364 780792296 780784845 780933440 781080246 781073868 781007230
2259.9 781007230 781064034 781212687 781271815 781201959 781121433 781155586 781259716 781269252 781156659 781077385 781117737
2282.3 781117737 781161129 781071126 780866265 780705035 780653834 780571699 780359983 780114293 779951513 779832721
2302.7 779832721 779624403 779313803 779022336 778829038 778654039 778341055 777902782 777500749 777240515 777072310
2323.1 777072310 776827633 776470006 776184261 776032329 775794566 775410712 775081754 774910510 774822354 774772882
2343.5G74772882K5630j95384o56783q52704p04348m99487l02017j53303j44720j72496
2363.9G71117270j29938J8775J53125J15990J7882L6359J00374L9458j28388k34962
2384.3G71105945k37405k44200l28601m12404l94225l00289k67863l85463n26130n01097
2404.7G67508268l63648l39329m51445n19455m60029l94940m60982n90921o09398m91619
2425.1G62826502l98159m54604n66364n54084m72367m81367n57721n87702n27203m63128
2445.5G57763803n17130o21557o08146n23687n33282o15538o37591n86926n32270n45561
2465.9G52042115o29604o64473n88536n17368n70536o62684o56069n85198n55873o03378
2486.3G46008396o50227o18398n47052n28574n85913o07073n26310m66465n24283n97238
$$ plain form
2343.5 774772882 774798512 774603128 773946345 773093641 772389293 771889806 771587789 771434486 771289766 771117270
2363.9 771117270 770987332 771006107 771159232 771275222 771293104 771329463 771429837 771469295 771340907 771105945
2384.3 771105945 770868540 770624340 770295739 769883335 769489110 769188821 768920958 768535495 768009365 767508268
2404.7 767508268 767144620 766805291 766353846 765834391 765374362 764979422 764518440 763927519 763318121 762826502
2425.1 762826502 762428343 761973739 761407375 760853291 760380924 759899557 759341836 758754134 758226931 757763803
2445.5 757763803 757246673 756625116 756016970 755493283 754960001 754344463 753706872 753119946 752587676 752042115
2465.9 752042115 751412511 750748038 750159502 749642134 749071598 748408914 747752845 747167647 746611774 746008396
2486.3 746008396 745358169 744739771 744192719 743664145 743078232 742471159 741944849 741478384 740954101 740356863
2506.7G40356863n57721m61936m38810n31494o16670n38707m19437m44711n34415n45144
2527.1G35267818m79996m33207m70042n51164n79059n17130m42743m63069n50568n46813
2547.5G30234027m41551m30405n50032o09160n45084m99368n57184o27041n91576m65035
2567.9G24917591m04001n15341o55055o46055n53191n41270o09517o19828n52476n30600
2588.3G19290257o07253o78777o46770n56827n28514o11306p04169o64234n43892n58555
2608.7G13189960o99163p39634o51360n82635o22868p25925p38025o43730o31929p55667
2629.1G06399024q29280p62164o59705o53982p45594p88749p19606o64711p39337q15391
2649.5F99020505p51138o49333o57260p70390q23260p23242o27160o82414p70271p38323
$$ plain form
2506.7 740356863 739799142 739337206 738898396 738366902 737750232 737211525 736792088 736347377 735812962 735267818
2527.1 735267818 734787822 734354615 733884573 733333409 732754350 732237220 731794477 731331408 730780840 730234027
2547.5 730234027 729792476 729362071 728812039 728202879 727657795 727158427 726601243 725974202 725382626 724917591
2567.9 724917591 724513590 723998249 723343194 722697139 722143948 721602678 720993161 720373333 719820857 719290257
2588.3 719290257 718683004 718004227 717357457 716800630 716272116 715660810 714956641 714292407 713748515 713189960
2608.7 713189960 712490797 711751163 711099803 710517168 709894300 709168375 708430350 707786620 707154691 706399024
2629.1 706399024 705569744 704807580 704147875 703493893 702748299 701959550 701239944 700575233 699835896 699020505
2649.5 699020505 698269367 697620034 696962774 696192384 695369124 694645882 694018722 693336308 692566037 691827714
2669.9F91827714o49333o49571p45177p81119o91176o03914o38008p39932p57933o51359
2690.3F84920192n58675o23524p70509p83741o53685o16967p40052q19265p59960p01010
2710.7F77892804p48694p97570p49707o96778p10607p35998p34448p11501o68287o49870
2731.1F70689344o95407o98566n90742n09381n35787n98013o26206n94557n69641o07550
2751.4F64663494o27935n92292n55277n78403o42955o48976o14464o23286o57558o81341
2771.8F58441007o71446o55174p10547p94292q14497p70808p19428p50720q69453r58502
2792.2F50726140r53138r12786r43422j032233j064361j066327j106560j137555j158893
2810.6F41350865j209974j268625j317918j354218j381516j436711j542747j675367
$$ plain form
2669.9 691827714 691178381 690528810 689783633 689002514 688311338 687707424 687069416 686329484 685571551 684920192
2690.3 684920192 684361517 683737993 682967484 682183743 681530058 680913091 680173039 679353774 678593814 677892804
2710.7 677892804 677144110 676346540 675596833 674900055 674189448 673453450 672719002 672007501 671339214 670689344
2731.1 670689344 669993937 669295371 668704629 668195248 667659461 667061448 666435242 665840685 665271044 664663494
2751.4 664663494 664035559 663443267 662887990 662309587 661666632 661017656 660403192 659779906 659122348 658441007
2771.8 658441007 657769561 657114387 656403840 655609548 654795051 654024243 653304815 652554095 651684642 650726140
2792.2 650726140 649773002 648860216 647916794 646884561 645820200 644753873 643647313 642509758 641350865
2810.6 641350865 640140891 638872266 637554348 636200130 634818614 633381903 631839156 630163789
2826.9F30163789j768589j822829j936615k141237k390385k705395l147066l680646
2843.2F10571027m208088m548907m352451l455579k175033r97663k24709O5923j06574
2861.6E90567946n86748j080095j429260j573205j441717j159728q91566o78778o08146
2879.9E81118703p05898q50558r83238j122415j217723j272202j333773j406372j546323
2898.3E70680201j676857j717747j809477k027870k341568k743364l225445l671646
2914.6E51466227l842235l582537k963186k129435j187801k65956N08964J101255J596868
2933E40702164K051771K384901K554715K624511K565086K295375J832962J304031R02771
2951.3E59218287O77348O29782P94828J108289J502872J877307K169729K405226K611577
$$ plain form
2826.9 630163789 628395200 626572371 624635756 622494519 620104134 617398739 614251673 610571027
2843.2 610571027 606362939 601814032 597461581 594006002 591830969 590833306 590608597 590674520 590567946
2861.6 590567946 589981198 588901103 587471843 585898638 584456921 583297193 582405627 581726849 581118703
2879.9 581118703 580412805 579562247 578579009 577456594 576238871 574966669 573632896 572226524 570680201
2898.3 570680201 569003344 567285597 565476120 563448250 561106682 558363318 555137873 551466227
2914.6 551466227 547623992 544041455 541078269 538948834 537761033 537495077 538004041 539105296 540702164
2933 540702164 542753935 545138836 547693551 550318062 552883148 555178523 557011485 558315516 559218287
2951.3 559218287 559895635 560525417 561320245 562428534 563931406 565808713 567978442 570383668 572995245
2969.7E72995245K767325K745330K566576K424181K327025K138436J882255J682102
2986E91528475J555503J426696J175285Q17060N38171L11136J4663k36154l58880m12225
3006.4E96359730m34041m37022m97400o60181p84278q06809q68201r58443r90688j045883
3026.8E88876784j114130j086891j020133j048744j147091j168311j119495j132309
3043.1E80039680j227915j308859j283109j221359j235366j273989j285255j245260
3059.4E69958568j141787j053035j027823j061976j104951j074969r81927q86083q48651
3077.8E60777366r12487r82941r86635r75013r35912r10878r85325j050591r84192
3096.1E52053392q82089r14872j043975j093626j033724r94324j049400j087784j045168
$$ plain form
2969.7 572995245 575762570 578507900 581074476 583498657 585825682 587964118 589846373 591528475
2986 591528475 593083978 594510674 595685959 596503019 597041190 597352326 597366989 597130835 596771955 596359730
3006.4 596359730 595925689 595488667 594991267 594331086 593546808 592739999 591871798 590913355 589922667 588876784
3026.8 588876784 587762654 586675763 585655630 584606886 583459795 582291484 581171989 580039680
3043.1 580039680 578811765 577502906 576219797 574998438 573763072 572489083 571203828 569958568
3059.4 569958568 568816781 567763746 566735923 565673947 564568996 563494027 562512100 561626017 560777366
3077.8 560777366 559864879 558881938 557895303 556920290 555984378 555073500 554088175 553037584 552053392
3096.1 552053392 551171303 550256431 549212456 548118830 547085106 546090782 545041382 543953598 542908430
3114.5E42908430j017511j102686j293599j408697j332283j214146j224220j333892
3130.8E32981396j396895j324236j212239j257062j424373j480698j413763j374304
3147.1E22097826j376092j361132j391292j505315j547933j486063j437485j423716
3163.4E10568798j442016j496255j514077j463771j440465j472712j482725j459480
3179.8D98797297j471668j488149j463801j441717j425385j411528j411974j426161
3196.1D87256914j432716j389862j320213j304507j349956j369774j305252j223565
3212.4D76561069j211762j251250j267106j243442j236767j251071j243890j210242
3228.7D66645539j165956j185358j301706j330584j236200j226306j285047j273960
$$ plain form
3114.5 542908430 541890919 540788233 539494634 538085937 536753654 535539508 534315288 532981396
3130.8 532981396 531584501 530260265 529048026 527790964 526366591 524885893 523472130 522097826
3147.1 522097826 520721734 519360602 517969310 516463995 514916062 513429999 511992514 510568798
3163.4 510568798 509126782 507630527 506116450 504652679 503212214 501739502 500256777 498797297
3179.8 498797297 497325629 495837480 494373679 492931962 491506577 490095049 488683075 487256914
3196.1 487256914 485824198 484434336 483114123 481809616 480459660 479089886 477784634 476561069
3212.4 476561069 475349307 474098057 472830951 471587509 470350742 469099671 467855781 466645539
3228.7 466645539 465479583 464294225 462992519 461661935 460425735 459199429 457914382 456640422
3245D56640422j252591j304448j334220j282752j214504j201749j234591j273542j280457
3263.4D45261568j204759j124740j084536j084596j145214j181304j142681j072615
3279.7D36221123j028657j006574r37819q63761q38607q29965q42721q59588q58545
3298D28154886q33333p57396o89536p53880r08911r97126r92537r53197r37462r53645
3318.4D19377863r69886r70543r91255j089185j160294j128942j105189j112551j101941
3336.8D09748077j117259j182824j213521j206726j192152j151204j168967j237809
3353.1D00277615j249612j215219j164675j120418j098544j054555j019537j066983
3369.4C91288072j183242j226216j133234j008659q95590q63641q74549q02964o56814
$$ plain form
3245 456640422 455387831 454083383 452749163 451466411 450251907 449050158 447815567 446542025 445261568
3263.4 445261568 444056809 442932069 441847533 440762937 439617723 438436419 437293738 436221123
3279.7 436221123 435192466 434185892 433248073 432384312 431545705 430715740 429873019 429013431 428154886
3298 428154886 427321553 426564157 425874621 425120741 424211830 423214704 422222167 421268970 420331508 419377863
3318.4 419377863 418407977 417437434 416446179 415356994 414196700 413067758 411962569 410850018 409748077
3336.8 409748077 408630818 407447994 406234473 405027747 403835595 402684391 401515424 400277615
3353.1 400277615 399028003 397812784 396648109 395527691 394429147 393374592 392355055 391288072
3369.4 391288072 390104830 388878614 387745380 386736721 385841131 384977490 384102941 383299977 382643163
3387.8C82643163n17726n69105p73579p79956n08130l38376n11765p25061o56843m36693
3408.2C76825929k67864k67952m12047m34876k82466j83314j53989l6210J73659L32117
3428.6C75292987L14265K85626L55780L34978K00420J89871L69281N65081P01845P71642
3449C79381776P81715P84665Q42720R76950J096249J047224J046240J293957J413137
3467.3C88664633J162380Q93563R73254J215458J380772J386374J283616J333922J469702
3485.7C99763674J410275J337856J463086J592189J632660J565308J513719J603902
3502D11882669J621514J479417J487494J732349J932025J870841J678437J662374J844048
3520.4D27191168K039582J982569J818478J915276K086163K142549K246230K283901
$$ plain form
3387.8 382643163 382125437 381556332 380782753 380002797 379494667 379156291 378644526 377919465 377262622 376825929
3408.2 376825929 376558065 376290113 375878066 375443190 375160724 374977410 374823421 374787211 374960870 375292987
3428.6 375292987 375607252 375892878 376248658 376583636 376784056 376973927 377343208 377908289 378610134 379381776
3449 379381776 380163491 380948156 381790876 382767826 383864075 384911299 385957539 387251496 388664633
3467.3 388664633 389827013 390720576 391693830 392909288 394290060 395676434 396960050 398293972 399763674
3485.7 399763674 401173949 402511805 403974891 405567080 407199740 408765048 410278767 411882669
3502 411882669 413504183 414983600 416471094 418203443 420135468 422006309 423684746 425347120 427191168
3520.4 427191168 429230750 431213319 433031797 434947073 437033236 439175785 441422015 443705916
3536.7D43705916K148927K162039K324969K423226K418638K351462K352149K526879
3553D62414205K641559K620399K677709K665311K427429K481401L264516L646970L178686
3571.3D88018185K915621L065049L266305L408730L384590L148318L202557L801584
3587.7E14210939L914595L363967L353179L736138L873408L884136L800929L482461
3604E43619752L344536L777444M014731L833890L745198L554642L934920M687846M042685
3622.3E78555644K834081K616585M212737N303800L989994L389597L505767L461122
3638.7F07869327L384590L067613K505600K646864M326045M996956L284871K653539
3655F34735405L510058L477812K722919K359033J972556J648545K266765K800941K075374
$$ plain form
3536.7 443705916 445854843 448016882 450341851 452765077 455183715 457535177 459887326 462414205
3553 462414205 465055764 467676163 470353872 473019183 475446612 477928013 481192529 484839499 488018185
3571.3 488018185 490933806 493998855 497265160 500673890 504058480 507206798 510409355 514210939
3587.7 514210939 518125534 521489501 524842680 528578818 532452226 536336362 540137291 543619752
3604 543619752 546964288 550741732 554756463 558590353 562335551 565890193 569825113 574512959 578555644
3622.3 578555644 581389725 584006310 588219047 593522847 597512841 600902438 604408205 607869327
3638.7 607869327 611253917 614321530 616827130 619473994 623800039 628796995 632081866 634735405
3655 634735405 638245463 641723275 644446194 646805227 648777783 650426328 652693093 655494034 657569408
3673.3F57569408K533555L168166K209365J672030J458347J238346J688361K428293
3689.6F73965871K156735J487911J167118R81391J006126J372814J315773O63519L93211
3708F84510469R22382J732588J517534O90759L81171M98951O45220P08163P25567M66764
3728.4F92799568O7473K17259J037776J574934Q47160l08513l82126Q07226Q85308
3746.7F97546065K25723R86278J416087N58436J21474M83930P53999M09782K54631
3765.1G02756405L70145N65588P71642M68552O4731J75237N89311N35250K02179L18289
3785.5G06817329M97818M03404J71185q8036n0187K5093P5936O65963O19769K72036
3805.9G09410310O91533L90172m09424m40181K30789K96295K03908Q37683N29826p75
$$ plain form
3673.3 657569408 660102963 663271129 665480494 667152524 668610871 669849217 671537578 673965871
3689.6 673965871 676122606 677610517 678777635 679759026 680765152 682137966 683453739 684117258 684510469
3708 684510469 685432851 687165439 688682973 689373732 689754903 690253854 690899074 691607237 692332804 692799568
3728.4 692799568 692867041 693084300 694122076 695697010 696544170 696235657 695853531 696660757 697546065
3746.7 697546065 697771788 698758066 700174153 700732589 700854063 701337993 702091992 702501774 702756405
3765.1 702756405 703126550 703692138 704463780 704932332 704997063 705172300 705761611 706296861 706499040 706817329
3785.5 706817329 707315147 707718551 707889736 707801700 707751513 707776606 707852542 708518505 709138274 709410310
3805.9 709410310 710101843 710492015 710082591 709642410 709873199 710169494 710373402 711211085 711740911 711740136
3826.3G11740136j132m6134J0669N7220J14024M12643M95315M49359M27306n4241p96496
3848.7G12808669r82821M71294J970112O37293n15759m99547L636L09587j5855K5034
3869.1G14211643N22375L75986R2924k12193k66135J86086K77340L56734K26021k14934
3889.5G15555847J24633L49224l30806p19488l35514K73704O90043O94335K00629j81914
3909.9G16320693k43008k80141j43230J76489J85251l7670j9610N9724j19984j15454
3930.3G15783060K57372L36767K622k24709k07603l6657L8803m769J02699J66774L8862
3952.7G16253221p9691q6785j8835M1962L5226m8816n6326M1127J0669r2626j5497
3975.2G15983629J26779J12355L7253K0087j6809q6009j10627n2034L9041Q8155R8348
$$ plain form
3826.3 711740136 711739004 711692870 711703539 711760759 711874783 712287426 712782741 713232100 713659406 713605165 712808669
3848.7 712808669 711825848 712297142 714267254 714904547 714388788 713889241 713892877 714202464 714186609 714211643
3869.1 714211643 714734018 715110004 715202928 714990735 714724600 714910686 715188026 715544760 715770781 715555847
3889.5 715555847 715680480 716029704 715698898 714979410 714643896 714917600 715607643 716301978 716502607 716320693
3909.9 716320693 716077685 715797544 715654314 715830803 716016054 715978384 715958774 716018498 715898514 715783060
3930.3 715783060 716040432 716377199 716379821 716155112 715947509 715910852 715949655 715944886 716047585 716214359 716253221
3952.7 716253221 716173530 716086745 716067910 716109872 716145098 716096282 716039956 716081083 716091752 715999126 715983629
3975.2 715983629 716110408 716222763 716260016 716280103 716263294 716177285 716066658 716014624 716053665 716141820 716240168
3997.6G16240168
$$ plain form
3997.6 716240168
##END=$$ End of the data block
