##TITLE=$$ Begin of the data block
##JCAMP-DX=5.00 $$ ACD/SpecManager v 10.08
##SPECTROMETER/DATA SYSTEM=Alpha
##DATE=11 Nov 2014 09:02:30
##DATA TYPE=INFRARED SPECTRUM
##DATA CLASS=XYDATA
##ORIGIN=
##OWNER=
##NPOINTS=1765
##FIRSTX=399.76428223
##LASTX=3997.64306641
##MAXX=3997.64306641
##MINX=399.76428223
##MAXY=0.78366041
##MINY=0.37176058
##XFACTOR=1.0000000000
##YFACTOR=1.000000000000000e-9
##FIRSTY=0.59673887
##DELTAX=2.03961372
##XUNITS=1/CM
##YUNITS=ARBITRARY UNITS
##XYDATA=(X++(Y..Y))
$$ plain form
399.8 596738875 593985856 592624843 592609763 591903985 589961290 588643909 588719666 588752627 587164640
418.1 587164640 584438384 583346725 583512783 582663238 580881536 580313444 581143796 581469119 580550373
436.5 580550373 579665959 579994559 580728710 580413759 579491377 579295576 579765916 579510510 578077078 576743901
456.9 576743901 576454043 576338768 575296283 573709965 572851479 572822988 572250843 570719779 569678664
475.2 569678664 569731593 569841266 569165289 568100572 567434251 567286372 567175865 566507399 565442026 564821303
495.6 564821303 564535022 563653111 562108159 560817599 560145140 559337020 557709754 555712104 554258227
514 554258227 553266048 551766872 549697459 548195183 547783315 547708869 547046185 545997560 545499206 545846224
534.4 545846224 546315610 546439111 546893775 548343241 549985707 550478756 550056696 550051153 550591171 550597250
$$ packed form
399.8E96738875k753019j361013j5080p05778j942695j317381P5757L2961j587987
418.1E87164640k726256j091659J66058q49545j781702n68092Q30352L25323r18746
436.5E80550373q84414L28600P34151l14951r22382j95801M70340k55406j433432j333177
456.9E76743901k89858j15275j042485j586318q58486k8491n72145j531064j041115
475.2E69678664N2929J09673o75977j064717o66321j47879j10507o68466j065373o20723
495.6E64821303k86281q81911j544952j290560o72459q08120j627266j997650j453877
514E54258227r92179j499176k069413j502276m11868p4446o62684j048625m98354L47018
534.4E45846224M69386J23501M54664J449466J642466M93049m22060n543N40018O079
$$ plain form
554.8 550597250 549627602 548646569 548744738 549282670 548827887 547529697 546608448 546365321 546034455 545316279
575.2 545316279 544966042 545560300 546594679 547213376 547407150 547908843 548795044 549235523 548908293 548550665
595.6 548550665 548776925 549254119 549254000 548835337 548696637 548927963 548977852 548655152 548520088 549051166
616 549051166 550007463 550930977 551867723 553209901 554925144 556500793 557598472 558457017 559568167
634.3 559568167 560961545 562177241 563137770 564304054 565865099 567446291 568738759 569896936 571206629
652.7 571206629 572580576 573549271 573928416 574098766 574528813 575165093 575881600 576877892 578042030
671 578042030 579442322 581073225 582585037 583952665 585373461 586805701 587976158 588794172 589502335
689.4 589502335 590227246 590702713 590747535 590634286 590854585 591555536 592494369 593500078 594714463 596325576
$$ packed form
554.8E50597250r69648r81033R8169N37932m54783j298190r21249k43127l30866p18176
575.2E45316279l50237N94258J034379O18697J93774N01693Q86201M40479l27230l57628
595.6E48550665K26260M77194j19m18663j38700K31326M9889l22700j35064N31078
616E49051166R56297R23514R36746J342178J715243J575649J097679Q58545J111150
634.3E59568167J393378J215696R60529J166284J561045J581192J292468J158177J309693
652.7E71206629J373947R68695L79145J70350M30047O36280P16507R96292J164138
671E78042030J400292J630903J511812J367628J420796J432240J170457Q18014P08163
689.4E89502335P24911M75467M4822j13249K20299P00951R38833J005709J214385J611113
$$ plain form
709.8 596325576 598181605 599976659 601704478 603707850 606170952 608722329 611057043 613462269
726.1 613462269 616099179 618588865 620496809 621878445 623195231 624643445 625888884 626697540 627447844
744.5 627447844 628405988 629213452 629494548 629498541 629628599 629759848 629596710 629295230 629320145 629724741
764.9 629724741 630102217 630228937 630438924 631102204 632021666 632806480 633728862 635598779 638541579
783.2 638541579 641754508 644669235 647540450 650623322 653543234 655721366 657169759 658468783
799.5 658468783 659781158 660516083 660280704 659654200 659397960 659396887 659089029 658582807 658601701 659350812
819.9 659350812 660056591 660067976 659852564 660282195 661373436 662391007 663134933 664245009 666052461
838.3 666052461 667842984 668753743 668868065 668776691 668547690 667725801 666308343 665073872 664571583
$$ packed form
709.8E96325576J856029J795054J727819K003372K463102K551377K334714K405226
726.1F13462269K636910K489686J907944J381636J316786J448214J245439Q08656P50304
744.5F27447844R58144Q07464K81096L993J30058J31249j63138l01480K4915M04596
764.9F29724741L77476J26720K09987O63280R19462P84814R22382J869917K942800
783.2F38541579L212929K914727K871215L082872K919912K178132J448393J299024
799.5F58468783J312375P34925k35379o26504k56240j073l07858n06222J8894P49111
819.9F59350812P05779J1385k15412M29631J091241J017571P43926J110076J807452
838.3F66052461J790523R10759J14322r1374k29001q21889j417458j234471n02289
$$ plain form
856.6 664571583 664400339 664019346 663726747 664238453 665611148 667076051 668003857 668619215 669377387
875 669377387 670032680 669853210 668625891 666910112 665171146 663201392 660720944 658099532 656029403
893.4 656029403 654723942 653732538 652595043 651408017 650402904 649252653 647322595 644540727 641470253
911.7 641470253 638534486 635625482 632597148 629897177 628237367 627592266 627173483 626519799 625883043
930.1 625883043 625483155 624895096 623456061 621203125 618796945 616462588 613685369 610125542 606273353
948.4 606273353 602774918 599485934 595753908 591485083 587297738 583522260 579677165 575235844
964.7 575235844 570359826 565429270 560185313 553991377 546861947 539507806 532360435 525190055
981.1 525190055 517811775 510685146 504511714 499428779 494990021 490906209 487356037 484462500
$$ packed form
856.6F64571583j71244l80993k92599N11706J372695J464903R27806O15358P58172
875F69377387O55293j79470j227319j715779j738966j969754k480448k621412k070129
893.4F56029403j305461r91404j137495j187026j005113j150251j930058k781868l070474
911.7F41470253k935767k909004l028334k699971j659810o45101m18783o53684o36756
930.1F25883043l99888n88059j439035k252936k406180k334357k777219l559827l852189
948.4F06273353l498435l288984l732026m268825m187345l775478l845095m441321
964.7E75235844m876018m930556n243957o193936p129430p354141p147371p170380
981.1E25190055p378280p126629o173432n082935m438758m083812l550172k893537
$$ plain form
997.4 484462500 481912851 479265124 476378947 473455518 470671415 467909932 465045422 462350279
1013.7 462350279 460222661 458693087 457480609 456379056 455512524 455118090 455122799 455207288 455224276 455287427
1034.1 455287427 455429882 455331892 454661518 453532904 452392906 451495796 450707734 450023085 449847132
1052.4 449847132 450507313 451820433 453359514 454967201 456793278 458779454 460379660 460996240 460602909
1070.8 460602909 459783137 459218413 459301353 460194558 462125123 465188414 468930662 472594470 475730240
1089.2 475730240 478353858 480484903 481867522 482370883 482370734 482489765 483086407 484132320 485582799
1107.5 485582799 487603217 490321100 493533671 496777594 499751210 502514482 505140126 507465661
1123.8 507465661 509393692 511206985 513305426 515564799 517384470 518381417 518648326 518482804 518072784
$$ packed form
997.4D84462500k549649k647727k886177k923429k784103k761483k864510k695143
1013.7D62350279k127618j529574j212478j101553q66532l94434M709Q4489J6988O3151
1034.1D55287427J42455r7990o70374j128614j139998q97110p88062o84649j75953
1052.4D49847132O60181J313120J539081J607687J826077J986176J600206O16580l93331
1070.8D60602909q19772n64724Q2940Q93205J930565L063291L742248L663808L135770
1089.2D75730240K623618K131045J382619N03361j49J19031N96642J045913J450479
1107.5D85582799K020418K717883L212571L243923K973616K763272K625644K325535
1123.8E07465661J928031J813293K098441K259373J819671R96947K66909j65522m10020
$$ plain form
1142.2 518072784 517491579 516952097 516887426 517593682 518940747 520717680 523035824 526177764 530268490
1160.5 530268490 535194993 540829122 547217548 554398477 562132180 569937289 577455044 584679425
1176.9 584679425 591662467 598101139 603553534 608046710 612000942 615484476 618034840 619312465
1193.2 619312465 619578779 619351208 618794680 617794096 616479814 615353644 614753723 614358187 613566518
1211.5 613566518 612277567 610847116 609360337 607485831 605062366 602427959 600045025 597951114
1227.9 597951114 595835567 593705595 591987252 590884686 590088546 589278698 588621616 588497818 588886559
1246.2 588886559 589358449 589682221 590059400 590734959 591583788 592279255 592861235 593731880 595039189
1264.6 595039189 596458137 597658515 598739386 600014567 601409137 602439940 602886975 603136897 603606284
$$ packed form
1142.2E18072784n81205n39482o4671P06256J347065J776933K318144L141940M090726
1160.5E30268490M926503N634129O388426P180929P733703P805109P517755P224381
1176.9E84679425O983042O438672N452395M493176L954232L483534K550364J277625
1193.2F19312465K66314k27571n56528j000584j314282j126170n99921l95536p91669
1211.5F13566518j288951j430451j486779j874506k423465k634407k382934k093911
1227.9E97951114k115547k129972j718343j102566p96140q09848o57082j23798L88741
1246.2E88886559M71890L23772L77179O75559Q48829O95467N81980Q70645J307309
1264.6E95039189J418948J200378J080871J275181J394570J030803M47035K49922M69387
$$ plain form
1282.9 603606284 604156256 604390860 604236424 603942692 603564441 602808595 601456523 599714339 597974956
1301.3 597974956 596283615 594299197 591892421 589426517 587232649 585228622 583230138 581363678
1317.6 581363678 579957604 579047680 578214943 577097058 575818598 574727595 573841155 572881520 571817875
1336 571817875 571045697 570967674 571342468 571639597 571832299 572194576 572704375 572994173 572869003 572535634
1356.4 572535634 572193086 571698725 570873022 569833338 568770289 567799747 566931307 565907598 564724326
1374.7 564724326 563688338 562512934 560452878 557743609 556024432 556197941 556923091 556662917 555385888
1393.1 555385888 553647280 552009940 550485313 549016297 547620893 546446860 545690775 545150638 544679224
1411.4 544679224 544368446 544294953 544603288 545572996 546814084 548188150 549913704 551693022 553319812
$$ packed form
1282.9F03606284N49972K34604j54436k93732l78251p55846j352072j742184j739383
1301.3E97974956j691341j984418k406776k465904k193868k004027j998484j866460
1317.6E81363678j406074r09924q32737j117885j278460j091003q86440r59635j063645
1336E71817875p72178p8023L74794K97129J92702L62277N09799K89798j25170l33369
1356.4E72535634l42548m94361q25703j039684j063049r70542q68440j023709j183272
1374.7E64724326j035988j175404k060056k709269j719177J73509P25150k60174j277029
1393.1E55385888j738608j637340j524627j469016j395404j174033p56085n40137m71414
1411.4E44679224l10778p3493L08335R69708J241088J374066J725554J779318J626790
$$ plain form
1429.8 553319812 554681361 555690289 556767046 558123708 559132934 559799612 560387552 560950220 561471105
1448.1 561471105 561870813 562094033 562358856 563507020 566183209 568839908 571210384 574367285 578374386
1466.5 578374386 582313776 586803317 593461335 601076424 607467830 612575352 616739333 620157480
1482.8 620157480 622456074 623473585 623485386 622879088 621667206 619435072 616042614 612406313 609151304
1501.2 609151304 605985641 601959825 596807897 593184114 590598822 587836802 584990323 582597136
1517.5 582597136 581079841 580118597 579199255 577913880 576307774 574792087 573248446 571565866 570046484
1535.8 570046484 568488538 566821516 565890253 565558016 565413833 565514565 566002727 566787958 567495584
1554.2 567495584 567976832 569082260 571301639 572465539 572719753 572754860 572712779 572554469 571936250
$$ packed form
1429.8E53319812J361549J008928J076757J356662J009226O66678N87940N62668N20885
1448.1E61471105L99708K23220K64823J148164K676189K656699K370476L156901M007101
1466.5E78374386L939390M489541O658018P615089O391406N107522M163981L418147
1482.8F20157480K298594J017511J1801o06298j211882k232134l392458l636301l255009
1501.2F09151304l165663m025816n151928l623783k585292k762020k846479k393187
1517.5E82597136j517295r61244r19342j285375j606106j515687j543641j682580j519382
1535.8E70046484j557946j667022r31263l32237j44183J00732M88162P85231P07626
1554.2E67495584M81248J105428K219379J163900K54214L5107m2081j58310o18219
$$ plain form
1572.6 571936250 570589721 568738103 567016125 565035582 562325299 559146941 555767179 552156746
1588.9 552156746 548181891 544023931 540015459 536374211 532918036 529314280 525597990 522035897
1605.2 522035897 518597960 514979064 511196792 507459819 503491163 499240428 495773226 492487729
1621.5 492487729 488693118 485083103 481609076 478145123 475321710 473077893 471113265 469939888
1637.8 469939888 469352961 469016761 468874753 469008386 469584048 470129371 470825493 472655565 474525154
1656.2 474525154 475980580 477710813 480214655 483259290 485982269 489014059 493133426 497322828
1672.5 497322828 501861691 507065177 511839092 516190767 521336496 528830111 535923600 541823149
1688.8 541823149 548091114 553967297 560255527 567378640 574620903 582963467 589606464 594799995
$$ packed form
1572.6E71936250j346529j851618j721978j980543k710283l178358l379762l610433
1588.9E52156746l974855m157960m008472l641248l456175l603756l716290l562093
1605.2E22035897l437937l618896l782272l736973l968656m250735l467202l285497
1621.5D92487729l794611l610015l474027l463953k823413k243817j964628j173377
1637.8D69939888n86927l36200j42008J33633N75662N45323O96122J830072J869589
1656.2D74525154J455426J730233K503842L044635K722979L031790M119367M189402
1672.5D97322828M538863N203486M773915M351675N145729P493615P093489N899549
1688.8E41823149O267965N876183O288230P123113P242263Q342564O642997N193531
$$ plain form
1705.1 594799995 600059450 604443312 607805133 610381842 612536848 615135491 617854297 619762063
1721.5 619762063 621215880 622624993 623875976 624922514 625754774 626965463 628779948 630353212
1737.8 630353212 632091224 634369433 637006700 640050232 643595815 648022175 653125584 657866299
1754.1 657866299 662603855 667598009 672373414 677486598 682403862 686514914 690235078 693760097
1770.4 693760097 697641730 701470673 704372942 706750989 709136844 711518943 713766217 715791047
1786.7 715791047 717399359 718913376 720943689 722951710 724472761 725895286 727593064 729409873
1803 729409873 730954111 732262969 733592153 735085607 736506641 737684786 738823712 740064800 741191804
1821.4 741191804 742104352 743018150 743943393 745020628 746310771 747364819 748182595 749085903 749925792
$$ packed form
1705.1E94799995N259455M383862L361821K576709K155006K598643K718806J907766
1721.5F19762063J453817J409113J250983J046538Q32260J210689J814485J573264
1737.8F30353212J738012K278209K637267L043532L545583M426360N103409M740715
1754.1F57866299M737556M994154M775405N113184M917264M111052L720164L525019
1770.4F93760097L881633L828943K902269K378047K385855K382099K247274K024830
1786.7G15791047J608312J514017K030313K008021J521051J422525J697778J816809
1803G29409873J544238J308858J329184J493454J421034J178145J138926J241088J127004
1821.4G41191804R12548R13798R25243J077235J290143J054048Q17776R03308Q39889
$$ plain form
1839.8 749925792 750452995 751035631 752046764 753112495 753977597 754644573 755243480 755943358 756676257
1858.1 756676257 757320404 757853150 758278608 758614063 759114385 759897232 760607839 761178553 761748254 762266517
1878.5 762266517 762654662 763056993 763588607 764044821 764348447 764747322 765244842 765709937 766152978 766527236
1898.9 766527236 766858637 767237186 767624974 767904937 768147349 768507600 768886328 769085407 769188583 769417167
1919.3 769417167 769730389 770108342 770487845 770718873 770876944 771084547 771308362 771448553 771513879 771534264
1939.7 771534264 771612763 771839797 772041142 772136211 772253692 772413611 772545218 772636056 772723854 772862434
1960.1 772862434 773020625 773095489 773103118 773196816 773387909 773545027 773610890 773632109 773693979 773815453 773940742
1982.5 773940742 773987353 773969591 773943841 773954213 774037957 774112225 774124563 774159074 774224520 774190128 774049878
$$ packed form
1839.8G49925792N27203N82636J011133J065731Q65102O66976N98907O99878P32899
1858.1G56676257O44147N32746M25458L35455N00322P82847P10607N70714N69701N18263
1878.5G62266517L88145M02331N31614M56214L03626L98875M97520M65095M43041L74258
1898.9G66527236L31401L78549L87788K79963K42412L60251L78728J99079J03176K28584
1919.3G69417167L13222L77953L79503K31028J58071K07603K23815J40191O5326K0385
1939.7G71534264P8499K27034K01345R5069J17481J59919J31607R0838Q7798J38580
1960.1G72862434J58191P4864P629R3698J91093J57118O5863K1219O1870J21474J25289
1982.5G73940742M6611j7762k5750J0372Q3744P4268J2338L4511O5446l4392j40250
$$ plain form
2005 774049878 773956537 773976743 773985088 773848891 773633599 773515046 773500085 773424029 773256838 773094296 772988558
2027.4 772988558 772925913 772836089 772646666 772460997 772413075 772397161 772287071 772128642 772032857 772051275 772097170
2049.8 772097170 772043884 771957576 772000790 772138178 772185028 772104502 772061646 772179008 772334516 772334278 772248566
2072.3 772248566 772291899 772490978 772627592 772559941 772467434 772576451 772804081 772862852 772732496 772713184
2092.7 772713184 772934258 773137391 773106635 773018003 773151755 773429811 773521841 773386538 773342192 773575962
2113.1 773575962 773845732 773867249 773766577 773853958 774123907 774268568 774182677 774153411 774401009 774725854
2133.5 774725854 774825513 774744332 774821997 775154233 775414348 775391340 775345504 775576591 775939465 776094198
2153.9 776094198 776016176 776043415 776373863 776744604 776855946 776841581 777042627 777474225 777794480 777851641
$$ packed form
2005G74049878r3341K0206Q345j36197k15292j18553j4961p6056j67191j62542j05738
2027.4G72988558o2645q9824j89423j85669m7922j5914j10090j58429r5785J8418M5895
2049.8G72097170n3286q6308M3214J37388M6850q0526m2856J17362J55508k38q5712
2072.3G72248566M3333J99079J36614o7651r2507J09017K27630N8771j30356j9312
2092.7G72713184K21074K03133l0756q8632J33752K78056R2030j35303m4346K33770
2113.1G73575962K69770K1517j00672Q7381K69949J44661q5891k9266K47598L24845
2133.5G74725854R9659q1181P7665L32236K60115k3008m5836K31087L62874J54733
2153.9G76094198p8022K7239L30448L70741J11342j4365K01046M31598L20255N7161
$$ plain form
2174.3 777851641 777935505 778275013 778670132 778829038 778836429 779031694 779438674 779722929 779740155 779746354 780007899
2196.7 780007899 780410409 780619681 780610502 780703723 781032085 781345129 781421900 781395078 781544983 781871796
2217.1 781871796 782071173 782031596 782013059 782220840 782495618 782576978 782522559 782583356 782798767 782959759
2237.5 782959759 782927871 782840729 782926619 783146024 783237875 783154070 783129752 783284783 783439815 783423305 783349097
2259.9 783349097 783417284 783582985 783660412 783590913 783495069 783525050 783634663 783644855 783528149 783467352 783549666
2282.3 783549666 783619285 783520281 783292830 783118367 783057332 782973766 782762587 782529414 782429338 782379091
2302.7 782379091 782193184 781860411 781513989 781287611 781141818 780882776 780479848 780116141 779886603 779701054
2323.1 779701054 779471517 779197752 778970659 778834581 778613925 778220892 777845144 777599216 777430415 777376831
$$ packed form
2174.3G77851641Q3864L39508L95119J58906P391J95265M06980K84255J7226O199K61545
2196.7G80007899M02510K09272r179R3221L28362L13044P6771k6822J49905L26813
2217.1G81871796J99377l9577j8537K07781K74778Q1360n4419O0797K15411J60992
2237.5G82959759l1888q7142Q5890K19405R1851q3805k4318J55031J55032j6510p4208
2259.9G83349097O8187J65701P7427o9499r5844K9981J09613J0192j16706o0797Q2314
2282.3G83549666O9619r9004k27451j74463o1035q3566k11179k33173j00076n0247
2302.7G82379091j85907l32773l46422k26378j45793k59042m02928l63707k29538j85549
2323.1G79701054k29537k73765k27093j36078k20656l93033l75748k45928j68801n3584
$$ plain form
2343.5 777376831 777450681 777294099 776694298 775907815 775197625 774601221 774235249 774125874 774070144 773955941
2363.9 773955941 773868203 773904502 773984373 773978353 773900568 773864388 773901224 773897171 773750305 773516715 773296893
2386.4 773296893 773076475 772758663 772344172 771943986 771628082 771344364 770955622 770445228 769960940 769575894
2406.8 769575894 769207120 768750191 768218994 767740905 767341793 766899407 766344368 765763164 765287101 764878929
2427.2 764878929 764389157 763808131 763264358 762822807 762374699 761799335 761162102 760592997 760088861 759556353
2447.6 759556353 758958817 758351684 757808983 757306874 756751895 756149292 755557358 754978597 754377961 753726959
2467.9 753726959 753086030 752542496 752044857 751452506 750751555 750079453 749526858 749017477 748426199 747762442
2488.3 747762442 747135699 746601284 746097803 745512545 744863510 744281828 743781090 743246734 742634535 742054105
$$ packed form
2343.5G77376831P3850j56582n99801p86483p10190n96404l65972j09375n5730j14203
2363.9G73955941q7738L6299P9871o020p7785l6180L6836m053j46866k33590k19822
2386.4G73296893k20418l17812m14491m00186l15904k83718l88742n10394m84288l85046
2406.8G69575894l68774m56929n31197m78089l99112m42386n55039n81204m76063m08172
2427.2G64878929m89772n81026n43773m41551m48108n75364o37233n69105n04136n32508
2447.6G59556353n97536o07133n42701n02109n54979o02603n91934n78761o00636o51002
2467.9G53726959o40929n43534m97639n92351p00951o72102n52595n09381n91278o63757
2488.3G47762442o26743n34415n03481n85258o49035n81682n00738n34356o12199n80430
$$ plain form
2508.7 742054105 741602004 741197944 740698278 740104795 739566684 739142776 738709271 738174438 737607539 737115681
2529.1 737115681 736683547 736207843 735653639 735094965 734618306 734187722 733682334 733083606 732514977 732062876
2549.5 732062876 731633544 731097162 730510771 729993999 729515910 728982389 728379965 727797210 727311432 726862609
2569.9 726862609 726311386 725637555 725016713 724536300 724030912 723394811 722741187 722176075 721649885 721050382
2590.3 721050382 720377684 719733119 719163835 718606174 717960894 717251241 716616213 716089427 715521932 714813352
2610.7 714813352 714068234 713403761 712805271 712181509 711465716 710730970 710081875 709442675 708693624 707890928
2631.1 707890928 707164049 706511319 705816925 705045938 704272866 703571916 702915847 702170670 701336503 700579643
2651.5 700579643 699930370 699246824 698452890 697628140 696906388 696302772 695650637 694872558 694108665 693440795
$$ packed form
2508.7G42054105m52101m04060m99666n93483n38111m23908m33505n34833n66899m91858
2529.1G37115681m32134m75704n54204n58674m76659m30584n05388n98728n68629m52101
2549.5G32062876m29332n36382n86391n16772m78089n33521o02424n82755m85778m48823
2569.9G26862609n51223o73831o20842m80413n05388o36101o53624n65112n26190n99503
2590.3G21050382o72698o44565n69284n57661o45280p09653o35028n26786n67495p08580
2610.7G14813352p45118o64473n98490o23762p15793p34746o49095o39200p49051q02696
2631.1G07890928p26879o52730o94394p70987p73072p00950o56069p45177q34167p56860
2651.5G00579643o49273o83546p93934q24750p21752o03616o52135p78079p63893o67870
$$ plain form
2671.9 693440795 692781031 692047715 691290319 690618634 690033138 689420402 688712656 687960386 687279105 686679840
2692.3 686679840 686024725 685264945 684522212 683869779 683222592 682480037 681663513 680887401 680180728 679442823
2712.7 679442823 678657055 677905858 677196622 676480532 675739706 675014973 674339831 673694789 673056245 672391415
2733.1 672391415 671704888 671074748 670515180 669955730 669369221 668775022 668190598 667611480 667014420 666402400
2753.5 666402400 665811241 665248156 664651394 663997591 663356721 662751675 662137091 661476076 660765588 660066426
2773.9 660066426 659401476 658699393 657939196 657141089 656332374 655559480 654785812 653958201 653091550 652204394
2794.3 652204394 651313841 650381565 649342954 648237884 647132635 646023750 644894540 643734515 642512083
2812.6 642512083 641219616 639899433 638564527 637178838 635720313 634164214 632492483 630742252
$$ packed form
2671.9F93440795o59764p33316p57396o71685n85496o12736p07746p52270o81281n99265
2692.3F86679840o55115p59780p42733o52433o47187p42555q16524p76112p06673p37905
2712.7F79442823p85768p51197p09236p16090p40826p24733o75142o45042o38544o64830
2733.1F72391415o86527o30140n59568n59450n86509n94199n84424n79118n97060o12020
2753.5F66402400n91159n63085n96762o53803o40870o05046o14584o61015p10488o99162
2773.9F60066426o64950p02083p60197p98107q08715p72894p73668q27611q66651q87156
2794.3F52204394q90553r32276j038611j105070j105249j108885j129210j160025j222432
2812.6F42512083j292467j320183j334906j385689j458525j556099j671731j750231
$$ plain form
2828.9 630742252 628926516 626989961 624860704 622468770 619715691 616528571 612874866 608696878
2845.3 608696878 604132175 599753320 596274078 594046652 593002021 592813194 592912078 592749953 592137218
2863.6 592137218 591096759 589669347 588061690 586611331 585460544 584554791 583851397 583246052 582564890
2882 582564890 581748247 580801487 579705775 578493774 577231944 575919986 574492455 572910845 571229279
2900.3 571229279 569494486 567644894 565595925 563259006 560509086 557284296 553641021 549820721
2916.6 549820721 546243787 543271601 541126132 539942801 539724886 540287733 541384459 542951226 544994175
2935 544994175 547379911 549955368 552616715 555235922 557600200 559459805 560757935 561669946 562374711
2953.4 562374711 563015342 563792169 564919055 566458106 568325281 570493817 572941601 575561047 578283012
$$ packed form
2828.9F30742252j815736j936555k129257k391934k753079l187120l653705m177988
2845.3F08696878m564703m378855l479242k227426j044631j88827R8884j62125o12735
2863.6E92137218j040459j427412j607657j450359j150787r05753p03394o05345o81162
2882E82564890q16643r46760j095712j212001j261830j311958j427531j581610j681566
2900.3E71229279j734793j849592k048969k336919k749920l224790l643275l820300
2916.6E49820721l576934k972186k145469j183331k17915N62847J096726J566767K042949
2935E44994175K385736K575457K661347K619207K364278J859605J298130R12011P04765
2953.4E62374711O40631P76827J126886J539051J867175K168536K447784K619446K721965
$$ plain form
2971.7 578283012 581023753 583651066 586151183 588535726 590704441 592612565 594338894 595927656
2988 595927656 597342908 598516464 599364638 599911809 600218713 600241065 599997401 599615574 599222302 598871529
3008.4 598871529 598510742 598029792 597390890 596658945 595860004 594964385 593985498 592965424 591905236
3026.8 591905236 590819240 589764655 588763595 587718666 586552680 585395157 584317684 583192289
3043.1 583192289 581948340 580637395 579357564 578132987 576881647 575606406 574370921 573178411
3059.4 573178411 572024584 570921659 569872856 568846762 567809582 566773474 565777242 564843357 563945174
3077.8 563945174 563012898 562037408 561076045 560120285 559174538 558257878 557292461 556253076 555258334
3096.1 555258334 554373085 553465009 552419484 551330864 550337315 549388349 548319638 547192395 546169639
$$ packed form
2971.7E78283012K740741K627313K500117K384543K168715J908124J726329J588762
2988E95927656J415252J173556Q48174N47171L06904K2352k43664l81827l93272l50773
3008.4E98871529l60787m80950o38902p31945p98941q95619r78887j020074j060188
3026.8E91905236j085996j054585j001060j044929j165986j157523j077473j125395
3043.1E83192289j243949j310945j279831j224577j251340j275241j235485j192510
3059.4E73178411j153827j102925j048803j026094j037180j036108r96232r33885q98183
3077.8E63945174r32276r75490r61363r55760r45747r16660r65417j039385r94742
3096.1E55258334q85249r08076j045525j088620r93549r48966j068711j127243j022756
$$ plain form
3114.5 546169639 545169055 544043124 542741835 541333914 539996028 538765848 537521780 536194801
3130.8 536194801 534828663 533521295 532290995 531028330 529636681 528180599 526764750 525375843
3147.1 525375843 524003923 522657573 521237910 519712389 518192112 516718090 515265763 513811290
3163.4 513811290 512330711 510834217 509334266 507831514 506342649 504863977 503372192 501899302
3179.8 501899302 500448942 498992562 497531295 496074349 494639844 493211389 491768092 490334302
3196.1 490334302 488930494 487556726 486199826 484815538 483383328 481976092 480692029 479497910
3212.4 479497910 478283226 477014303 475709260 474394560 473110706 471870661 470647842 469444871
3228.7 469444871 468274415 467068225 465747327 464368552 463028640 461731225 460452586 459168732
$$ packed form
3114.5E46169639j000584j125931j301289j407921j337886j230180j244068j326979
3130.8E36194801j366138j307368j230300j262665j391649j456082j415849j388907
3147.1E25375843j371920j346350j419663j525521j520277j474022j452327j454473
3163.4E13811290j480579j496494j499951j502752j488865j478672j491785j472890
3179.8E01899302j450360j456380j461267j456946j434505j428455j443297j433790
3196.1D90334302j403808j373768j356900j384288j432210j407236j284063j194119
3212.4D79497910j214684j268923j305043j314700j283854j240045j222819j202971
3228.7D69444871j170456j206190j320898j378775j339912j297415j278639j283854
$$ plain form
3245 459168732 457853854 456508398 455178022 453917891 452695042 451442569 450177640 448885411 447563738
3263.4 447563738 446326643 445193112 444094390 442981601 441815108 440638870 439528704 438457489
3279.7 438457489 437385887 436349303 435364991 434425771 433572441 432801276 432006776 431115001 430160463
3298 430160463 429235578 428377986 427594244 426843971 425984442 424969047 423898309 422854841 421852380
3316.4 421852380 420846105 419784129 418713152 417652935 416492492 415244758 414022714 412796855
3332.7 412796855 411547065 410375029 409244210 407994270 406654328 405328900 404028744 402772754
3349 402772754 401524425 400190294 398772776 397383809 396124780 394933522 393679559 392433941 391308218
3367.4 391308218 390172631 388891906 387583911 386376470 385251820 384185255 383135051 382120728
$$ packed form
3245D59168732j314878j345456j330376j260131j222849j252473j264929j292229j321673
3263.4D47563738j237095j133531j098722j112789j166493j176238j110166j071215
3279.7D38457489j071602j036584r84312r39220q53330p71165p94500q91775r54538
3298D30160463r24885q57592p83742p50273q59529j015395j070738j043468j002461
3316.4D21852380j006275j061976j070977j060217j160443j247734j222044j225859
3332.7D12796855j249790j172036j130819j249940j339942j325428j300156j255990
3349D02772754j248329j334131j417518j388967j259029j191258j253963j245618j125723
3367.4C91308218j135587j280725j307995j207441j124650j066565j050204j014323
$$ plain form
3383.7 382120728 381229043 380527139 379978329 379362285 378545314 377701133 377112389 376721770 376130819 375302225
3404.1 375302225 374606252 374126971 373739928 373374879 372921914 372429729 372088164 371899337 371775448 371760577
3424.5 371760577 371908844 372187018 372468770 372738272 373114884 373523891 373772949 373942077 374307334 374943256
3444.9 374943256 375689745 376434833 377209961 378023416 378908157 379949093 381128132 382266641 383357942
3463.2 383357942 384636581 386072189 387353837 388379991 389420360 390693426 392164826 393615067
3479.6 393615067 394908190 396250844 397754461 399233699 400665849 402185500 403824627 405541599
3495.9 405541599 407201469 408803046 410476118 412149906 413707942 415297359 417094141 419072360
3512.2 419072360 421023160 422806114 424541056 426401824 428473353 430569947 432525337 434502304
$$ packed form
3383.7C82120728q91685p01904n48810o16044q16971q44181n88744l90619n90951q28594
3404.1C75302225o95973m79281l87043l65049m52965m92185l41565j88827j23889j4871
3424.5C71760577J48267K78174K81752K69502L76612M09007K49058J69128L65257O35922
3444.9C74943256P46489P45088P75128Q13455Q84741J040936J179039J138509J091301
3463.2C83357942J278639J435608J281648J026154J040369J273066J471400J450241
3479.6C93615067J293123J342654J503617J479238J432150J519651J639127J716972
3495.9D05541599J659870J601577J673072J673788J558036J589417J796782J978219
3512.2D19072360J950800J782954J734942J860768K071529K096594J955390J976967
$$ plain form
3528.5 434502304 436620414 438821554 441161126 443599582 445911735 448179305 450590372 453129113
3544.8 453129113 455627352 457979083 460324585 462900370 465646386 468401164 471206665 473953784
3561.1 473953784 476440310 479029030 482477814 486305743 489580721 492566109 495756775 499160558
3577.5 499160558 502675533 506181598 509476662 512798071 516704082 520792723 524332881 527796805
3593.8 527796805 531651318 535696924 539762974 543743193 547394931 550842941 554690301 558843553
3610.1 558843553 562851369 566725791 570372522 574389100 579145014 583256483 586205959 588947117
3626.4 588947117 593195796 598501921 602567732 606077194 609669209 613159060 616592407 619746625
3642.7 619746625 622321427 624992669 629275024 634234011 637562215 640267551 643810093 647318304
$$ packed form
3528.5D34502304K118110K201140K339572K438456K312153K267570K411067K538741
3544.8D53129113K498239K351731K345502K575785K746016K754778K805501K747119
3561.1D73953784K486526K588720L448784L827929L274978K985388L190666L403783
3577.5D99160558L514975L506065L295064L321409L906011M088641L540158L463924
3593.8E27796805L854513M045606M066050L980219L651738L448010L847360M153252
3610.1E58843553M007816L874422L646731M016578M755914M111469K949476K741158
3626.4E88947117M248679N306125M065811L509462L592015L489851L433347L154218
3642.7F19746625K574802K671242M282355M958987L328204K705336L542542L508211
$$ plain form
3659 647318304 650050461 652412415 654449701 656209707 658480823 661123157 663020849 665462852 668729901
3677.4 668729901 671123624 672907829 674399614 675613165 677204847 679545939 681728482 683263958
3693.7 683263958 684429586 685380697 686343610 687715590 689113379 689848781 690223515 691049457 692718565
3712.1 692718565 694288373 695085347 695553541 696088910 696749032 697454453 698170841 698675036 698789239
3730.4 698789239 698989272 699911714 701379180 702280223 702109516 701776147 702505291 703327775 703529119
3748.8 703529119 704518795 705975294 706553757 706694782 707212687 707960129 708317280 708517075 708885133
3767.1 708885133 709516406 710360467 710836053 710849166 710981786 711562455 712080479 712261021 712606966 713160932
3787.5 713160932 713573456 713707328 713608146 713578582 713616848 713671148 714249969 714823306 715090990 715776801
$$ packed form
3659F47318304K732157K361954K037286J760006K271116K642334J897692K442003L267049
3677.4F68729901K393723J784205J491785J213551J591682K341092K182543J535476
3693.7F83263958J165628R51111R62913J371980J397789P35402L74734Q25942J669108
3712.1F92718565J569808P96974M68194N35369O60122P05421P16388N04195J14203
3730.4F98789239K00033R22442J467466R01043j70707l33369P29144Q22484K01344
3748.8G03529119R89676J456499N78463J41025N17905P47442L57151J99795L68058
3767.1G08885133O31273Q44061M75586J3113J32620N80669N18024J80542L45945N53966
3787.5G13160932M12524J33872r9182k9564L8266N4300N78821N73337K67684O85811
$$ plain form
3807.9 715776801 716244400 715935171 715515912 715701818 715980530 716208339 717080534 717654884 717695534 717702270
3828.3 717702270 717594147 717520714 717581511 717752516 718169510 718662739 719121099 719537675 719502032 718776107
3848.7 718776107 717810333 718091965 719916224 720679760 720299244 719799757 719727159 720018744 720038414 720053256
3869.1 720053256 720537424 720924854 721068084 720890403 720615208 720816314 721147954 721489251 721652269 721418560
3889.5 721418560 721536040 721892953 721607625 720906138 720544457 720777333 721407235 722071707 722355545 722305417
3909.9 722305417 722118199 721840680 721687675 721817374 721928418 721822441 721786857 721905828 721884966 721828640
3930.3 721828640 722050071 722338378 722375274 722196877 721959531 721894205 721965969 721970379 722021103 722155452 722241461
3952.7 722241461 722247541 722214162 722185075 722169042 722166657 722150564 722138464 722146392 722098291 722027123 722049356 722113073
$$ packed form
3807.9G15776801M67599l09229m19259J85906K78712K27809Q72195N74350M0650O736
3828.3G17702270j08123p3433O0797J71005M16994M93229M58360M16576l5643p25925
3848.7G18776107r65774K81632J824259P63536l80516m99487p2598K91585J9670J4842
3869.1G20053256M84168L87430J43230j77681k75195K01106L31640L41297J63018k33709
3889.5G21418560J17480L56913k85328p01487l61681K32876O29902O64472K83838n0128
3909.9G22305417j87218k77519j53005J29699J11044j05977l5584J18971k0862n6326
3930.3G21828640K21431K88307L6896j78397k37346o5326P1764M410N0724J34349Q6009
3952.7G22241461O080l3379k9087j6033k385j6093j2100P928m8101p1168K2233O3717
$$ plain form
3977.2 722113073 722116709 722116411 722180665 722225845 722195268 722164869 722169101 722173989 722178876 722201526
3997.6 722201526
$$ packed form
3977.2G22113073L636k98O4254M5180l0577l0399M232M888M887K2650
3997.6G22201526
##END=$$ End of the data block
