##TITLE=$$ Begin of the data block
##JCAMP-DX=5.00 $$ ACD/SpecManager v 10.08
##SPECTROMETER/DATA SYSTEM=Alpha
##DATE=10 Nov 2014 10:35:34
##DATA TYPE=INFRARED SPECTRUM
##DATA CLASS=XYDATA
##ORIGIN=
##OWNER=
##NPOINTS=1765
##FIRSTX=399.76428223
##LASTX=3997.64306641
##MAXX=3997.64306641
##MINX=399.76428223
##MAXY=0.82077444
##MINY=0.47146821
##XFACTOR=1.0000000000
##YFACTOR=1.000000000000000e-9
##FIRSTY=0.66999567
##DELTAX=2.03961372
##XUNITS=1/CM
##YUNITS=ARBITRARY UNITS
##XYDATA=(X++(Y..Y))
399.8F69995666j073242K40684K70545j702368k402842k29001J174152m05729k572000
418.1F63295865j385510J022101M0590k101481j709699O72340J280248n64038j334191
436.5F59216225J53959Q69393l91125j080275L22282J512826L13103j625001j373232
454.8F57918155K25067J24395j393795j195311M43279N35965j278698k038300m43757
473.2F52897000O04689m96625j392067n13494P03692P1824j327097r31383M39585K61128
493.6F50317252j257241j512647j75714K11417j218199k013624q48234N7400j209259
511.9F42351151k750874k255738o30975l32236j319229j343012Q2790O44446o03914
530.3F33842409j205564N245J092434P51496K01881Q01801J635730R79960n21183p48574
$$ plain form
399.8 669995666 668922424 669163108 669433653 667731285 665328443 665099442 666273594 665867865 663295865
418.1 663295865 661910355 662932456 662973046 660871565 659161866 659834206 661114454 660550416 659216225
436.5 659216225 659370184 660239577 659848452 658768177 659090459 660603285 660916388 659291387 657918155
454.8 657918155 658143222 658267617 656873822 655678511 656121790 656657755 655379057 653340757 652897000
473.2 652897000 653501689 653005064 651612997 651099503 651803195 651875019 650547922 649616539 650056124 650317252
493.6 650317252 649060011 647547364 647371650 647583067 646364868 644351244 643503010 643560410 642351151
511.9 642351151 639600277 637344539 636713564 636381328 635062099 633719087 633801877 634446323 633842409
530.3 633842409 632636845 632642090 633734524 634486020 634687901 635489702 637125432 638105392 637584209 636835635
550.7F36835635K38239M88282m55320r80854j93954M16160m06265j382649j090110
569.1F33469164k96533l66151p64430k47240P88093J212239P23720J70111M92216R53018
589.4F36134207L81768n55038l83676M82142M43817m01616n30243J98185N51164J22786
609.8F36443496l07262m2677N54025P39694N83052P95365J527071J812994J087904
628.2F43193662M76241R55880J604617J234650M23253N81622J510322J687169R19819
646.6F52587235O29365J320184J726746J082063K79725M40597J024246P79152R1017
664.9F59960330Q6963J188755J548230Q45254N92172J303017J869440J161933J65463
683.3F68721557M56154J303256R28878j98006l64244L97086N84423j25110m12166M82798
$$ plain form
550.7 636835635 637073874 637562156 637106836 636125982 635932028 636348188 635941923 634559274 633469164
569.1 633469164 633172631 632806480 632042050 631794810 632582903 633795142 634518862 634688973 635181189 636134207
589.4 636134207 636515975 635960937 635577261 636059403 636503220 636101604 635571361 635769546 636320710 636443496
609.8 636443496 636136234 636093557 636647582 637387276 637970328 638765693 640292764 642105758 643193662
628.2 643193662 643669903 644625783 646230400 647465050 647888303 648469925 649980247 651667416 652587235
646.6 652587235 653216600 654536784 656263530 657345593 657625318 658065915 659090161 659869313 659960330
664.9 659960330 660047293 661236048 662784278 663629532 664221704 665524721 667394161 668556094 668721557
683.3 668721557 669177711 670480967 671409845 671211839 670847595 671244681 671829104 671703994 671291828 671774626
703.7F71774626J430392J155078M47035Q54194J994849K255439J528264J359760K294958
722F85094595K782285K023220J344741J808345K394617J794517P26640P11441J437723
740.4G00118124J370430M89116J41263O96838R78589K96414m56810l51548J93536P4148
760.8G03550100o19769o49869J40667N15401J9789l64661J01149Q48233J160443J382530
781.2G06084013K244294L458738L848791L100157K298713K314567K426386J723588
797.5G27499247P47740M84049P59542M43876o70552j342833r22203m14968n95689p11143
817.9G25277066j8894P24196M89891j51277J38462J217424J676023J123786P03395
836.2G31180072J220763J702785R30905l75092p64608m19796o98685j672507j868844
$$ plain form
703.7 671774626 673205018 674360096 674807131 675661325 677656174 679911613 681439877 682799637 685094595
722 685094595 687876880 689900100 691244841 693053186 695447803 697242320 697968960 698680401 700118124
740.4 700118124 701488554 701977670 702118933 702815771 703794360 704090774 703633964 703282416 703475952 703550100
760.8 703550100 702930331 702280462 702421129 702936530 702956319 702591658 702692807 703541040 704701483 706084013
781.2 706084013 708328307 711787045 715635836 718735993 721034706 723349273 725775659 727499247
797.5 727499247 728246987 728731036 729490578 729934454 729263902 727921069 726998866 726583898 725988209 725277066
817.9 725277066 725258172 725982368 726472259 726320982 726459444 727676868 729352891 730476677 731180072
836.2 731180072 732400835 734103620 735034525 734659433 733894825 733475029 732776344 731103837 729234993
854.6G29234993r43362l20912o60598p39992L89755J668573J665592Q56221P83681
873G31933951J452923J419902L49224m98832n07831o83785j672983k494871k187789
891.3G27109909j356065j216114j727462j703381r40979p69198j783669k782166k738177
909.7G12092698k395690k844274l479242l039539j762986r69172r89079p63178J22547
928F95972085N88238p0035r46343r91523o81222j119137k128243k522350k154231k193987
948.4F83753252l054380l642142l345788l093302l678381m406572m270077l708005
964.7F54554605l958165m994512n651951n609154n703628o340266o764292o336213
981.1F09196424n642771n423248n279601m482686l315985k644003k584278k460182
$$ plain form
854.6 729234993 728291631 727970719 727310121 726570129 726959884 728628457 730294049 731150270 731933951
873 731933951 733386874 734806776 735156000 734657168 734149337 733465552 731792569 729297698 727109909
891.3 727109909 725753844 724537730 722810268 721106887 720165908 719396710 717613041 714830875 712092698
909.7 712092698 709697008 706852734 703373492 700333953 698570967 697601795 696612716 695849538 695972085
928 695972085 696560323 696490288 695543945 694552422 693871200 692752063 690623820 688101470 685947239 683753252
948.4 683753252 680698872 677056730 673710942 670617640 666939259 662532687 658262610 654554605
964.7 654554605 650596440 645601928 639949977 634340823 628637195 622296929 615532637 609196424
981.1 609196424 603553653 598130405 592850804 588368118 585052133 582408130 579823852 577363670
997.4E77363670j949251j642704j993298k428532k323687j968265j918435k021849
1013.7E61117649j663446q71063m16159n11766m90308j8954M37558M42743K20597K14279
1034.1E58461130K82824j05501q59677j313746j266837j136244j134217q86499p1764
1052.4E51969469Q87930J373112J522780J832604K209842K077222J285792L08215m38988
1070.8E63027978q65877r31561m16755P58409K100229K974093L277302L290773L115057
1089.2E76329648K536417J571118O39558P1407j75655k44856n0903M78566J164854
1107.5E82320154J749158K119064K346337K477586K385736K057612J706957J480759
1123.8E98643363J423358J523793J679897J691044J453817J043916N15341o2406m61399
$$ plain form
997.4 577363670 575414419 573771715 571778417 569349885 567026198 565057933 563139498 561117649
1013.7 561117649 559454203 558583140 558166981 557655215 557164907 557145953 557583511 558026254 558246851 558461130
1034.1 558461130 558743954 558638453 557778776 556465030 555198193 554061949 552927732 552041233 551969469
1052.4 551969469 552857399 554230511 555753291 557585895 559795737 561872959 563158751 563466966 563027978
1070.8 563027978 562162101 561230540 560813785 561572194 563672423 566646516 569923818 573214591 576329648
1089.2 576329648 578866065 580437183 581076741 581148148 580972493 580727637 580676734 581155300 582320154
1107.5 582320154 584069312 586188376 588534713 591012299 593398035 595455647 597162604 598643363
1123.8 598643363 600066721 601590514 603270411 604961455 606415272 607459188 607974529 607912123 607450724
1142.2F07450724n00322k56598R2864M82500R54389J522780K134919K694965L280043
1160.5F17856264M098296N020678N700410O078660O363631O570220O466686N989194
1176.9F64144039N435527N025506M563570L844022L098309K634466K242208J540124
1193.2F92527771O37054P16j97769k91049m93765n49614k87354m8161k07245n95868
1213.6F90494716q26478r18448j199126j661718j898348j756370j576841j660407j719653
1231.9F77277327j370192q60393o71864p14957m92573K7001L63529L40521L12686N22077
1252.3F74733162P14004N86927L64959N10335R08792J036048Q76069Q64625J108945
1270.7F81703866J215815R17792N44787M65691N09620L30031J9192o5505N8055l7730
$$ plain form
1142.2 607450724 606950402 606693804 606786668 607269168 608223557 609746337 611881256 614576221 617856264
1160.5 617856264 621954560 626975238 632675648 638754308 645117939 651688159 658154845 664144039
1176.9 664144039 669579566 674605072 679168642 683012664 686110973 688745439 690987647 692527771
1193.2 692527771 693164825 693165541 692967772 692676723 692182958 691633344 691345990 691297829 691090584 690494716
1213.6 690494716 689668238 688749790 687550664 685888946 683990598 682234228 680657387 678996980 677277327
1231.9 677277327 675907135 675046742 674374878 673659921 673167348 673194349 673557878 673898399 674211085 674733162
1252.3 674733162 675447166 676034093 676399052 676909387 677818179 678854227 679730296 680594921 681703866
1270.7 681703866 682919681 683837473 684382260 684847951 685357571 685687602 685706794 685641289 685699344 685661614
1291.1F85661614n03838r31323j010000j007796j320243j749634j862884j739740j796723
1309.4F73739433k119720k187431j758933j411140j404523j337648j075029q97646
1325.8F61547363j036287j271784j172006q05616o74904q42571o33478Q6307M75943
1344.1F55672967L14057R1851J23680K31862Q6128k12073l87370n06580o08325o13451
1364.5F54192746o99640p19308n32449p83741j243949j220525j751363l744304m917741
1382.9F38579726k182245K332270L474355J352548o40511j525104j375973j220227
1399.2F38794839j150012j089871r54687n09024l48568l67641j00255J34170K7656
1417.5F34436607K88666J091063J538932J653492J463473J274467J406252J235247
$$ plain form
1291.1 685661614 685157776 684226453 683216453 682208657 680888414 679138780 677275896 675536156 673739433
1309.4 673739433 671619713 669432282 667673349 666262209 664857686 663520038 662445009 661547363
1325.8 661547363 660511076 659239292 658067286 657261670 656586766 655744195 655110717 655197024 655672967
1344.1 655672967 655987024 656078875 656202555 656434417 656520545 656308472 655921102 655414522 654806197 654192746
1364.5 654192746 653493106 652773798 652241349 651457608 650213659 648993134 647241771 643497467 638579726
1382.9 638579726 636397481 638729751 642204106 643556654 642916143 641391039 640015066 638794839
1399.2 638794839 637644827 636554956 635600269 635091245 634742677 634375036 634274781 634408951 634436607
1417.5 634436607 634725273 635816336 637355268 639008760 640472233 641746700 643152952 644388199
1433.9F44388199O76930P28726J101434R80497O10828J73807k8610K48313L80218M9651
1454.3F49309993k76268J023293K539217K383590K214015K866089L449261L734648
1470.6F67243838M681409N550265N417347M810333L995359L216982K314746J347125
1486.9F98577404N56886L03745O7890r39905k099693k088249j600504j707554l113091
1505.2F87956929m454255k093077r76383j574815k067923j908243j383364j255333
1521.6F72243536q07167o91175j041234r96053j353860j756429j143337j376152k748906
1539.9F60329223j768589K9802M11034M03881M55260P39217Q29935M71890J10030J631021
1560.3F63642704K281368J390636O78420J05322j6272J54972o18577j539111j041592
$$ plain form
1433.9 644388199 645065129 645793855 646895289 647875786 648486614 648660421 648631811 648880124 649260342 649309993
1454.3 649309993 649033725 650057018 652596235 654979825 657193840 660059929 663509190 667243838
1470.6 667243838 671925247 677475512 682892859 687703192 691698551 694915533 697230279 698577404
1486.9 698577404 699134290 699438035 699505925 698566020 696466327 694378078 692777574 691070020 687956929
1505.2 687956929 683502674 681409597 680433214 678858399 676790476 674882233 673498869 672243536
1521.6 672243536 671436369 670745194 669703960 668707907 667354047 665597618 664454281 663078129 660329223
1539.9 660329223 658560634 658590436 659001470 659405351 659860611 660599828 661429763 661901653 662011683 663642704
1560.3 663642704 665924072 667314708 667993128 668098450 668082178 668237150 667618573 666079462 665037870
1578.7F65037870r91344j796484k367199k704560l028572l289640l363192l280818
1595F44216061l019035k829015k896548k945065k877891k963126l157258l041089k904772
1613.4F17582262l633261m218817k875924k645969l547907l320694l000915k844215
1629.7E91494560k219259k309144k885103j508296j99258p7009l08037p61271j84357
1648E81042826O18220j68086l1769J804769J910925J604021J791298K431452K470196
1666.4E93473852K354860L111124L569603L684759M210174M289985L871858L711522
1682.7F22277737N082249N914986N414844N419195M922449M796505N330861N439043
1699F64597869O164312N499840M490376M400372L789067K839208K058446J438022J401544
$$ plain form
1578.7 665037870 664046526 662250042 659882843 657178283 654149711 650860071 647496879 644216061
1595 644216061 641197026 638368011 635471463 632526398 629648507 626685381 623528123 620487034 617582262
1613.4 617582262 613949001 609730184 606854260 604208291 600660384 597339690 594338775 591494560
1629.7 591494560 589275301 586966157 584081054 582572758 582373500 582296491 581988454 581227183 581042826
1648 581042826 581661046 581492960 581461191 583265960 585176885 586780906 588572204 591003656 593473852
1666.4 593473852 595828712 598939836 602509439 606194198 610404372 614694357 618566215 622277737
1682.7 622277737 627359986 633274972 638689816 644109011 649031460 653827965 659158826 664597869
1699 664597869 670762181 676262021 680752397 685152769 688941836 691781044 693839490 695277512 696679056
1717.4F96679056K115607K191484J739681J469433J116753P41541M75109M45425J307249
1735.7G08281338J576722J354694J781404K277553K377153K506912L236234M234552
1752G27626562M150629L721953L779232L767073L838539L690482L105282K676607K316951
1770.4G58673310K230525K608955K577722K119899J714528J531899J499533J595319
1786.7G74551690J392781P59960P95722J538634J604557J115918R16243J235902J419008
1805.1G85330415J180172Q17477P99656J082182J123667Q91566P63417P32243O20424
1823.4G93341219N84126N24342M48227Q79705J136780P56204N16057N98788M23908
1841.8G99209356R0778L95537Q39769Q55804O99162M93467M11868M51208N17427M79997
$$ plain form
1717.4 696679056 698794663 700986147 702725828 704195261 705312014 706053555 706528664 706974089 708281338
1735.7 708281338 709858060 711212754 712994158 715271711 717648864 720155776 723392010 727626562
1752 727626562 731777191 735499144 739278376 743045449 746883988 750574470 753679752 756356359 758673310
1770.4 758673310 760903835 763512790 766090512 768210411 769924939 771456838 772956371 774551690
1786.7 774551690 775944471 776704431 777500153 779038787 780643344 781759262 782675505 783911407 785330415
1805.1 785330415 786510587 787328064 788127720 789209902 790333569 791225135 791988552 792720795 793341219
1823.4 793341219 793925345 794449687 794897914 795777619 796914399 797670603 798186660 798785448 799209356
1841.8 799209356 799300134 799695671 800535440 801391244 802090406 802583873 802995741 803446949 803964376 804444373
1862.2H04444373K88844J19l4809M88639P98225O01292M58360M60803L40939J89721
1882.6H08036506K19763K98261K06411K11060L35038L52382M04478L54170J99914K01583
1903H10819566K90215K02418O2883J91152L91900K59221n0843J0431K20775K63393
1923.4H12661111K98381K33174J56283K00868J87158P5042N7936N7459n2333j8358
1943.8H13856721J58310K33412K21133J29640K3663L8087J22130J41621O2525j5735
1964.2H14971507m471J17302J87278Q7142J4722P0453J04606M9353J2994L1829L7848
1986.6H15680563k3186j10924l0696J56104J40608k623n4598k3127J4306k9684j23262
2009H15593481j13904l2604q0109j98960j78337o7115q345p8201j83523j44481j9074
$$ plain form
1862.2 804444373 804733217 804733336 804698527 805187166 805985391 806586683 807045043 807505846 807846785 808036506
1882.6 808036506 808256269 808554530 808760941 808972001 809307039 809659421 810063899 810418069 810617983 810819566
1903 810819566 811109781 811312199 811375082 811566234 811958134 812217355 812166512 812176943 812397718 812661111
1923.4 812661111 812959492 813192666 813348949 813549817 813736975 813812017 813869953 813927412 813875079 813856721
1943.8 813856721 814015031 814248443 814469576 814599216 814622879 814660966 814783096 814924717 814987242 814971507
1964.2 814971507 814967036 815084338 815271616 815358758 815373480 815443933 815548539 815597892 815610886 815642715 815680563
1986.6 815680563 815657377 815546453 815515757 815671861 815812469 815809846 815755248 815732121 815746427 815716743 815593481
2009 815593481 815479577 815446973 815366864 815167904 814989567 814922452 814914107 814835906 814652383 814507902 814488828
2031.5H14488828l2008j64985j77622n0128K027q9049j56343o3300P4923M3690q6069
2053.9H13789964q3506M1663O8844o0976j24812J6630J54376Q0764n0366k4795J01208
2076.4H13908994Q5175o1691o4730R5844J38521k9921j30952M173J53362Q4579o0439
2098.8H14122915j8418J40846J39952k6345q0943N8353J35064L1769k2233P0155J47462
2121.2H14698577P9989k6643J9133J50740J56045M3333N543R1016J68384J01685r716
2143.7H15478086L3498J51873J42872M8161N4121J58965K05577J25944M4525R8348
2164.1H16541970J94907J59323O5804R2983J84357J99676J54733J39833J62065J58608
2184.5H18054259J21653R7453J06812J43945J72675J47283R6023R8646J52111J51574
$$ plain form
2031.5 814488828 814456820 814291835 814114213 814064085 814066112 813977063 813820720 813757420 813832343 813876033 813789964
2053.9 813789964 813706458 813748121 813816965 813755989 813631177 813647807 813802183 813882947 813832581 813807786 813908994
2076.4 813908994 813994169 813932478 813867748 813963592 814102113 814072192 813941240 813945413 814098775 814183354 814122915
2098.8 814122915 814104497 814245343 814385295 814358950 814278007 814336360 814471424 814503193 814480960 814551115 814698577
2121.2 814698577 814778566 814751923 814771056 814921796 815077841 815121174 815126717 815217733 815386117 815487802 815478086
2143.7 815478086 815511584 815663457 815806329 815854490 815908611 816067576 816273153 816399097 816443622 816541970
2164.1 816541970 816736877 816896200 816962004 817054987 817239344 817439020 817593753 817733586 817895651 818054259
2184.5 818054259 818175912 818273365 818380177 818524122 818696797 818844080 818940103 819038749 819190860 819342434
2204.8H19342434Q6427O6519J28388J49548P0513K2173N9723J05799P0154K027N5015
2227.3H20158720J30057O5387j4127m708N3346Q9764K8074j4186N0426R4712M7326
2249.7H20684791k9147j9193N4598N3585j8835l3677L1292N1022l994m1484j8180L3081
2274.2H20743859R835q7083r9659k2590J371o1929j05798n1797n722o1095j05262q6426
2298.7H20067704q6785j07526j34111j52647j27674j25348j70708j65283j48237j84357
2319.1H18665028k35677k69950k35259k35677l13818k83957j84297j98126k49803k59877
2339.5H16198587k74777l16679k24174J30892K60473p7844n48422p11620n98252m63545
2359.9H13374639l31939k05457j34170r0897q7738j31726j33515l2067N007r3997j25944
$$ plain form
2204.8 819342434 819428861 819495380 819623768 819773316 819843829 819866002 819925725 820031524 820101678 820103705 820158720
2227.3 820158720 820288777 820354164 820340037 820335329 820388675 820478439 820506513 820492327 820542753 820637465 820684791
2249.7 820684791 820655644 820636451 820691049 820744634 820725799 820692122 820723414 820774436 820770442 820728958 820710778 820743859
2274.2 820743859 820753694 820666611 820566952 820544362 820545733 820483804 820378006 820326209 820320487 820259392 820154130 820067704
2298.7 820067704 819980919 819873393 819739282 819586635 819458961 819333613 819162905 818997622 818849385 818665028
2319.1 818665028 818429351 818159401 817924142 817688465 817374647 817090690 816906393 816708267 816458464 816198587
2339.5 816198587 815923810 815607131 815382957 815513849 815774322 815696478 815148056 814436436 813838184 813374639
2359.9 813374639 813042700 812837243 812703073 812612176 812524438 812392712 812259197 812227130 812232137 812138140 812012196
2382.3H12012196q2195j37806k61069l06546k40624j82271k53141l70383l64781k75850
2402.7H09537530k84612l83318l97086l07321k86878l90589m63009l97324l33965m08411
2423.1H05885017m96447m56095l40164l25322m21047m24564l22878l29733m71056n27978
2443.5H01769733m39524l74317m14431m74036m75586m20034l79324m41193n21183m98116
2463.9G97331989m60565m79698m74692m26113m18604m95493n66840n34773m48048m22001
2484.3G92605162m67301m91261m71473m46975m31776m43161m58896m46141m42207m50074
2504.7G88055897m25041l87549l83139m13120m44114m28617l68357l54528m14193m51207
2525.1G83986032m03762l39210l63409m40717m48287l91125l72947m13060m41253m22835
$$ plain form
2382.3 812012196 811930001 811792195 811531126 811224580 810983956 810801685 810548544 810178161 809813380 809537530
2402.7 809537530 809252918 808869600 808472514 808165193 807878315 807487726 807024717 806627393 806293428 805885017
2423.1 805885017 805388570 804932475 804592311 804266989 803845942 803421378 803098500 802768767 802297711 801769733
2443.5 801769733 801330209 800955892 800541461 800067425 799591839 799171805 798792481 798351288 797830105 797331989
2463.9 797331989 796871424 796391726 795917034 795490921 795072317 794576824 794009984 793475211 793027163 792605162
2484.3 792605162 792137861 791646600 791175127 790728152 790296376 789853215 789394319 788948178 788505971 788055897
2504.7 788055897 787630856 787243307 786860168 786447048 786002934 785574317 785205960 784851432 784437239 783986032
2525.1 783986032 783582270 783243060 782879651 782438934 781990647 781599522 781226575 780813515 780372262 779949427
2545.5G79949427m00007m36127m89056m67658l94464l63886m26948m97699m54962l81232
2565.8G75637388m17948n15222n21064m27723m12822n03480n29170m51207m15743n06699
2586.2G70936310n70178m91559m27425m95672n73814n24342m23551m57883o11305o52492
2606.6G65708089n19574m21166m79162n64039n52535n11646n59151o58036o58512n47945
2627G60236323n00262n91934o57200n74708n10216o00517p06017o57856n47112n77867
2647.4G54312634o82294o45339n19991n36919o63698o76512n72861n01454n42342o29604
2667.8G48341620o23763n40316n21064n89549o23882n73158n44548n80907n92113n45621
2688.2G42606699m99844n20349o16788o71030n89847m92275n24461o08981n90563n24282
$$ plain form
2545.5 779949427 779549420 779113293 778624237 778156579 777762115 777398229 776971281 776473582 776018620 775637388
2565.8 775637388 775219440 774704218 774183154 773755431 773342609 772839129 772309959 771858752 771443009 770936310
2586.2 770936310 770366132 769874573 769447148 768951476 768377662 767853320 767429769 766971886 766360581 765708089
2606.6 765708089 765188515 764767349 764288187 763724148 763171613 762659967 762100816 761442780 760784268 760236323
2627 760236323 759736061 759144127 758486927 757912219 757402003 756801486 756095469 755437613 754890501 754312634
2647.4 754312634 753630340 752985001 752465010 751928091 751264393 750587881 750015020 749513566 748971224 748341620
2667.8 748341620 747717857 747177541 746656477 746066928 745443046 744869888 744325340 743744433 743152320 742606699
2688.2 742606699 742106855 741586506 740969718 740298688 739708841 739216566 738692105 738083124 737492561 736968279
2708.6G36968279n59390o60479o83784o09219n71251o17564o17921n46992n39422o02722
2729G30959535o12736n66661n13137m80175n21302n39839m33743l63112m50015n45084
2749.4G25933731n30661m76241m63247n13375n41866m77314m59432n52714n99861n32627
2769.8G20786393m59075n03660o31094o56783n68986n73218o97613p28964o06597n61118
2790.2G14799285p06434q27551p81417p18176q04782r51291r55224q61227q63791r76979
2810.6G06352413j047433j005888r65297j044214j175105j200497j175285j231134
2826.9F97507560j333117j411677j456678j515150j653790j912475k234399k526820
2843.2F83463454k806782l027142k949297k382517j525819q14855m00603k15113l12627
$$ plain form
2708.6 736968279 736408889 735748410 735064626 734455407 733884156 733266592 732648671 732101679 731562257 730959535
2729 730959535 730346799 729780138 729267001 728786826 728265524 727725685 727291942 726928830 726478815 725933731
2749.4 725933731 725403070 724926829 724463582 723950207 723408341 722931027 722471595 721918881 721319020 720786393
2769.8 720786393 720327318 719823658 719192564 718535781 717966795 717393577 716695964 715967000 715360403 714799285
2790.2 714799285 714092851 713265300 712483883 711765707 710960925 710009634 709054410 708193183 707329392 706352413
2810.6 706352413 705304980 704299092 703333795 702289581 701114476 699913979 698738694 697507560
2826.9 697507560 696174443 694762766 693306088 691790938 690137148 688224673 685990274 683463454
2843.2 683463454 680656672 677629530 674680233 672297716 670771897 669957042 669556439 669341326 669028699
2861.6F69028699o65128j027465j256883j304149j164020j038491r75192p86543n87523
2879.9F60223305o03318p31409q03828q22186q54314q97348r04083r25302j019895
2898.3F52661622j099945j133441j226604j393438j569867j776278k069712k386331
2914.6F40006006k552212k487063k199769j682818j045763m17769J43766N12958P96198
2933F31073534J179457J496017J673877J893878K028406J784861J303435R66250Q41678
2951.3F44241393O65783M27604M56155P90476J137436J292944J361072J546383J794100
2969.7F53713346J908123J848876J760781J759291J727879J493871J193166J065731
2986F66471064J065195J021743P94172M57585K69174Q7679k35856m33564m68850n04315
$$ plain form
2861.6 669028699 668363571 667336106 666079223 664775074 663611054 662572563 661597371 660810828 660223305
2879.9 660223305 659619987 658888578 658084750 657262564 656408250 655510902 654606819 653681517 652661622
2898.3 652661622 651561677 650428236 649201632 647808194 646238327 644462049 642392337 640006006
2914.6 640006006 637453794 634966731 632766962 631084144 630038381 629620612 629764378 630277336 631073534
2933 631073534 632252991 633749008 635422885 637316763 639345169 641130030 642433465 643399715 644241393
2951.3 644241393 644907176 645334780 645790935 646581411 647718847 649011791 650372863 651919246 653713346
2969.7 653713346 655621469 657470345 659231126 660990417 662718296 664212167 665405333 666471064
2986 666471064 667536259 668558002 669352174 669809759 670078933 670166612 669930756 669497192 669028342 668524027
3006.4F68524027n30899m90009m14730m37438o18219q10624q55565q06689q44002r69112
3026.8F61746740r83774q47996p53879q92401j106441j056850q71479q84295j093984
3045.1F53255641j234710j132846j009702j093269j183748j105070r97126r58443r50813
3063.5F43589914r01222q46088r23753j061738j021564p61985o00160p87615j025141
3081.9F35660648r79602q18253p90715q97646j005530r99391q97229q27730q90910
3100.2F27553642r77814r29475q53300r14097j037538j006127q46147q37505j006126
3118.6F19145513j165390j237989j226723j183927j129687j128793j200139j199603
3134.9F09673262j103759j031876j140237j335024j359702j245916j104414j053929
$$ plain form
3006.4 668524027 667993128 667503119 667088389 666650951 666032732 665222108 664366543 663559854 662715852 661746740
3026.8 661746740 660762966 659914970 659161091 658268690 657162249 656105399 655233920 654349625 653255641
3045.1 653255641 652020931 650888085 649878383 648785114 647601366 646496296 645499170 644540727 643589914
3063.5 643589914 642688692 641842604 640918851 639857113 638835549 638073564 637473404 636685789 635660648
3081.9 635660648 634681046 633862793 633072078 632174432 631168902 630169511 629272282 628444552 627553642
3100.2 627553642 626575828 625646353 624793053 623878956 622841418 621835291 620989144 620151639 619145513
3118.6 619145513 617980123 616742134 615515411 614331484 613201797 612073004 610872865 609673262
3134.9 609673262 608569503 607537627 606397390 605062366 603702664 602456748 601352334 600298405
3151.2F00298405j231253j442671j402378j278401j308083j351655j284778j214087
3167.5E89785099j237690j306534j303196j236618j227498j291811j364053j340091
3183.8E79477608j224696j200796j278400j280308j215637j226365j276136j239061
3200.1E69536209j139283j106203j164317j222729j193941j107574j099169j151562
3216.5E60351431j131653j053214j056970j155555j191556j107991r88901r53495j096666
3234.8E50615430j228690j164019j086533j098931j061619j006007j083910j179636
3251.1E41706085j134336j029551j007795j051128j098514j111865j023054q92043
3267.5E33357799q45373r36985j042068j045942j013815r64344r24706r19640q68917
$$ plain form
3151.2 600298405 599067152 597624481 596222103 594943702 593635619 592283964 590999186 589785099
3167.5 589785099 588547409 587240875 585937679 584701061 583473563 582181752 580817699 579477608
3183.8 579477608 578252912 577052116 575773716 574493408 573277771 572051406 570775270 569536209
3200.1 569536209 568396926 567290723 566126406 564903677 563709736 562602162 561502993 560351431
3216.5 560351431 559219778 558166564 557109594 555954039 554762483 553654492 552665591 551712096 550615430
3234.8 550615430 549386740 548222721 547136188 546037257 544975638 543969631 542885721 541706085
3251.1 541706085 540571749 539542198 538534403 537483275 536384761 535272896 534249842 533357799
3267.5 533357799 532512426 531575441 530533373 529487431 528473616 527509272 526584566 525664926 524796009
3285.8E24796009p71105o97613o62148o89089p98941r00388q30292o49512n78404o87003
3306.2E17531514q88407j000345r93967r54687q82805q32617q59380r09150r61244
3324.6E09248912j041114j090884j062751r88722q95679q48710r43482j094044j161575
3342.9E00121951j177788j093059r26942r72182j191377j217604j044631r30130r53496
3361.3D90614742r89020q81970p80433r25839j139730j106441r16839q33005q47459
3379.6D82194006q88794q54999p02918n08815l49879m41134p23720p73549m88966k68102
3400D76193130m87566q17001p07596l80576k27988k74211m34935m85569l45379k36631
3420.4D71795678k11716j15752R1404K69264K26825J73867K82288K40534K4945k8432
$$ plain form
3285.8 524796009 524024904 523327291 522665143 521976054 521177113 520276725 519446433 518796921 518218517 517531514
3306.2 517531514 516643107 515642762 514648795 513694108 512811303 511978686 511119306 510210156 509248912
3324.6 509248912 508207798 507116914 506054163 505065441 504169762 503321052 502377570 501283526 500121951
3342.9 500121951 498944163 497851104 496924162 495951980 494760603 493542999 492498368 491568238 490614742
3361.3 490614742 489625722 488743752 487963319 487037480 485897750 484791309 483874470 483041465 482194006
3379.6 482194006 481305212 480450213 479747295 479238480 478888601 478447467 477723747 476950198 476461232 476193130
3400 476193130 475705564 474888563 474180967 473800391 473572403 473298192 472863257 472377688 472032309 471795678
3420.4 471795678 471583962 471468210 471559614 471828878 472055703 472229570 472511858 472752392 472777337 472748905
3440.8D72748905J47820L45588M42624M97550N63859O06359O59555P64161Q25316P47978
3461.2D78349715P88093J080781J189649Q93653N69820O18845R09359J170486J194149
3479.6D86764550R94772R97633J171291J165032J139045J200020J235634J311183J347125
3497.9D97326285J343608J334279J218915J155794J252234J449645J683950J656413
3514.2E08421123J411796J386582J597167J768171J651168J440883J539945J833082
3530.6E21049917J986027K022087K008379J940786J980484K059460J985669J839340
3546.9E36872149J892685K022028K135516K306699K367616K339721K371728K251923
3563.2E54560065J919627K169192K955556L105581K814829K687335K716542K862036
$$ plain form
3440.8 472748905 472896725 473242313 473684937 474182487 474746346 475352705 476012260 476776421 477601737 478349715
3461.2 478349715 479137808 480218589 481408238 482301891 482871711 483490556 484399915 485570401 486764550
3479.6 486764550 487759322 488756955 489928246 491093278 492232323 493432343 494667977 495979160 497326285
3497.9 497326285 498669893 500004172 501223087 502378881 503631115 505080760 506764710 508421123
3514.2 508421123 509832919 511219501 512816668 514584839 516236007 517676890 519216835 521049917
3530.6 521049917 523035944 525058031 527066410 529007196 530987680 533047140 535032809 536872149
3546.9 536872149 538764834 540786862 542922378 545229077 547596693 549936414 552308142 554560065
3563.2 554560065 556479692 558648884 561604440 564710021 567524850 570212185 572928727 575790763
3579.5E75790763L095329L047943K537250K371252L118217L377676K992749K949238
3595.8E99280417L249228L348589L310382L169179K818048K771497L083110L191709
3612.1F24222159L243745L157615L001631L483712L862203L440857K549529K136111
3628.5F49097562L223300L790915L466546L200353L004193K919733K906204K557754
3644.8F74166560J819551J809061L160536L592551K836644K592445K878189K660453
3661.1F95515990K223850J965880J477957R74953J491964J588285R50038J775026K573729
3679.4G10537672K326548J954317J423955O89626M68612J261413J749694J489937J070679
3697.8G22972453O50465N30422R89914J110554M97996j33037K24709J333595J512408
$$ plain form
3579.5 575790763 578886092 581934035 584471285 586842537 589960754 593338430 596331179 599280417
3595.8 599280417 602529645 605878234 609188616 612357795 615175843 617947340 621030450 624222159
3612.1 624222159 627465904 630623519 633625150 637108862 640971065 644411922 646961451 649097562
3628.5 649097562 652320862 656111777 659578323 662778676 665782869 668702602 671608806 674166560
3644.8 674166560 675986111 677795172 680955708 684548259 687384903 689977348 692855537 695515990
3661.1 695515990 697739840 699705720 701183677 702158630 703650594 705238879 706188917 707963943 710537672
3679.4 710537672 712864220 714818537 716242492 716932118 717400730 718662143 720411837 721901774 722972453
3697.8 722972453 723622918 724153340 725143254 726253808 726751804 726618767 726843476 728177071 729689479
3716.2G29689479R05394L64900K19703L32534N29707P71045M98891k40922m46260M38631
3736.5G33063102J317858J042545k16603p87973M36604M61459k48313P65681J495719
3754.9G37330079Q25644K55227N86509P31826L20018J10447J14858M08888P69138N91874
3775.3G42044508J30475n2810K09689K91050K33650M46737N50866L84033L1173k50936
3795.7G44018435j07347l04819m70996M34757O06537L97086P73191O15061k08796o25670
3816.1G45127439j99794k83063N782Q98004P89821L63588L4988j12653R060l02613
3836.5G46330559n69522J21534P09355Q13424P17581L08215o64234j898825n79357
3854.8G45288730J534700J245081K50817l68357j85847J18792l02076k86758L20732
$$ plain form
3716.2 729689479 730594873 730959773 731179476 731512010 732041717 732812762 733311653 733070731 732624471 733063102
3736.5 733063102 734380960 735423505 735206902 734418929 734855533 735316992 735068679 735834360 737330079
3754.9 737330079 738155723 738410950 738997459 739729285 740049303 740159750 740274608 740683496 741452634 742044508
3775.3 742044508 742174983 742122173 742331862 742622912 742856562 743303299 743854165 744238198 744269371 744018435
3795.7 744018435 743911088 743606269 743135273 743570030 744176567 744573653 745346844 745961905 745753109 745127439
3816.1 745127439 744927645 744644582 744650364 745548368 746338189 746701777 746736765 746624112 746633172 746330559
3836.5 746330559 745761037 745882571 746591926 747405350 748122931 748431146 747766912 745868087 745288730
3854.8 745288730 746823430 748068511 748319328 747950971 747765124 747883916 747581840 747295082 747615814
3873.2G47615814O12021N46217n7578k21193J08003J3173K09033J72019k37762J12235
3893.6G48871982M36008o9380o53445o63400k05517N13256Q73386N75781J53363j62899
3914G49669135m38631l22521R4652J30713j02579l5703J15931j3173m9829J37865J52409
3936.4G49338269K3961j09732k13504n3107R1314n3346p4923Q9466J02461N006m7385
3958.9G49098480q5414l2603N4061M172n2452k5153n0366p9214J7344O3956L8982N4896
3983.3G49006689O973j10328j54137n9605N7220P1287p450
3997.6G48810649
$$ plain form
3873.2 747615814 748227835 748774052 748716474 748495281 748603284 748616457 748825490 748997509 748759747 748871982
3893.6 748871982 749307990 749238610 748585165 747921765 747716248 748229504 749102890 749678671 749832034 749669135
3914 749669135 749230504 748907983 749002635 749133348 749030769 748995066 749110997 749097824 749047995 749185860 749338269
3936.4 749338269 749362230 749252498 749038994 748985887 749077201 749023855 748948932 749038398 749140859 749145865 749098480
3958.9 749098480 749013066 748980463 749034524 749038696 748986244 748961091 748910725 748831511 748848855 748912811 748951793 749006689
3983.3 749006689 749013662 748903334 748749197 748689592 748746812 748818099 748810649
3997.6 748810649
##END=$$ End of the data block
