##TITLE=$$ Begin of the data block
##JCAMP-DX=5.00 $$ ACD/SpecManager v 10.08
##SPECTROMETER/DATA SYSTEM=Alpha
##DATE=10 Nov 2014 10:35:34
##DATA TYPE=INFRARED SPECTRUM
##DATA CLASS=XYDATA
##ORIGIN=
##OWNER=
##NPOINTS=1765
##FIRSTX=399.76428223
##LASTX=3997.64306641
##MAXX=3997.64306641
##MINX=399.76428223
##MAXY=0.82346827
##MINY=0.46653831
##XFACTOR=1.0000000000
##YFACTOR=1.000000000000000e-9
##FIRSTY=0.66831511
##DELTAX=2.03961372
##XUNITS=1/CM
##YUNITS=ARBITRARY UNITS
##XYDATA=(X++(Y..Y))
$$ plain form
399.8 668315113 666700542 666575730 666909277 665788710 663803756 663387954 664251804 663567841 660518527
418.1 660518527 658659458 659477532 659703851 658321738 657316983 658085346 659138441 658653975 657617390
436.5 657617390 657811880 658650160 658339560 657236278 657466650 658856332 658989012 657420099 656369090
454.8 656369090 656681061 656693876 655315161 654065907 654337823 654710829 653375983 651368797 650950253
473.2 650950253 651748180 651407182 649838686 649186254 649940789 650110960 648861647 647910058 648328245
491.5 648328245 648583055 647299886 645764828 645501435 645534217 644237816 642275810 641389787 641415834
509.9 641415834 640336335 637776554 635686338 635173559 634859979 633410752 631891608 631920636 632608831
528.3 632608831 632009089 630753815 630723417 631822705 632661104 632973611 633707523 635152578 636030972
$$ packed form
399.8F68315113j614571j24812L33547j120567j984954m15802Q63850o83963l049314
418.1F60518527j859069Q18074K26319j382113j004755P68363J053095m84466j036585
436.5F57617390J94490Q38280l10600j103282K30372J389682J32680j568913j051009
454.8F56369090L11971J2815j378715j249254K71916L73006j334846k007186m18544
473.2F50950253P97927l40998j568496o52432P54535J70171j249313r51589M18187
491.5F48328245K54810j283169j535058k63393L2782j296401j962006q86023K6047
509.9F41415834j079499k559781k090216n12779l13580j449227j519144K9028O88195
528.3F32608831n99742j255274l0398J099288Q38399L12507P33912J445055Q78394
$$ plain form
546.6 636030972 635542870 634912074 635237038 635647118 634904921 633663535 633499444 634177566 633959174 632509053
567 632509053 631315947 631098390 630857468 630058110 629745901 630615830 631849289 632442057 632596493 633254468
587.4 633254468 634253204 634557843 634112716 633858383 634242415 634583354 634207547 633724630 634000659 634678125
607.8 634678125 634860992 634518623 634436429 634991407 635754168 636310220 637057424 638636947 640597701 641850531
628.2 641850531 642442942 643411696 644966066 646186709 646613657 647140503 648619473 650353670 651321650
646.6 651321650 652023137 653454840 655232489 656269431 656467855 656876922 657959938 658816040 658926904
664.9 658926904 659014046 660275280 661906958 662723064 663211584 664473593 666372716 667625070 667926908
683.3 667926908 668392003 669602096 670575976 670514405 670147777 670445204 671041846 671038508 670718193 671234488
$$ packed form
546.6F36030972m88102o30796L24964M10080p42197j241386j64091O78122k18392j450121
567F32509053j193106k17557k40922p99358l12209Q69929J233459N92768J54436O57975
587.4F33254468R98736L04639m45127k54333L84032L40939l75807m82917K76029O77466
607.8F34678125J82867l42369q2194N54978P62761N56052P47204J579523J960754J252830
628.2F41850531N92411R68754J554370J220643M26948N26846J478970J734197R67980
646.6F51321650P01487J431703J777649J036942J98424M09067J083016Q56102J10864
664.9F58926904Q7142J261234J631678Q16106M88520J262009J899123J252354L01838
683.3F67926908M65095J210093R73880o1571l66628K97427N96642l338l20315N16295
$$ plain form
703.7 671234488 672689378 673881471 674335837 675196350 677259207 679512262 680921733 682232082 684575558
722 684575558 687417209 689520776 690897942 692608058 694897473 696689844 697463870 698236644 699730635
740.4 699730635 701097727 701541960 701661468 702323437 703229070 703485966 703043103 702753901 703027070 703159213
760.8 703159213 702598751 701969504 702076435 702597201 702642560 702278733 702430427 703385413 704631269 706034958
781.2 706034958 708239436 711651564 715511382 718666375 720998049 723338902 725799322 727490366
797.5 727490366 728182971 728679359 729411542 729733706 729000211 727699161 726812720 726398945 725844383 725188196
817.9 725188196 725124359 725757420 726222634 726071656 726226985 727490366 729186475 730365813 731195629
836.2 731195629 732452631 734054446 734889627 734474838 733715117 733322322 732622981 730927348 729016781
$$ packed form
703.7F71234488J454890J192093M54366Q60513K062857K253055J409471J310349K343476
722F84575558K841651K103567J377166J710116K289415J792371P74026P72774J493991
740.4F99730635J367092M44233J19508O61969R05633K56896m42863k89202K73169J32143
760.8G03159213n60462o29247J06931N20766M5359l63827J51694R54986J245856J403689
781.2G06034958K204478L412128L859818L154993K331674K340853K460420J691044
797.5G27490366O92605M96388P32183L22164p33495j301050q86441m13775n54562o56187
817.9G25188196o3837O33061M65214j50978J55329J263381J696109J179338Q29816
836.2G31195629J257002J601815Q35181m14789p59721l92795o99341j695633j910567
$$ plain form
854.6 729016781 728059351 727800369 727218270 726528049 726941943 728600383 730205595 730987191 731751323
873 731751323 733247578 734717190 735049725 734439850 733825862 733152449 731511712 728982449 726752698
891.3 726752698 725379288 724178791 722485662 720767975 719730377 718883455 717148542 714482248 711794376
909.7 711794376 709362447 706508040 703072488 700043559 698250592 697268307 696287632 695495844 695552945
928 695552945 696096480 695991337 695010602 694019377 693344533 692207992 690097690 687653720 685555637
946.4 685555637 683344126 680249095 676604807 673303246 670243502 666537523 662105143 657858312
962.7 657858312 654152989 650184095 645211697 639574528 633956075 628221989 621850491 615096807
979 615096807 608791292 603146851 597703397 592438817 587993741 584706843 582076550 579499900 577078283
$$ packed form
854.6G29016781r57430k58982n82099o90221M13894J658440J605212P81596P64132
873G31751323J496255J469612L32535o09875o13988o73413j640737k529263k229751
891.3G26752698j373410j200497j693129j717687j037598q46922j734913k666294k687872
909.7G11794376k431929k854407l435552l028929j792967r82285r80675p91788N7101
928F95552945N43535j05143r80735r91225o74844j136541k110302k443970k098083
946.4F85555637k211511l095031l644288l301561l059744l705979m432380m246831
962.7F57858312l705323l968894m972398n637169n618453n734086o371498o753684
979F15096807o305515n644441n443454n264580m445076l286898k630293k576650k421617
$$ plain form
997.4 577078283 575168788 573524177 571542919 569179118 566934764 565028131 563139677 561131001
1013.7 561131001 559493005 558628440 558189094 557684422 557217956 557166874 557520032 557883620 558072805 558282614
1034.1 558282614 558545113 558440268 557618022 556315780 555033863 553917706 552869081 552088737 552060246
1052.4 552060246 552938461 554314792 555844605 557661295 559834838 561882973 563213587 563637078 563293278
1070.8 563293278 562451541 561505616 561092734 561842799 563865304 566716909 569883645 573115706 576219082
1089.2 576219082 578767180 580372274 581079900 581239104 581133485 580913186 580863297 581383407 582612693
1107.5 582612693 584375381 586446464 588737249 591210902 593639612 595737338 597462237 598956466
1123.8 598956466 600382626 601877153 603532493 605248213 606750429 607826531 608359158 608302236 607825935
$$ packed form
997.4E77078283j909495j644611j981258k363801k244354j906633j888454k008676
1013.7E61131001j637996q64565m39346n04672m66466n1082L53158L63588J89185K09809
1034.1E58282614K62499j04845q22246j302242j281917j116157j048625p80344k8491
1052.4E52060246Q78215J376331J529813J816690K173543K048135J330614M23491l43800
1070.8E63293278q41737r45925m12882P50065K022505K851605L166736L232061L103376
1089.2E76219082K548098J605094P07626J59204j05619k20299m9889N20110J229286
1107.5E82612693J762688K071083K290785K473653K428710K097726J724899J494229
1123.8E98956466J426160J494527J655340J715720J502216J076102N32627n6922m76301
$$ plain form
1142.2 607825935 607317924 607079923 607200146 607703686 608660698 610161662 612254441 614930093 618226945
1160.5 618226945 622337282 627353549 633030176 639075935 645394504 651907980 658354938 664358616
1176.9 664358616 669797480 674815118 679392576 683281839 686407626 689014792 691209972 692732692
1193.2 692732692 693384945 693393290 693187714 692892253 692382872 691804945 691496670 691439629 691227436 690624774
1213.6 690624774 689787626 688851237 687639594 685987294 684112608 682389200 680855870 679234743 677532315
1231.9 677532315 676175058 675334394 674659550 673943818 673479021 673545778 673959315 674317181 674596190 675087333
1252.3 675087333 675780892 676341593 676706016 677237272 678145349 679152071 679995537 680869877 682018697
1270.7 682018697 683239400 684125602 684644520 685102046 685617030 685946465 685942769 685864687 685936749 685898542
$$ packed form
1142.2F07825935n08011k38001J20223N03540R57012J500964K092779K675652L296852
1160.5F18226945M110337N016267N676627O045759O318569O513476O446958O003678
1176.9F64358616N438864N017638M577458L889263L125787K607166K195180J522720
1193.2F92732692O52253Q345k05576k95461n09381n77927l08275n7041k12193o02662
1213.6F90624774q37148r36389j211643j652300j874686j723408j533330j621127j702428
1231.9F77532315j357257q40664o74844p15732m64797O6757M13537L57866K79009M91143
1252.3F75087333O93559N60701L64423N31256R08077J006722Q43466Q74340J148820
1270.7F82018697J220703Q86202N18918M57526N14984L29435l696p8082P2062l8207
$$ plain form
1291.1 685898542 685363412 684413970 683410704 682385743 681012750 679218173 677343369 675595582 673777282
1309.4 673777282 671660662 669514656 667795599 666424930 665064991 663723469 662598312 661666393
1325.8 661666393 660627127 659356058 658191264 657421589 656801820 655988932 655329108 655377150 655860603
1344.1 655860603 656209469 656316161 656461239 656761885 656921864 656739175 656375170 655929744 655374050 654781163
1364.5 654781163 654121876 653457165 652957320 652222991 651075006 649988234 648504376 645317554 641077638
1382.9 641077638 639082730 640849948 643601298 644586980 643831253 642253518 640795290 639514625 638384163
1401.2 638384163 637328446 636355698 635790646 635379732 634963870 634844244 634986937 635039330 635331988 636380672
1421.6 636380672 637881756 639525175 640966594 642198920 643569469 644799531 645510077 646262705 647343576
$$ packed form
1291.1F85898542n35130r49442j003266j024961j372993j794577j874804j747787j818300
1309.4F73777282k116620k146006j719057j370669j359939j341522j125157r31919
1325.8F61666393j039266j271069j164794p69675o19769q12888o59824M8042M83453
1344.1F55860603L48866J06692J45078L00646J59979j82689l64005m45426n55694n92887
1364.5F54781163o59287o64711m99845p34329j147985j086772j483858l186822m239916
1382.9F41077638j994908J767218K751350R85682p55727j577735j458228j280665j130462
1401.2F38384163j055717r72748n65052m10914m15862j19626J42693N2393K92658J048684
1421.6F36380672J501084J643419J441419J232326J370549J230062P10546P52628J080871
$$ plain form
1440 647343576 648291945 648892760 649089575 649090052 649339736 649722636 649821579 649613202 650617123 653106928
1460.4 653106928 655504286 657765150 660645425 664086640 667850614 672585666 678126335 683480918
1476.7 683480918 688240826 692217588 695408881 697684944 699042737 699637711 699905813 699900448 698922694
1495 698922694 696818590 694718301 693088949 691379905 688342035 683968425 681831062 680807292 679239333
1513.4 679239333 677198112 675315499 673967659 672731459 671912253 671233416 670221984 669249296 667947590
1531.8 667947590 666261792 665157795 663850248 661223829 659495234 659496129 659868658 660251617 660719275
1550.1 660719275 661478400 662330151 662832022 662954152 664523721 666742563 668101847 668757021 668831408
1568.5 668831408 668763399 668858349 668181419 666576207 665464163 664400637 662535012 660105944 657343686
$$ packed form
1440F47343576R48369O00815J96815M77K49684L82900R8943k08377J003921K489805
1460.4F53106928K397358K260864K880275L441215L763974M735052N540669N354583
1476.7F83480918M759908L976762L191293K276063J357793N94974K68102n365r77754
1495F98922694k104104k100289j629352j709044l037870m373610k137363j023770j567959
1513.4F79239333k041221j882613j347840j236200q19206o78837j011432r72688j301706
1531.8F67947590j685798j103997j307547k626419j728595Q95L72529L82959M67658
1550.1F60719275P59125Q51751N01871J22130J569569K218842J359284O55174P4387
1568.5F68831408o8009R4950o76930j605212j112044j063526j865625k429068k762258
$$ plain form
1586.8 657343686 654264808 650913298 647456408 644074678 640951991 638007402 635014236 631972015
1603.2 631972015 628981590 625937879 622693777 619509518 616470993 612758815 608440995 605445385
1619.5 605445385 602753997 599202037 595843673 592797101 589930356 587725759 585486948 582707047
1635.8 582707047 581269860 581145704 581182301 581006348 580424786 580444276 581210613 581269860 581559598 583472908
1656.2 583472908 585408986 587067187 588920295 591405809 593939006 596373141 599545777 603120923
1672.5 603120923 606807768 611046910 615370572 619298220 623110950 628293455 634222448 639628410
1688.8 639628410 645055532 650010645 654891074 660301447 665748596 671904266 677445531 682001948
1705.1 682001948 686424792 690214813 693084657 695183754 696667254 698103189 700188458 702340245
$$ packed form
1586.8F57343686l078878l351510l456890l381730l122687k944589k993166l042221
1603.2F31972015k990425l043711l244102l184259l038525l712178m317820k995610
1619.5F05445385k691388l551960l358364l046572k866745k204597k238811k779901
1635.8E82707047j437187j24156L6597j75953n81562J9490P66337N9247K89738J913310
1656.2E83472908J936078J658201J853108K485514K533197K434135L172636L575146
1672.5F03120923L686845M239142M323662L927648L812730N182505N928993N405962
1688.8F39628410N427122M955113M880429N410373N447149O155670N541265M556417
1705.1F82001948M422844L790021K869844K099097J483500J435935K085269K151787
$$ plain form
1721.5 702340245 704077065 705574274 706736922 707532763 708091199 708621085 709913611 711443245 712760448
1739.8 712760448 714512050 716813147 719245672 721788406 725035191 729259670 733389854 737103879
1756.1 737103879 740889072 744665802 748519897 752238214 755381882 758089960 760428071 762678623
1772.4 762678623 765269697 767793238 769907773 771690786 773268104 774743259 776300907 777706563
1788.8 777706563 778517604 779321730 780834258 782440603 783583879 784536481 785764813 787135899 788306653
1807.1 788306653 789148033 789940298 790994585 792121291 793036759 793815017 794553280 795182467 795796752
1825.5 795796752 796368182 796832502 797683895 798797846 799545228 800054491 800658047 801117837 801260948
1843.8 801260948 801651001 802448988 803286791 803984761 804483712 804900169 805355012 805875957 806340873 806614697
$$ packed form
1721.5G02340245J736820J497209J162648P95841N58436N29886J292526J529634J317203
1739.8G12760448J751602K301097K432525K542734L246785M224479M130184L714025
1756.1G37103879L785193L776730L854095L718317L143668K708078K338111K250552
1772.4G62678623K591074K523541K114535J783013J577318J475155J557648J405656
1788.8G77706563Q11041Q04126J512528J606345J143276R52602J228332J371086J170754
1807.1G88306653Q41380P92265J054287J126706R15468P78258P38263O29187O14285
1825.5G95796752N71430M64320Q51393J113951P47382N09263O03556M59790J43111
1843.8H01260948L90053P97987Q37803O97970M98951M16457M54843N20945M64916K73824
$$ plain form
1864.2 806614697 806652248 806695640 807199836 807931364 808461607 808875799 809327424 809694588 809904397 810129166
1884.6 810129166 810459375 810706615 810912371 811221719 811564326 811966419 812328100 812530518 812713027 812998652
1905 812998652 813227475 813302100 813463748 813825309 814100683 814086616 814096034 814298868 814566016 814876914 815114737
1927.5 815114737 815279126 815489471 815667152 815717995 815754294 815816164 815799057 815806568 815952659 816157937 816359103
1949.9 816359103 816471338 816479743 816514790 816642582 816798210 816875875 816850126 816832721 816965461 817162275 817243874
1972.3 817243874 817257702 817325652 817433953 817497969 817519546 817561924 817621768 817620277 817509592 817457676 817606270
1994.8 817606270 817747712 817732453 817673206 817664027 817685425 817644656 817508519 817376673 817338645 817298770 817136824
2017.2 817136824 816957772 816896319 816899896 816815257 816614091 816456139 816452444 816457450 816308439 816118717 816051543
$$ packed form
1864.2H06614697L7551M3392N04196P31528N30243M14192M51625L67164K09809K24769
1884.6H10129166L30209K47240K05756L09348L42607M02093L61681K02418J82509K85625
1905H12998652K28823P4625J61648L61561K75374j4067R418K02834K67148L10898K37823
1927.5H15114737J64389K10345J77681N0843L6299O1870j7107P511J46091K05278K01166
1949.9H16359103J12235Q405L5047J27792J55628P7665k5749j7405J32740J96814Q1599
1972.3H17243874J3828O7950J08301O4016K1577M2378N9844j491j10685n1916J48594
1994.8H17606270J41442j5259n9247r179K1398m0769j36137j31846l8028l9875j61946
2017.2H17136824j79052o1453L577q4639k01166j57952l695N006j49011j89722o7174
$$ plain form
2039.6 816051543 816047311 815967739 815828383 815762877 815811574 815845966 815782070 815717697 815771639 815852404 815793633
2062.1 815793633 815680683 815726101 815900207 815982938 815926969 815902948 816014051 816105723 816049397 815998495 816100001
2084.5 816100001 816240013 816229701 816125333 816129744 816260099 816343546 816308856 816312551 816463113 816606224 816590488
2106.9 816590488 816527665 816591263 816726685 816769600 816747904 816808879 816957116 817053318 817056060 817097545 817257166
2129.4 817257166 817432046 817496300 817498386 817571402 817727864 817846656 817876935 817929685 818063021 818172812 818199694
2151.8 818199694 818265319 818458974 818676054 818789840 818836749 818949044 819142401 819303513 819395125 819505572
2172.2 819505572 819698393 819929242 820116282 820254982 820404410 820572853 820707321 820796013 820901215 821073949
2192.6 821073949 821265757 821400821 821483672 821590066 821761549 821918905 822000921 822071433 822195113 822336972
$$ packed form
2039.6H16051543m232p9572j39356o5506M8697L4392o3896o4373N3942Q0765n8771
2062.1H15793633j12950M5418J74106Q2731n5969k4021J11103R1672n6326n0902J01506
2084.5H16100001J40012j0312j04368M411J30355Q3447l4690L695J50562J43111j5736
2106.9H16590488o2823O3598J35422M2915k1696O0975J48237R6202K742M1485J59621
2129.4H17257166J74880O4254K086P3016J56462J18792L0279N2750J33336J09791K6882
2151.8H18199694O5625J93655K17080J13786M6909J12295J93357J61112R1612J10447
2172.2H19505572J92821K30849J87040J38700J49428J68443J34468Q8692J05202J72734
2192.6H21073949J91808J35064Q2851J06394J71483J57356Q2016P0512J23680J41859
$$ plain form
2213 822336972 822426021 822471619 822550833 822666526 822716475 822699189 822760701 822911739 823000848 822988570 822967112
2235.4 822967112 823025763 823148251 823201656 823170245 823176086 823251963 823309839 823279023 823237956 823292613 823383212
2257.9 823383212 823392630 823366702 823415279 823468268 823431015 823368430 823362112 823403001 823411405 823343277 823265135 823247254
2282.3 823247254 823244929 823167503 823049486 823004305 823006213 822951138 822853804 822754025 822638750 822532475 822447538
2304.8 822447538 822359979 822269082 822152197 821989238 821829677 821695328 821539402 821329296 821089268 820854723
2325.2 820854723 820583344 820260823 820000291 819835782 819623768 819328129 819028854 818727911 818409622 818238318
2345.6 818238318 818393528 818600893 818466544 817915320 817234397 816706359 816361308 816097021 815827549 815548599
2366 815548599 815355957 815231621 815108478 815036535 815027893 815007150 814902067 814746797 814630091 814502895 814266860
$$ packed form
2213H22336972Q9049M5598P9214J15693M9949j7286O1512J51038Q9109j2278k1458
2235.4H22967112N8651J22488N3405l1411N841P5877N7876l0816m1067N4657R0599
2257.9H23383212R418k5928M8577N2989l7253o2585o318M0889Q404o8128p8142j7881
2282.3H23247254k325p7426j18017m5181J908n5075r7334r9779j15275j06275q4937
2304.8H22447538q7559r0897j16885j62959j59561j34349j55926k10106k40028k34545
2325.2H20854723k71379l22521k60532j64509k12014k95639k99275l00943l18289j71304
2345.6H18238318J55210K07365j34349n51224o80923n28038l45051k64287k69472k78950
2366H15548599j92642j24336j23143p1943q642k0743j05083j55270j16706j27196k36035
$$ plain form
2388.4 814266860 813970625 813742936 813575089 813317597 812931359 812569559 812324524 812065005 811682880 811280131
2408.8 811280131 810955286 810643256 810251355 809809327 809419632 809067547 808625937 808102250 807659149 807361782
2429.2 807361782 807072103 806648970 806173742 805797696 805451214 804998994 804495275 804068089 803705156 803296149
2449.6 803296149 802815020 802340388 801952124 801587284 801096499 800531030 800058246 799645066 799184203 798715651
2470 798715651 798284292 797836483 797319233 796753287 796213567 795761287 795360148 794901371 794378459 793891907
2490.4 793891907 793471754 793048143 792579234 792096615 791632771 791187763 790765285 790353179 789950132 789573669
2510.8 789573669 789176881 788733065 788301885 787923992 787560940 787156165 786723554 786336660 786007166 785636187
2531.2 785636187 785168529 784686565 784274995 783899009 783492923 783070087 782667339 782282174 781876147 781428635
$$ packed form
2388.4H14266860k96235k27689j67847k57492l86238l61800k45035k59519l82125m02749
2408.8H11280131l24845l12030l91901m42028l89695l52085m41610n23687m43101k97367
2429.2H07361782k89679m23133m75228l76046l46482m52220n03719m27186l62933m09007
2449.6H03296149m81129m74632l88264l64840m90785n65469m72784m13180m60863m68552
2470G98715651m31359m47809n17250n65946n39720m52280m01139m58777n22912m86552
2490.4G93891907m20153m23611m68909m82619m63844m45008m22478m12106m03047l76463
2510.8G89573669l96788m43816m31180l77893l63052m04775m32611l86894l29494l70979
2531.2G85636187m67658m81964m11570l75986m06086m22836m02748l85165m06027m47512
$$ plain form
2551.6 781428635 780973256 780546784 780134857 779698610 779240727 778820157 778444231 777997017 777441621 776924610
2572 776924610 776523113 776117504 775610328 775085747 774647892 774234176 773715854 773106873 772566617 772147596
2592.4 772147596 771701276 771148443 770624518 770221531 769794047 769197822 768544197 768023789 767586291 767052293
2612.8 767052293 766441524 765891075 765413463 764888048 764249980 763612628 763070762 762522995 761873364 761239350
2633.2 761239350 760733545 760232627 759589672 758858263 758194566 757648885 757089674 756422460 755773485 755241811
2653.5 755241811 754693329 754024088 753346205 752765059 752249658 751722872 751126885 750511825 749967456 749424756
2673.9 749424756 748803079 748188555 747644544 747105062 746511221 745903015 745352089 744870663 744379878 743784070
2694.3 743784070 743119597 742518783 742015004 741500735 740899861 740283072 739717841 739140153 738499045 737847924
$$ packed form
2551.6G81428635m55379m26472m11927m36247m57883m20570l75926m47214n55396n17011
2572G76924610m01497m05609n07176n24581m37855m13716n18322o08981n40256m19021
2592.4G72147596m46320n52833n23925m02987m27484n96225o53625n20408m37498n33998
2612.8G67052293o10769n50449m77612n25415o38068o37352n41866n47767o49631o34014
2633.2G61239350n05805n00918o42955p31409o63697n45681n59211o67214o48975n31674
2653.5G55241811n48482o69241o77883n81146n15401n26786n95987o15060n44369n42700
2673.9G49424756o21677o14524n44011n39482n93841o08206n50926m81426m90785n95808
2694.3G43784070o64473o00814n03779n14269o00874o16789n65231n77688o41108o51121
$$ plain form
2714.7 737847924 737232864 736634970 736023903 735422373 734888613 734386444 733796954 733123422 732497454 732011616
2735.1 732011616 731598198 731128216 730614364 730148792 729744732 729309678 728787243 728248060 727766037 727314115
2755.5 727314115 726812363 726282835 725811779 725356042 724799752 724172533 723625660 723185539 722708285 722096741
2775.9 722096741 721426725 720811903 720230281 719580472 718893349 718274176 717670083 716940284 716102719 715318859
2796.3 715318859 714599013 713770032 712805629 711884201 711065888 710216522 709248662 708199143 707162619
2814.7 707162619 706166208 705114543 703948379 702748001 701566994 700309157 698935330 697531819
2831 697531819 696098804 694546759 692825258 690884590 688678384 686218679 683448076 680374920 677375078
2849.3 677375078 674971223 673404396 672567844 672206879 672012329 671667635 670989573 669980168 668749750
$$ packed form
2714.7G37847924o15060n97894o11067o01530n33760n02169n89490o73532o25968m85838
2735.1G32011616m13418m69982n13852m65572m04060m35054n22435n39183m82023m51922
2755.5G27314115n01752n29528m71056m55737n56290o27219n46873m40121m77254o11544
2775.9G22096741o70016o14822n81622o49809o87123o19173o04093p29799q37565p83860
2796.3G15318859p19846q28981r64403r21428q18313q49366r67860j049519j036524
2814.7G07162619r96411j051665j166164j200378j181007j257837j373827j403511
2831F97531819j433015j552045j721501j940668k206206k459705k770603l073156k999842
2849.3F77375078k403855j566827q36552l60965j94550l44694o78062j009405j230418
$$ plain form
2867.7 668749750 667476177 666342735 665329695 664351463 663526773 662884355 662231386 661486864 660719275
2886.1 660719275 659944892 659108996 658203483 657293081 656376302 655368984 654284298 653162718 651920795
2904.4 651920795 650499761 648931861 647180974 645147920 642791212 640222192 637707293 635523140
2920.7 635523140 633860886 632789552 632356942 632530689 633047700 633819699 635007799 636556447 638290763
2939.1 638290763 640202582 642204165 643970788 645289481 646292150 647174656 647879064 648349941 648830950
2957.4 648830950 649613261 650736392 652029514 653417528 654994667 656792462 658700287 660563529
2973.8 660563529 662344515 664132178 665895522 667404234 668600798 669726729 670893729 671961010
2990.1 671961010 672736466 673165143 673440933 673588276 673396528 672959745 672494471 672005355 671476960 670958877
$$ packed form
2867.7F68749750j273573j133442j013040r78232q24690o42418o52969p44522p67589
2886.1F60719275p74383q35896r05513r10402r16779j007318j084686j121580j241923
2904.4F51920795j421034j567900j750887k033054k356708k569020k514899k184153
2920.7F35523140j662254j071334m32610J73747N17011P71999J188100J548648J734316
2939.1F38290763J911819K001583J766623J318693J002669Q82506P04408M70877M81009
2957.4F48830950P82311J123131J293122J388014J577139J797795J907825J863242
2973.8F60563529J780986J787663J763344J508712J196564J125931J167000J067281
2990.1F71961010P75456M28677K75790J47343j91748m36783m65274m89116n28395n18083
$$ plain form
3010.5 670958877 670497894 670034468 669417024 668620288 667777121 667001069 666208565 665267706 664277196 663393855
3030.9 663393855 662615061 661728084 660611808 659559429 658733606 657858074 656727016 655483782 654389143
3049.2 654389143 653411210 652326107 651147246 650024712 648988128 647989273 647004724 646085024 645230412
3067.6 645230412 644302487 643259704 642273605 641525686 640900671 640065432 639033675 638105333 637298882
3085.9 637298882 636458457 635539949 634542584 633545458 632649183 631811202 630928040 629968166 629016459 628116250
3106.3 628116250 627166271 626110971 625107229 624268413 623434544 622460842 621309638 619997859 618675351
3124.7 618675351 617463768 616358817 615250289 614054620 612875044 611802697 610749364 609555364
3141 609555364 608205676 606859803 605619490 604491353 603391528 602126658 600694835 599325299 598051488
$$ packed form
3010.5F70958877m60983m63426o17444p96736q43167p76052p92504r40859r90510q83341
3030.9F63393855p78794q86977j116276j052379q25823q75532j131058j243234j094639
3049.2F54389143r77933j085103j178861j122534j036584r98855r84549r19700q54612
3067.6F45230412r27925j042783r86099p47919o25015q35239j031757r28342q06451
3085.9F37298882q40425r18508r97365r97126q96275q37981q83162r59874r51707r00209
3106.3F28116250r49979j055300j003742q38816q33869r73702j151204j311779j322508
3124.7F18675351j211583j104951j108528j195669j179576j072347j053333j194000
3141F09555364j349688j345873j240313j128137j099825j264870j431823j369536j273811
$$ plain form
3159.4 598051488 596731305 595347762 593995571 592723846 591463923 590146482 588797569 587479353
3175.7 587479353 586197674 584904253 583568037 582248151 580986500 579689145 578334332 577055454
3192 577055454 575865686 574618280 573298216 572024167 570823252 569636822 568391860 567091882 565885842
3210.3 565885842 564801455 563669026 562466860 561306715 560212672 559112608 557944477 556748986
3226.7 556748986 555604637 554566264 553589046 552463293 551166713 549933732 548802614 547668576
3243 547668576 546579897 545546114 544422269 543209732 542057812 540995777 539929271 538814783 537691891
3261.3 537691891 536615312 535605252 534650743 533743918 532784462 531713784 530630827 529580891 528579414
3279.7 528579414 527663887 526797831 525924861 525050163 524247468 523558557 522867322 521989346 520949066
$$ packed form
3159.4E98051488j320183j383543j352191j271725j259923j317441j348913j318216
3175.7E87479353j281679j293421j336216j319886j261651j297355j354813j278878
3192E77055454j189768j247406j320064j274049j200915j186430j244962j299978j206040
3210.3E65885842j084387j132429j202166j160145j094043j100064j168131j195491
3226.7E56748986j144349j038373r77218j125753j296580j232981j131118j134038
3243E47668576j088679j033783j123845j212537j151920j062035j066506j114488j122892
3261.3E37691891j076579j010060r54509r06825r59456j070678j082957j049936j001477
3279.7E28579414r15527q66056q72970q74698q02695o88911o91235q77976j040280
$$ plain form
3298 520949066 520038784 519392073 518780112 517982006 517025471 516043723 515053391 514017165 512979567 511991978
3318.4 511991978 511049986 510105729 509079516 507924855 506725848 505581737 504454613 503357768 502360642
3336.8 502360642 501348972 500201046 498959035 497677118 496457100 495380163 494261473 492942929
3353.1 492942929 491600424 490422338 489331663 488200337 487088740 486141622 485284358 484236896 482928932
3371.5 482928932 481643289 480575174 479596496 478625238 477673411 476757318 475949794 475318909 474883467
3389.8 474883467 474421501 473662287 472791463 472232163 471939176 471402854 470505714 469710857 469260305 468972683
3410.2 468972683 468631625 468132198 467580259 467183441 466929615 466698289 466538310 466581672 466804981 467021078
3430.6 467021078 467239946 467542291 467728764 467673898 467602223 467773318 468181282 468665928 469165236 469711334
$$ packed form
3298E20949066r10282o46711o11961p98106r56535r81748r90332j036226j037598r87589
3318.4E11991978r41992r44257j026213j154661j199007j144111j127124j096845r97126
3336.8E02360642j011670j147926j242011j281917j220018j076937j118690j318544
3353.1D92942929j342505j178086j090675j131326j111597r47118q57264j047462j307964
3371.5D82928932j285643j068115r78678r71258r51827r16093q07524o30885m35442
3389.8D74883467m61966p59214q70824n59300k92987n36322q97140p94857m50552k87622
3410.2D68972683l41058m99427n51939l96818k53826k31326j59979M3362K23309K16097
3430.6D67021078K18868L02345J86473n4866p1675J71095M07964M84646M99308N46098
$$ plain form
3451 469711334 470319182 471048713 471910506 472771138 473515600 474324465 475457370 476741046 477754295
3469.4 477754295 478427261 479112923 480054319 481241286 482467264 483535111 484633535 485922337 487161398
3487.7 487161398 488292396 489538372 490932763 492399275 493825018 495183200 496526152 497831672
3504 497831672 499144107 500551462 502103806 503825307 505537748 507082283 508643091 510382235 512241244
3522.4 512241244 514012933 515612185 517262161 519152045 521192849 523292065 525419414 527507007
3538.7 527507007 529625833 531800449 533898354 535883188 537924469 540086150 542373717 544823229
3555 544823229 547348499 549885392 552401602 554713011 556747675 559134066 562265754 565488398 568437219
3573.4 568437219 571279109 574190378 577280402 580519199 583645046 586383045 589054108 592336178
$$ packed form
3451D69711334O07848P29531Q61793Q60632P44462Q08865J132905J283676J013249
3469.4D77754295O72966O85662R41396J186967J225978J067847J098424J288802J239061
3487.7D87161398J130998J245976J394391J466512J425743J358182J342952J305520
3504D97831672J312435J407355J552344J721501J712441J544535J560808J739144J859009
3522.4E12241244J771689J599252J649976J889884K040804K099216K127349K087593
3538.7E27507007K118826K174616K097905J984834K041281K161681K287567K449512
3555E44823229K525270K536893K516210K311409K034664K386391L131688L222644K948821
3573.4E68437219K841890K911269L090024L238797L125847K737999K671063L282070
$$ plain form
3589.7 592336178 595808387 598993123 602166295 605595410 609113157 612579644 615924358 618980467
3606 618980467 621999025 625279069 628651917 632098675 635448754 638619363 642221451 646133482 649637222
3624.4 649637222 652325392 654671252 658031940 661889791 665472746 668792784 671902597 674947321
3640.7 674947321 677956223 680577934 682465374 684371352 687627852 691298008 694207430 696870089
3657 696870089 699810147 702510118 704767883 706776381 708291829 709335566 710880101 712461889 713434041
3675.4 713434041 715214908 717766881 720078766 721996725 723435462 724244654 724775672 725970924 727697849
3693.7 727697849 729230642 730342567 731070161 731696486 732677042 733724415 734216809 734094203 734267890
3712.1 734267890 735546410 737057745 737987399 738373637 738602340 738948166 739519775 740299582 740749598
$$ packed form
3589.7E92336178L472209L184736L173172L429115L517747L466487L344714L056109
3606F18980467L018558L280044L372848L446758L350079L170609L602088L912031L503740
3624.4F49637222K688170K345860L360688L857851L582955L320038L109813L044724
3640.7F74947321L008902K621711J887440J905978L256500L670156K909422K662659
3657F96870089K940058K699971K257765K008498J515448J043737J544535J581788R72152
3675.4G13434041J780867K551973K311885J917959J438737Q09192N31018J195252J726925
3693.7G27697849J532793J111925P27594O26325R80556J047373M92394j22606J73687
3712.1G34267890J278520J511335R29654L86238K28703L45826N71609P79807M50016
$$ plain form
3730.4 740749598 740508378 740178049 740706861 741991043 743007779 742879689 742215157 742628694 742984891
3748.8 742984891 742683113 743447423 744975090 745870292 746160924 746701777 747379124 747688055 747785807 747873604
3769.2 747873604 748292387 749076426 749682128 749887168 749938607 750160754 750375748 750559688 750995815 751514137
3789.6 751514137 751850367 751876831 751671731 751590192 751309454 750893593 751290321 751776099 752116561 752932012
3810 752932012 753622770 753478825 752883434 752701461 752452075 752461970 753270924 753934503 754279196 754399955
3830.4 754399955 754325867 754332006 754101157 753621399 753704548 754306853 755068839 755790174 756054938 755335510
3850.8 755335510 753598213 753193915 754618526 755759835 756039441 755737960 755583644 755710602 755453825
3869.1 755453825 755243838 755580008 756141305 756629348 756564736 756354094 756455243 756487250 756680846 756829798
$$ packed form
3730.4G40749598k41220l30329N28812J284182J016736j28090o64532M13537L56197
3748.8G42984891l01778P64310J527667Q95202K90632N40853O77347L08931R7752Q7797
3769.2G47873604M18783P84039O05702K05040N1439K22147K14994J83940M36127N18322
3789.6G51514137L36230K6464k05100q1539k80738m15861L96728M85778L40462Q15451
3810G52932012O90758j43945n95391j81973k49386R895Q08954O63579L44693J20759
3830.4G54399955p4088O139k30849m79758Q3149O02305P61986P21335K64764p19428
3850.8G55335510j737297m04298J424611J141309K79606l01481j54316J26958k56777
3869.1G55453825k09987L36170N61297M88043o4612k10642J01149L2007J93596J48952
$$ plain form
3889.5 756829798 756653666 756840587 757286906 757189810 756517768 755869269 755690694 756198287 756999254 757457793
3909.9 757457793 757559240 757499576 757225990 756955743 756998420 757099450 757016599 757005274 757096291 757015586 756917775
3932.3 756917775 757051170 757222593 757269502 757172942 756976664 756926894 756979287 756921589 756888986 756977499 757085204
3954.8 757085204 757151186 757133007 757051885 757064760 757143021 757098615 756975353 756914318 756887972 756872892 756908417
3977.2 756908417 756927550 756944120 756995320 756979823 756898940 756824613 756784022 756807625 756869614 756903291
3997.6 756903291
$$ packed form
3889.5G56829798j76132J86921M46319r7096o72042o48499j78575N07593Q00967M58539
3909.9G57457793J01447n9664k73586k70247M2677J01030q2851j1325R1017q0705r7811
3932.3G56917775J33395J71423M6909r6560j96278m9770N2393n7698l2603Q8513J07705
3954.8G57085204O5982j8179q1122J2875P8261m4406j23262o1035k6346j5080L5525
3977.2G56908417J9133J6570N1200j5497q0883p4327m0591K3603O1989L3677
3997.6G56903291
##END=$$ End of the data block
