##TITLE=$$ Begin of the data block
##JCAMP-DX=5.00 $$ ACD/SpecManager v 10.08
##SPECTROMETER/DATA SYSTEM=Alpha
##DATE=10 Nov 2014 10:35:34
##DATA TYPE=INFRARED SPECTRUM
##DATA CLASS=XYDATA
##ORIGIN=
##OWNER=
##NPOINTS=1765
##FIRSTX=399.76428223
##LASTX=3997.64306641
##MAXX=3997.64306641
##MINX=399.76428223
##MAXY=0.87015027
##MINY=0.49909860
##XFACTOR=1.0000000000
##YFACTOR=1.000000000000000e-9
##FIRSTY=0.78645331
##DELTAX=2.03961372
##XUNITS=1/CM
##YUNITS=ARBITRARY UNITS
##XYDATA=(X++(Y..Y))
399.8G86453307j018107J272857J0192j945972m54605N08130j735747k232671L56376
418.1G81213760P8500k808154j716614O33776o39617k305508k61724J079441r83716
436.5G74290144j238465P39694O1810j600325m4108J365543p37667k107978L457N76615
456.9G71308720j801193j201927J376867L49343k319873j219630P45654p62164j378358
475.2G65097439Q41976P16626j781642j355827J035273J65224j915157n37038J193822
493.6G63460696p74503k000391P8558K84613k196730j822888M17590m42446k357065
511.9G54647434j234949J15574j379967k171815l41236J43528j515627j338482K94506
530.3G47218966l63707j914322r05633O40452k31565p27355J219749J889587j97947
$$ y = [786453307, 785435200, 786708057, 786718249, 784772277, 784317672, 784825802, 783090055, 780857384, 781213760, 781292260, 778484106, 776767492, 777401268, 776761651, 774456143, 774194419, 775273860, 774290144, 773051679, 773791373, 773853183, 772252858, 772208750, 773574293, 772836626, 770728648, 770732105, 771308720, 769507527, 768305600, 769682467, 770031810, 767711937, 766492307, 767237961, 766475797, 765097439, 765939415, 766656041, 764874399, 763518572, 764553845, 764719069, 762803912, 762266874, 763460696, 762686193, 760685802, 760764360, 761048973, 758852243, 757029355, 757446945, 757004499, 754647434, 753412485, 753528059, 752148092, 749976277, 749635041, 749778569, 748262942, 746924460, 747218966, 746855259, 744940937, 744035304, 744675756, 744444191, 743716836, 744936585, 746826172, 746628225]
548.7G46628225p92921P72715M28140j297116n81324J064121K02060r95397J38342
567G45566845R82702l95537j057982L82900Q68559m42565n28037N61118K04027o12676
587.4G45529354P2240O68228l14951q32081L05295P79867l52203q22664O974M1962
607.8G45082021q72255q31961r6858k59578n64337O20544J905918J533568J003862
626.2G47520924J703322J966714Q72553L39150J182139J450479O62446O85990J549363
644.5G57933080J389981N37037R48787J858652J244724J77919M92692R46820J94490
662.9G65724182n15401o3360J220286J190066J015067J868785J978278R42886R95755
681.2G74356544J864851J268625J49011O92428J505196O29663k85566M33624J037717
$$ y = [746628225, 745835304, 746608019, 747036159, 745739043, 745157719, 746221840, 746423900, 745428503, 745566845, 746549547, 746154010, 745096028, 745478928, 746347487, 745904922, 745376885, 745938003, 746142030, 745529354, 745601594, 746269822, 745954871, 745122790, 745428085, 746207952, 745855749, 745033085, 745040059, 745082021, 744209766, 743377805, 743280947, 743021369, 742457032, 743077576, 744983494, 746517062, 747520924, 749224246, 751190960, 752063513, 752402663, 753584802, 755035281, 755697727, 756383717, 757933080, 759323061, 759860098, 760808885, 762667537, 763912261, 764090180, 764582872, 765529692, 765724182, 765208781, 765145421, 766365707, 767555773, 768570840, 770439625, 772417903, 773360789, 774356544, 776221395, 777490020, 777639031, 778331459, 779836655, 780466318, 780180752, 780614376, 781652093]
699.6G81652093K74122K24828J527250J658559M68433O17862J814067J448095L34084
717.9G90019393J048744K333939J668453P30574J540780K071381R19044M31895J417220
736.3H02181423J393676J27196J54495J250744Q98004j69337L94940J299739M48048
754.7H07978928m11212N18262J152515J11878k21312J023829J209438j7226R8765J421154
775.1H12865019J229822J95444Q14557J888037J213849M62412J448036J978397P96020
793.4H22891593M42743J559496J487553J81318K68221J302123Q48829j75058M16219
811.8H29223037J260519M17650m39525K43366K85446j279115j586795k1458M37498
830.1H28540623k84731P25746K670884K511978J192928J187563J522839N91576j92702
$$ y = [781652093, 781926215, 782151043, 783678293, 785336852, 785805285, 786423147, 788237214, 789685309, 790019393, 791068137, 793402076, 795070529, 795801103, 797341883, 799413264, 800332308, 800764203, 802181423, 803575099, 803702295, 803856790, 805107534, 806005538, 805836201, 806231141, 807530880, 807978928, 807567716, 808085978, 809238493, 809350371, 809129059, 810152888, 811362326, 811345100, 811443865, 812865019, 814094841, 814290285, 815104842, 816992879, 818206728, 818669140, 820117176, 822095573, 822891593, 823334336, 824893832, 826381385, 826562703, 826830924, 828133047, 828981876, 828806818, 829223037, 830483556, 830901206, 830461681, 830705047, 830990493, 829711378, 828124583, 828103125, 828540623, 828255892, 828981638, 831652522, 834164500, 835357428, 836544991, 838067830, 838659406, 838466704]
848.5H38466704L54171O49869l2902N7996J139104J156628R5070n6148N08010R4057
868.9H42432559p58350n30124m0412n89907j090884o26386m81784j234055j519560
887.2H35561097q81434o39200r89080n87582L62217M55261K1576K61367O61909R0361
907.6H34316492p09176n38766j66238n36263q23438l92198j17660m48108n57601k20716
928H29806328l18229r73404j313269j327574j846016k656102k918243k928317l284454
946.4H12240720l506243k982557k300203k164066k001822j425505j167237j443684
962.7G95249403j549602j390994j661181k400041k903223l174424l868520m771292
979G73530126n108774n056799n176663n150855m576385l918826l770471l855467l759563
$$ y = [838466704, 838820875, 839470744, 839437842, 839495838, 840634942, 841791570, 841886640, 841830492, 842338502, 842432559, 841674209, 841144085, 841103673, 840513766, 839422882, 838796496, 838314712, 837080657, 835561097, 834679663, 834040463, 833051383, 832463801, 832826018, 833281279, 833302855, 833564222, 834226131, 834316492, 833607316, 833068550, 832902312, 832366049, 831542611, 831150413, 831032753, 830584645, 830027044, 829806328, 829488099, 828514695, 827201426, 825873852, 824027836, 821371734, 818453491, 815525174, 812240720, 808734477, 805751920, 803451717, 801287651, 799285829, 797860324, 796693087, 795249403, 793699801, 792308807, 790647626, 788247585, 785344362, 782169938, 778301418, 773530126, 768421352, 763364553, 758187890, 753037035, 748460650, 744541824, 740771353, 736915886, 733156323]
997.4G33156323l950238m612267m918575m567087m250049m137457l669023k932668
1013.7G00118959k604663k545178k084613j444221j235246j174927p54595l56257l75152
1032F87544107l33905M5777J43885l05056o55055o40274p30156r42052q00669m09901
1052.4F82916701l13640m47511k71202O1334O914k10047j09077J4365k08974k32815
1072.8F81206048L67701J040697J407921J793623K138793J909316J223743P53939N06520
1091.2F92348301n245n55277n81503l54230l24607q4817P12096J538217K004862K504587
1111.6F97202384L188491L499031L234327K955258K887428K571583K059221K018929
1127.9G19616652K366423K312362J844049J470208J037180L87967O5088L37780O72161
$$ y = [733156323, 729206085, 724593818, 719675243, 715108156, 710858107, 706720650, 703051627, 700118959, 697514296, 694969118, 692884505, 691440284, 690205038, 689030111, 688275516, 687919259, 687544107, 687210202, 687255979, 687399864, 687094808, 686439753, 685799479, 685069323, 684127271, 683326602, 682916701, 682603061, 682155550, 681884348, 681945682, 681952596, 681742549, 681633472, 681647837, 681438863, 681206048, 681573749, 682614446, 684022367, 685815990, 687954783, 689864099, 691087842, 691841781, 692348301, 692343056, 691787779, 691206276, 690852046, 690527439, 690442622, 691154718, 692692935, 694697797, 697202384, 700390875, 703889906, 707124233, 710079491, 712966919, 715538502, 717597723, 719616652, 721983075, 724295437, 726139486, 727609694, 728646874, 729034841, 729099929, 729437709, 730109870]
1146.3G30109870Q17597J231075J894712K215743K308786K723217L304541L693462
1162.6G48299003M131674M858852N467534N608618N615354N697131N451381M740000
1178.9G89869547M039049L553391K906680K067089J441240R72927L10301l84986p46667
1197.3H04028571q80659j006424r93014p58290n87225o25491p47264q86798j153528
1215.6G96389878j539469j756847j773417j808643j861155j788140j604914j427412
1231.9G82829881j245916r79662p12156n46754l76761j38879O5506J71244K43127L19183
1252.3G79628813L48389L03150L02553M30226N25892M95553M71473N36799N75781M87804
1272.7G84106433L49045K38955P7188r3817j22190j03891k14398m32730o27815q22962
$$ y = [730109870, 730927467, 732158542, 734053254, 736268997, 738577783, 741301000, 744605541, 748299003, 752430677, 757289529, 762757063, 768365681, 773981035, 779678166, 785129547, 789869547, 793908596, 797461987, 800368667, 802435756, 803876996, 804849923, 805160224, 804775238, 804028571, 803147912, 802141488, 801148474, 800390184, 799802959, 799177468, 798430204, 797543406, 796389878, 794850409, 793093562, 791320145, 789511502, 787650347, 785862207, 784257293, 782829881, 781583965, 780604303, 779892147, 779345393, 778968632, 778829753, 778895259, 779066503, 779309630, 779628813, 779977202, 780280352, 780582905, 781013131, 781539023, 782034576, 782506049, 783042848, 783618629, 784106433, 784455478, 784694433, 784771621, 784677804, 784555614, 784451723, 784237325, 783804595, 783176780, 782353818]
1293.1G82353818j108050j419723j628220j768589j935303k084136k141834k174317
1309.4G68093646k283574k313673k122283j862645j652837j458883j356364j454115
1325.8G53589272j673221j805246j791716j748085j728296j688480j533449j366734
1342.1G40254045j373649j384854j236141r82940o47724l43561k50817m13298o42657
1360.4G32978404p12276p48217r98557j212418j201629j389444j661480j728832k578915
1378.8G20746636m883170n966067k413094L093898M402220K050996L50476l47615n71489
1397.1G16462791m49240j52529j01625r9957J25229K81870K98560L06845L40223N16951
1417.5G17529118J066268J414060J604617J830697J716435J669645J722157J358688
$$ y = [782353818, 781245768, 779826045, 778197825, 776429236, 774493933, 772409797, 770267963, 768093646, 765810072, 763496399, 761374116, 759511471, 757858634, 756399751, 755043387, 753589272, 751916051, 750110805, 748319089, 746571004, 744842708, 743154228, 741620779, 740254045, 738880396, 737495542, 736259401, 735276461, 734628737, 734285176, 734034359, 733621061, 732978404, 732266128, 731517911, 730519354, 729306936, 728105307, 726715863, 725054383, 723325551, 720746636, 715863466, 709897399, 707484305, 710578203, 714980423, 717031419, 717381895, 717034280, 716462791, 716013551, 715861022, 715759397, 715659440, 715784669, 716066539, 716365099, 716671944, 717012167, 717529118, 718595386, 720009446, 721614063, 723444760, 725161195, 726830840, 728552997, 729911685]
1433.9G29911685J220405J786649J915634J595318J284659J188815J285732J193463
1450.2G41382360R57549Q99553J435042K675295K771377K312243K442837K796471K889395
1468.5G60562122L281712M494787N127906M669369L938257L059090K391219J825988
1484.9G89350450J121759L93749K31147R3579p85887j812399j807690j434445j756310
1503.2G83593953k977193l766060k035558j547098k080500k134740j616359j199782
1519.5G66236663j116276q06093r70960j454651j407981j518428j873553j653135j715243
1537.9G53720343k304017j658380o32346k65837k66731m81486m63068l24369n51760
1556.2G46772349j140893l51011K89499m94003j280129j797259j930415j844883k570510
$$ y = [729911685, 731132090, 732918739, 734834373, 736429691, 737714350, 738903165, 740188897, 741382360, 742339909, 743239462, 744674504, 747349799, 750121176, 752433419, 754876256, 757672727, 760562122, 763843834, 768338621, 773466527, 778135896, 782074153, 785133243, 787524462, 789350450, 790472209, 790865958, 791097105, 791190684, 790404797, 788592398, 786784708, 785350263, 783593953, 780616760, 776850700, 774815142, 773268044, 771187544, 769052804, 767436445, 766236663, 765120387, 764314294, 763343334, 761888683, 760480702, 758962274, 757088721, 755435586, 753720343, 751416326, 749757946, 749125600, 748859763, 748593032, 748111546, 747648478, 747324109, 746772349, 745631456, 745280445, 745569944, 745075941, 743795812, 741998553, 740068138, 738223255, 735652745]
1574.6G35652745l405988k849699k798795l465057l715872l863573m168571m288136
1590.9G07097054m096449l979266l899276l658831l454566l455460l485620l425717
1607.2F77641869l402770l395438l396988l746569l918290k897263k554238k821564
1623.5F51508749k574087k477407k259672j540661j145064p23124M76539J121521J186311
1641.9F43573105J142085J702368K652824K121151K058267M109562L942132L005504
1658.2F64306998L221751M183411M714787L957212M127681N352617N012333M852474
1674.5F99729264N478918M997850M193544M396379O542981O539345N165934N132735
1690.9G42176950M746139M915893N286574N149425O135404N073785L723443L713012
$$ y = [735652745, 732246757, 729397058, 726598263, 723133206, 719417334, 715553761, 711385190, 707097054, 703000605, 699021339, 695122063, 691463232, 688008666, 684553206, 681067586, 677641869, 674239099, 670843661, 667446673, 663700104, 659781814, 656884551, 654330313, 651508749, 648934662, 646457255, 644197583, 642656922, 641511858, 640788734, 641265273, 642386794, 643573105, 644715190, 646417558, 649070382, 651191533, 653249800, 657359362, 661301494, 664306998, 667528749, 671712160, 676426947, 680384159, 684511840, 689864457, 694876790, 699729264, 705208182, 710206032, 714399576, 718795955, 725338936, 731878281, 737044215, 742176950, 746923089, 751838982, 757125556, 762274981, 768410385, 773484170, 777207613, 780920625]
1707.2G80920625L243685K373278J533627J092732J539946J965284J533806J216770
1723.5G95419753J174688Q64327O37829O81937J102567J605153J455605J643300K042711
1741.9H06627870K072095K134383K404928K839506L142834K878964K732455K668918
1758.2H27501953K289533K343655K238750J553417J300275J601219J923323J870692
1774.5H42622817J504182J300991J157880R16719Q50797R39965O72400K59161N87046
1792.8H50811958J062692P65264L74615N57899Q54552O45518L57807L99470N64993
1811.2H56394768N02884M00543M72248M65274K07424J02103L24130K93553J13427M43876
1831.6H59720230O41525L17871J41919K64824J91390l8385J79946N25832M76480K15053
$$ y = [780920625, 784164310, 786537588, 788071215, 789163947, 790703893, 792669177, 794202983, 795419753, 796594441, 797458768, 798096597, 798778534, 799881101, 801486254, 802941859, 804585159, 806627870, 808699965, 810834348, 813239276, 816078782, 819221616, 822100580, 824833035, 827501953, 829791486, 832135141, 834373891, 835927308, 837227583, 838828802, 840752125, 842622817, 844126999, 845427990, 846585870, 847502589, 848353386, 849293351, 849965751, 850224912, 850811958, 851874650, 852639914, 853014529, 853572428, 854426980, 855072498, 855430305, 855829775, 856394768, 856897652, 857298195, 857770443, 858235717, 858443141, 858545244, 858869374, 859162927, 859276354, 859720230, 860361755, 860679626, 860821545, 861086369, 861277759, 861239374, 861419320, 861945152, 862421632, 862636685]
1852H62636685J30177K73347K59638Q9943P4029J29759q2314j85609L13700N84721
1872.4H64224076K40803j0610J40608K34186M9353k5809J13547J10567L4988R6202
1892.8H65207911J79529J41084L040N0604K23637J36494q8155j3709J91093Q6545j41084
1915.2H65976989m7385J88827M6074p6234J65820K28346j8776r3102Q5115J23263l9280
1937.7H66539657j38581j00553l8027j7643P0571J61291K0504j45793o0559K9743n4181
1960.1H66266429p1287N2691N6982o8546o9975L3140K622j29401p5996Q8811M4286
1982.5H66129756j22786q6069P153j27494j89126L8862J53184k8133j43051j8776L1114
2005H65644634j18673j37687J8954J0968j56820j50383J491l3200j50025o9201N3227
$$ y = [862636685, 862766862, 863040209, 863299847, 863389790, 863463819, 863593578, 863511264, 863325655, 863639355, 864224076, 864464879, 864454269, 864594877, 864829063, 864878416, 864852607, 864966154, 865076721, 865111709, 865207911, 865387440, 865528524, 865531564, 865582168, 865805805, 865942299, 865854144, 865840435, 866031528, 866118073, 865976989, 865929604, 866118431, 866164505, 866088271, 866254091, 866482437, 866463661, 866370559, 866455674, 866578937, 866539657, 866401076, 866300523, 866262496, 866244853, 866315424, 866476715, 866497219, 866351426, 866290867, 866320610, 866266429, 866195142, 866247833, 866304815, 866236269, 866166294, 866199434, 866202056, 866072655, 865996659, 866085470, 866129756, 866006970, 865920901, 865928054, 865800560, 865611434, 865650296, 865803480, 865775347, 865632296, 865613520, 865644634, 865525961, 865388274, 865407228, 865418196, 865261376, 865110993, 865112484, 865079284, 864929259, 864860058, 864913285]
2027.4H64913285m6373j72436o6399L2961r7275j57714J5438O0797r6739r7871N7817
2049.8H64345491K3305j43885q2732J01030M7028j16586m9770Q9705p928j16407M5239
2072.3H64134490J58370p153p6830J04845J47044k5749m0948J16408J17898k5809J311
2094.7H64603877J41919Q6426k1278Q6367J83046N0544m6789Q8453J76549L8445r239
2117.1H65378320J44959J55985k0623k7716J18613R4116j9968N9784J95384R9420l5882
2139.6H66142392O6996J71721N3465k3723R5428J69038Q1063K5093J01149J24991L4809
2162H67042422M8697J72675J42693M6492J17958J84297P0334j3769J09017K05338R1493
2184.5H68217647o378Q6964J63197P8321N3882J70052J61469m172l636J63853J53959
$$ y = [864913285, 864866912, 864694476, 864628077, 864661038, 864563763, 864406049, 864421487, 864482284, 864385545, 864287674, 864345491, 864368796, 864224911, 864142179, 864243209, 864290237, 864173651, 864123881, 864213586, 864205658, 864089251, 864134490, 864292860, 864285707, 864208877, 864313722, 864460766, 864435017, 864394069, 864510477, 864628375, 864602566, 864603877, 864745796, 864832222, 864810944, 864897311, 865080357, 865130901, 865084112, 865172565, 865349114, 865387559, 865378320, 865523279, 865679264, 865658641, 865630925, 865749538, 865843654, 865823686, 865883470, 866078854, 866178274, 866142392, 866209388, 866381109, 866434574, 866410851, 866506279, 866675317, 866756380, 866781473, 866882622, 867007613, 867042422, 867091119, 867263794, 867406487, 867452979, 867570937, 867755234, 867825568, 867811799, 867920816, 868126154, 868217647, 868211269, 868298233, 868461430, 868539751, 868593633, 868763685, 868925154, 868920982, 868917346, 869081199, 869235158]
2206.9H69235158j490n126R4414P3909l039M5001R7394J371m4286R2506J63853J6451
2231.4H69766116p6055L2961P4685j8359o675J19626J15574j9610l7909N9664N0485
2253.8H70060503l5583L039O5804k0027q7202K1219J12415L0100n3048j371M4227j5438
2278.3H70124638m0471K9921K4617j11461j37210j0490O55j18434j44303r7871j63912
2300.7H69355679k30909j40667r6500k38776l27229k22266j75417l47256n00798m12286
2321.1H66663575k60293k77102l57032l33965k87354k94030k09987j07825k26259l05712
2341.5H64004016J8477N03123M90368p2420o22988q77082j010955r38355m19856L7909
2361.9H61112237K16961M73857O30140M97043M24803N46753N94914M73261L93450L99888
$$ y = [869235158, 869233668, 869228542, 869322956, 869396865, 869393826, 869438827, 869536221, 869537592, 869493306, 869585812, 869749665, 869766116, 869690061, 869723022, 869797707, 869779348, 869772673, 869892299, 870007873, 869988263, 869950354, 870010018, 870060503, 870024920, 870027959, 870093763, 870073736, 869986534, 870007753, 870120168, 870150268, 870097220, 870095849, 870140076, 870124638, 870084167, 870114088, 870138705, 870027244, 869890034, 869879544, 869880199, 869761765, 869617462, 869519591, 869355679, 869124770, 868984103, 868887603, 868648827, 868321598, 868099332, 867923915, 867576659, 867075861, 866663575, 866403282, 866126180, 865769148, 865435183, 865147829, 864853799, 864643812, 864535987, 864309728, 864004016, 864022493, 864525616, 865015984, 864943564, 864320576, 863443494, 862432539, 861494184, 861074328, 861112237, 861329198, 861803055, 862433195, 862930238, 863355041, 863901794, 864496708, 864969969, 865363419, 865763307]
2382.3H65763307K46107q7201k40982j41203j35422k98262l01242j00970m7922j61529
2402.7H64494681j30593j7286j02818k23875j13904m232j32561k33769j59085j54436
2423.1H63222122k41518j84238n126K0027j15931j40428n9426j23024k50340j69992
2443.5H61952126k6762q6368j88529j32680r2983k00033k41936j22487q9288k11239
2463.9H60559821k34604j44064j62125k36571j64389p9632j86443k88487k11298j56045
2484.3H58696163k30372k48373j60932j39177k18511k29895j56343j83821k70187k22147
2504.7H56636405j36197j80959k26617j64688j60575k59280k46942j32143j37866k20239
2525.1H54770899k20537j82331k14159k48611j76907j14083j96457k80321k19405j78039
$$ y = [865763307, 866009414, 865922213, 865681231, 865540028, 865404606, 865106344, 864805102, 864704132, 864656210, 864494681, 864364088, 864346802, 864243984, 864020109, 863906205, 863901973, 863769412, 863535643, 863376558, 863222122, 862980604, 862796366, 862791240, 862811267, 862695336, 862554908, 862495482, 862372458, 862122118, 861952126, 861925364, 861838996, 861650467, 861517787, 861424804, 861224771, 860982835, 860860348, 860771060, 860559821, 860325217, 860181153, 860019028, 859782457, 859618068, 859538436, 859351993, 859063506, 858852208, 858696163, 858465791, 858217418, 858056486, 857917309, 857698798, 857468903, 857312560, 857128739, 856858552, 856636405, 856500208, 856319249, 856092632, 855927944, 855767369, 855508089, 855261147, 855129004, 854991138, 854770899, 854550362, 854368031, 854153872, 853905261, 853728354, 853614271, 853417814, 853137493, 852918088, 852740049]
2545.5H52740049k41756k67029k03729j33991j62005k39253k33174j96993k26498k51770
2565.8H50583851k22802j93715k04563k36988k65896k80083k56538k23339k12073k15352
2586.2H48272502k40862k54273k69652l10123k96771k61188k72929k69354k47776k87533
2606.6H45562041l35336k99930k48611k49327k66134k72036l04282l51429l37004k88308
2627H42609644l00109l34621l01719k75135l17096l54469l59655l54826l61502l60906
2647.4H39289606l29972l20196l56316l69668l47913l65317l79741l38793l42011l89874
2667.8H35749805l72112l30925l49641l68774l60190l55900l81410m36604m18484l52323
2688.2H32023442l65675l96013l77476Tm03703m21583m22716m24147m40061m35054
$$ y = [852740049, 852498293, 852231264, 852027535, 851893544, 851731539, 851492286, 851259112, 851062119, 850835621, 850583851, 850361049, 850167334, 849962771, 849725783, 849459887, 849179804, 848923266, 848699927, 848487854, 848272502, 848031640, 847777367, 847507715, 847197592, 846900821, 846639633, 846366704, 846097350, 845849574, 845562041, 845226705, 844926775, 844678164, 844428837, 844162703, 843890667, 843586385, 843234956, 842897952, 842609644, 842309535, 841974914, 841673195, 841398060, 841080964, 840726495, 840366840, 840012014, 839650512, 839289606, 838959634, 838639438, 838283122, 837913454, 837565541, 837200224, 836820483, 836481690, 836139679, 835749805, 835377693, 835046768, 834697127, 834328353, 833968163, 833612263, 833230853, 832794249, 832375765, 832023442, 831657767, 831261754, 830884278, 830506802, 830103099, 829681516, 829258800, 828834653, 828394592, 827959538]
2708.6H27959538m15981m20213m46737m45425m21524m37081m39883l89158l96312m94062
2729H23653162n24939m27782l39210l42906l77476l76820l96312m32968l96669l64482
2749.4H19673598m44055n15699m34041l48032m24266m88758m11808l62277m36366m66943
2769.8H15341353l74913l67462n04971n60462n03898n23448n60880m64618l81649m88817
2790.2H10610235o27995o19113n67317n97775o63638o51718o28173o75976o78778o98089
2810.6H04201663p92802p96914p30455p36952q24928q94606r11772r59635j056194
2828.9G96497405j089871j075149j197219j435518j713276k090216k563357l040850
2845.3G82291949l264725k965630k142250j135886l41654R7931J33157j30535m46677
$$ y = [827959538, 827543557, 827123344, 826676607, 826231182, 825809658, 825372577, 824932694, 824543536, 824147224, 823653162, 823128223, 822700441, 822361231, 822018325, 821640849, 821264029, 820867717, 820434749, 820038080, 819673598, 819229543, 818713844, 818279803, 817931771, 817507505, 817018747, 816606939, 816244662, 815808296, 815341353, 814966440, 814598978, 814094007, 813533545, 813029647, 812506199, 811945319, 811480701, 811099052, 810610235, 809982240, 809363127, 808795810, 808198035, 807534397, 806882679, 806254506, 805578530, 804899752, 804201663, 803408861, 802611947, 801881492, 801144540, 800319612, 799425006, 798513234, 797553599, 796497405, 795407534, 794332385, 793135166, 791699648, 789986372, 787896156, 785332799, 782291949, 779027224, 776061594, 773919344, 772783458, 772441804, 772539735, 772672892, 772542357, 772095680]
2863.6G72095680p59601j040936j064658q16882o51717o40035n13315l55363m15384
2882G65837789n89073o99997p78675q99553r96888j020134j120567j330078j408159
2900.3G56994665j319111j321852j504660j734554k018869k464354k893865k932072
2916.6G40805328k482295j798451j097500m44591J02341M56869O24717Q13663J086413
2935G38066494J280487J421213J581371J589477J296699Q11160M12881K22623L4571
2953.4G46716976j05619N6565L66985O43432R06647J140058J353204J568854J764834
2971.7G54411936J803517J595080J410484J364529J164198Q46625P50720Q26359Q06391
2990.1G64979839O06835K95818J00195q583k08139l22461l23057l73483l53873k16543
$$ y = [772095680, 771336079, 770295143, 769230485, 768413603, 767761886, 767121851, 766608536, 766253173, 765837789, 765248716, 764548719, 763770044, 762870491, 761873603, 760853469, 759732902, 758402824, 756994665, 755675554, 754353702, 752849042, 751114488, 749095619, 746631265, 743737400, 740805328, 738323033, 736524582, 735427082, 734982491, 735084832, 735541701, 736166418, 736980081, 738066494, 739346981, 740768194, 742349565, 743939042, 745235741, 746046901, 746459782, 746682405, 746716976, 746611357, 746667922, 747034907, 747678339, 748584986, 749725044, 751078248, 752647102, 754411936, 756215453, 757810533, 759221017, 760585546, 761749744, 762596369, 763347089, 764173448, 764979839, 765586674, 765882492, 765982687, 765974104, 765765965, 765443504, 765120447, 764746964, 764393091, 764176548]
3010.5G64176548k32339m54307o39498p18951p74920p69258p44581p95901p65741o48677
3030.9G57632375n98550o81460q32796p96497o49154p03395r08911r97722q77380p83325
3051.3G49803185q77440r38713q97348q74281q15391o93262n56767n76556p93874q67486
3071.7G41912067o87361m70280l79265n02705p00295p56860p08521o32703o30021p65204
3092.1G35678852q14438o64890n56052o44207p90536q02994o80745o28709p62642q32796
3112.4G28500843p40766p43390q73744j055658j215219j205564j095116j050890j127481
3130.8G19393015j215279j170099j071870j109183j305342j447081j426816j323760
3147.1G09323585j157880j069188j293659j610279j649082j562714j545907j524746
$$ y = [764176548, 763944209, 763489902, 762850404, 762131453, 761356533, 760587275, 759842694, 759046793, 758281052, 757632375, 757033825, 756352365, 755519569, 754723072, 754073918, 753370523, 752461612, 751463890, 750586510, 749803185, 748925745, 747987032, 747089684, 746215403, 745400012, 744706750, 744149983, 743573427, 742779553, 741912067, 741224706, 740754426, 740375161, 739872456, 739172161, 738415301, 737706780, 737074077, 736444056, 735678852, 734864414, 734199524, 733643472, 732999265, 732208729, 731405735, 730724990, 730096281, 729333639, 728500843, 727760077, 727016687, 726142943, 725087285, 723872066, 722666502, 721571386, 720520496, 719393015, 718177736, 717007637, 715935767, 714826584, 713521242, 712074161, 710647345, 709323585, 708165705, 707096517, 705802858, 704192579, 702543497, 700980783, 699434876, 697910130]
3163.4F97910130j497328j532316j575351j551390j544356j596451j622558j589954
3179.8F85400426j559794j579284j597286j561164j580775j691997j729787j672864
3196.1F72427475j628696j589358j516819j497090j547814j538038j455545j429916
3212.4F60224199j486599j513600j468480j459360j546443j599848j527131j413941
3228.7F48208797j331747j319229j469374j656175j653313j529098j452148j420557
3245F36377156j418948j499713j554847j494228j408041j413047j517117j566410j473129
3263.4F23031676j342893j245260j190305j266539j393378j421034j387000j343191
3279.7F12442076j324475j322567j274824j162589j049518j033843j110196j217187
$$ y = [697910130, 696412802, 694880486, 693305135, 691753745, 690209389, 688612938, 686990380, 685400426, 683840632, 682261348, 680664062, 679102898, 677522123, 675830126, 674100339, 672427475, 670798779, 669209421, 667692602, 666195512, 664647698, 663109660, 661654115, 660224199, 658737600, 657224000, 655755520, 654296160, 652749717, 651149869, 649622738, 648208797, 646877050, 645557821, 644088447, 642432272, 640778959, 639249861, 637797713, 636377156, 634958208, 633458495, 631903648, 630409420, 629001379, 627588332, 626071215, 624504805, 623031676, 621688783, 620443523, 619253218, 617986679, 616593301, 615172267, 613785267, 612442076, 611117601, 609795034, 608520210, 607357621, 606308103, 605274260, 604164064, 602946877]
3296F02946877j336514j384497j296282j147449j146734j379072j617968j695693j662970
3314.4E90279698j645445j697779j764238j741111j707673j887203k102673k120971
3330.7E75612605k082527k018452j894772j947105k173722k298176k315640k231539
3347E58650672k056896k142608k475858k537489k302587k189636k295435k299368k047777
3365.4E38303018j910746k101481k376736k388537k113282j909316j871586j861512
3381.7E21769822j797855j604736j290739j045108j139640j476407j535178j152813
3398E10727346q84056j178920j536310j343906r48668q07345q33272r24170r80020
3416.3E01290679p94828n41359m50522l30925p4446J35183J45644K02716L59386K54631
$$ y = [602946877, 601610363, 600225866, 598929584, 597782135, 596635401, 595256329, 593638361, 591942668, 590279698, 588634253, 586936474, 585172236, 583431125, 581723452, 579836249, 577733576, 575612605, 573530078, 571511626, 569616854, 567669749, 565496027, 563197851, 560882211, 558650672, 556593776, 554451168, 551975310, 549437821, 547135234, 544945598, 542650163, 540350795, 538303018, 536392272, 534290791, 531914055, 529525518, 527412236, 525502920, 523631334, 521769822, 519971967, 518367231, 517076492, 516031384, 514891744, 513415337, 511880159, 510727346, 509843290, 508664370, 507128060, 505784154, 504835486, 504028141, 503194869, 502270699, 501290679, 500495851, 499954492, 499503970, 499173045, 499098599, 499233782, 499379426, 499582142, 499941528, 500196159]
3436.7E00196159J1325R9361M42147P05302Q51094Q89302R27388J012505J116812J330852
3457.1E07582247J497090J367927J341045J714229J961172J676321J230895J242161
3473.4E19613087J600743J885533J877725J664162J704037J969457J968562J853168
3489.8E34136474J967073K119004K192140K127826K066791K158582K073884J834095
3506.1E50675869J920640K303362K571345K457976K204418K205193K397239K653897
3522.4E69389939K627850K301216K292812K613783K813816K909005K909004K768338
3538.7E90625763K835989L012717L015041K892077K799273K861976L031790L101349
3555F14175975L113866L237546L251791K917528K800822L659487M261076L781677L473579
$$ y = [500196159, 500207484, 500306845, 500748992, 501454294, 502305388, 503194690, 504122078, 505134583, 506251395, 507582247, 509079337, 510447264, 511788309, 513502538, 515463710, 517140031, 518370926, 519613087, 521213830, 523099363, 524977088, 526641250, 528345287, 530314744, 532283306, 534136474, 536103547, 538222551, 540414691, 542542517, 544609308, 546767890, 548841774, 550675869, 552596509, 554899871, 557471216, 559929192, 562133610, 564338803, 566736042, 569389939, 572017789, 574319005, 576611817, 579225600, 582039416, 584948421, 587857425, 590625763, 593461752, 596474469, 599489510, 602381587, 605180860, 608042836, 611074626, 614175975, 617289841, 620527387, 623779178, 626696706, 629497528, 633157015, 637418091, 641199768, 644673347]
3573.4F44673347L656269L856301L971636L986061L762662L637076M046917M320800
3589.7F75911069L932595L823877M147172M299938M283488M225314L917575L592610
3606G08133638L829121M153908M077256L949284L667772L850877M528105M101098K989173
3624.4G43280232K382100L280878M536092L873467L241897L070712K871811K790869
3640.7G69328058K543926J963437J712679K729595L688753K801001K063453K404213
3657G89235115K451360J875282J464128J154006P22527P84695J291514R99927J079142
3675.4H01057696J829505J732230J441300J181245P83265O66618J030267J301288J190364
3693.7H12213778R53913O45221L86476N45502Q36551N49674j609p4685P04765J218498
$$ y = [644673347, 648329616, 652185917, 656157553, 660143614, 663906276, 667543352, 671590269, 675911069, 679843664, 683667541, 687814713, 692114651, 696398139, 700623453, 704541028, 708133638, 711962759, 716116667, 720193923, 724143207, 727810979, 731661856, 736189961, 740291059, 743280232, 745662332, 748943210, 753479302, 757352769, 760594666, 763665378, 766537189, 769328058, 771871984, 773835421, 775548100, 778277695, 781966448, 784767449, 786830902, 789235115, 791686475, 793561757, 795025885, 796179891, 796902418, 797687113, 798978627, 799978554, 801057696, 802887201, 804619431, 806060731, 807241976, 808025241, 808691859, 809722126, 811023414, 812213778, 813167691, 813812912, 814199388, 814744890, 815581441, 816131115, 816129506, 816054821, 816759586, 817978084]
3714.1H17978084P84934K36272j3470K4736J81913M09246M26828K39l04937R0897R34004
3736.5H20748746J010061Q8393o87897k61724L55959o199K48492J056969Q70049K98441
3756.9H23721290J98006M16696K77758N0962J7226Q3506L46958M20511J66595M5955
3777.3H25745463K15471K39074M9949P1347J76310K08259J49846j15454k99513k95699
3797.7H26145053l52144j7643L54767K23398M02987M81367O318m55976l58641j04964
3818.1H26324522r2864L88086N33879K11597M5895j29580j57953j01447k17199j13726
3838.5H26691210K76745M89354N02527J82151m65631j143098r35197P53820J147807
3856.9H27499688L85821j56999k95818m1962n7578k72035L9816M06861M33803O3002
$$ y = [817978084, 818763018, 818999290, 818985820, 819010556, 819192469, 819601715, 820028543, 820028782, 819723845, 819814742, 820748746, 821758807, 821847200, 821159303, 820897579, 821253538, 821247339, 821495831, 822552800, 823422849, 823721290, 823919296, 824335992, 824613750, 824664712, 824681938, 824765444, 825112402, 825532913, 825699508, 825745463, 825960934, 826200008, 826249957, 826321304, 826497614, 826705873, 826855719, 826740265, 826440752, 826145053, 825792909, 825775266, 826130033, 826353431, 826756418, 827237785, 827244103, 826788127, 826429486, 826324522, 826231658, 826619744, 827153623, 827365220, 827411115, 827281535, 827123582, 827022135, 826804936, 826691210, 826967955, 827457309, 827959836, 828141987, 827676356, 826533258, 825598061, 826351881, 827499688, 827885509, 827728510, 827432692, 827390730, 827333152, 827061117, 827100933, 827507794, 827941597, 828004599]
3877.3H28004599l39449r5844J67668J69098J47879q8036J4782L18170J2219m75049
3897.7H27836037n48899j91749L14117N63025L67165J33276L9697j54019k61962l7670
3918.1H28059018J40905K7835n3405M2557J550j04785M0472J93715Q6903p2539j46329
3940.5H28215897o5088M8935j9431j7464Q2850M7923J7225N9724P15q2492j6273N4002
3965H28326523L4035j073Q762K7775J2458K384q643K7716Q5116K5093p6532q6308n4776
3991.5H28322530l4213L7133Q7262
3997.6H28412712
$$ y = [828004599, 827665150, 827569306, 827736974, 827906072, 828053951, 827965915, 827980697, 828298867, 828311086, 827836037, 827287138, 827095389, 827409506, 827972531, 828339696, 828472972, 828512669, 828358650, 828096688, 828059018, 828199923, 828227758, 828174353, 828216910, 828218460, 828113675, 828154147, 828347862, 828434765, 828362226, 828215897, 828150809, 828199744, 828180313, 828162849, 828245699, 828293622, 828310847, 828370571, 828371286, 828288794, 828272521, 828326523, 828360558, 828359485, 828368247, 828396022, 828408480, 828410864, 828402221, 828429937, 828515053, 828540146, 828463614, 828377306, 828322530, 828288317, 828325450, 828412712]
##END=$$ End of the data block
