##TITLE=$$ Begin of the data block
##JCAMP-DX=5.00 $$ ACD/SpecManager v 10.08
##SPECTROMETER/DATA SYSTEM=Alpha
##DATE=11 Nov 2014 09:02:30
##DATA TYPE=INFRARED SPECTRUM
##DATA CLASS=XYDATA
##ORIGIN=
##OWNER=
##NPOINTS=1765
##FIRSTX=399.76428223
##LASTX=3997.64306641
##MAXX=3997.64306641
##MINX=399.76428223
##MAXY=0.76371998
##MINY=0.27674422
##XFACTOR=1.0000000000
##YFACTOR=1.000000000000000e-9
##FIRSTY=0.56543905
##DELTAX=2.03961372
##XUNITS=1/CM
##YUNITS=ARBITRARY UNITS
##XYDATA=(X++(Y..Y))
399.8 565439045 563849449 561336279 559667945 559766829 559244871 556700230 554583132 554552555 553854883
418.1 553854883 550134718 546920955 545373559 543625116 541662872 540960491 541279018 540739059 539170086
436.5 539170086 538529873 539021254 538459539 536545932 535438776 535239398 534353673 532781184 531850159
454.8 531850159 531323850 529636741 527333319 525907159 525213599 524095476 522342920 520802438 519785166
473.2 519785166 518808424 517603159 516568303 515846312 514933348 513572514 512151301 510970533 509747624
491.5 509747624 508312106 506913364 505625248 504174650 502263665 500028849 497751772 495315164
507.9 495315164 492654502 489890128 487091094 484300345 481504947 478632122 475736439 473126203
524.2 473126203 470924795 468851000 466726959 464781523 463342607 462334484 461671233 461929083 463601023
542.5 463601023 466060162 468214124 469738722 470929384 471768737 471845329 471283555 470948339 471259981
560.9 471259981 471736968 472004294 472287029 472550720 472223014 471388966 470880687 470853895 470720381 470226169
581.3 470226169 469931602 470227063 470313758 469642907 468947351 468789995 468605280 467914850 467290074 467096955
601.7 467096955 466487825 464836717 462843031 460995972 458273739 454302043 450987428 450255990 451752156
620 451752156 453976780 456649274 460207909 463880807 466336548 467818201 469436109 471035421 471861899
638.4 471861899 472400993 473805100 475939274 477623761 478856653 480729312 483131498 484621972 484836966
656.8 484836966 485073477 485724747 485763788 485051125 484832019 486556292 488646448 490111619 492172182
675.1 492172182 495256513 498111904 499895930 501505613 503741682 505708277 506505430 507006526 508140504
693.5 508140504 509176970 509267688 509354949 510825932 513173759 515008807 516537666 518822610 521608710
711.8 521608710 523765504 525386512 527790904 531153142 534242630 536833346 540010691 543817699
728.1 543817699 546898425 548842549 550833344 553313911 555166662 555982947 556930184 558682919 560177922
746.5 560177922 560648918 561073124 562235594 563162625 562932789 562470376 562977612 563920259 564215958 564436257
766.9 564436257 565767705 567835689 569380581 570532441 572555721 575470209 578094184 580297232
783.2 580297232 583100319 586564422 589478672 591373742 593327820 595901310 597950935 598759949 599380314
801.6 599380314 600554287 601451218 601563871 601954162 603539348 605391085 606212020 606009662 604648888
819.9 604648888 600587785 594517350 591242850 593146741 596946478 599849880 603206456 608567595
836.2 608567595 614732683 619773865 623113930 625436068 627268851 628075063 627639890 627267361 628300250
854.6 628300250 630457520 632710218 634892642 637283981 639377713 640484035 641008854 641682208 642076731
873 642076731 641297519 639580190 637792826 635679901 632291257 628001571 624232888 621426165 618891239
891.3 618891239 616532981 615324259 615652263 616569221 617245257 617856801 618533611 618557453 617430687
909.7 617430687 615909100 614887655 614073336 612884879 611798584 611604571 611964643 611881316 611222148
928 611222148 610506475 609372497 606800020 602733552 597925603 592387974 585390091 576964438 568280578
946.4 568280578 560282409 552988946 546465755 541401565 538029671 535413742 532650352 529883027
962.7 529883027 527386665 524451137 520188451 514791846 508826911 501898050 493241310 483163804
979 483163804 472727120 462499142 452466875 442965269 434768498 428003520 421876729 415704817
995.3 415704817 409435809 402969778 395949095 388542861 381609499 375730455 370650172 365965456
1011.6 365965456 361813366 358452946 355674982 353164285 351071239 349735677 349036187 348516911 348146707
1030 348146707 348336935 349124610 350062698 350830466 351340741 351387829 350730628 349567473 348457694 347685248
1050.4 347685248 347013235 346201986 345474988 345142603 345055997 344892889 344660997 344505578 344281524 343788296
1070.8 343788296 343362540 343736559 345249534 347569853 350317359 353406399 356456727 358634323 359539062
1089.2 359539062 359493196 358759254 357209295 354967445 352705657 350957453 349780947 349326432 350175917
1107.5 350175917 352668226 356339186 360558301 365198106 370208234 375072360 379300624 383138835
1123.8 383138835 387157947 391338050 395218700 398615360 401585340 403923750 405155241 405266941
1140.1 405266941 405064613 405276775 405959189 407221824 409577906 413212061 417631626 422461003 428051770
1158.5 428051770 434837967 442683995 451457471 461620390 473512232 486433804 499288708 511799514
1174.8 511799514 524100006 535616815 545401812 553361058 560055614 565370560 568594277 569783449
1191.1 569783449 569752097 568743706 566402078 563123047 560140431 557977378 556085527 554121375 552405655
1209.5 552405655 550827026 548525393 545112193 541143298 537108660 532791317 528052390 523411274
1225.8 523411274 519334495 515601575 511981785 508898437 506774902 505282879 503966331 503040612
1242.1 503040612 502869904 503246844 503653526 504003942 504544795 505184650 505580127 505854189 506489396 507503092
1262.5 507503092 508488953 509359658 510392964 511508703 512229085 512323856 511986315 511333048 510274529
1280.9 510274529 508955836 507751465 506698489 505310178 503239870 500645936 497661948 494001836
1297.2 494001836 489492595 484406650 479076803 473501772 467558593 461530685 455820292 450500190
1313.5 450500190 445580572 441211432 437480748 434313715 431384921 428406447 425329000 422107697
1329.8 422107697 418698341 415293068 412149251 409081340 405800134 402593374 399838746 397495985
1346.2 397495985 395481855 393860936 392778903 392132431 391572207 390954852 390229166 389077127 387259543
1364.5 387259543 384957850 382155269 378931671 375072122 370109260 364262611 355863452 341153324
1380.8 341153324 324062735 318387628 329131842 343090206 349962980 352267206 352782696 352433234
1397.1 352433234 351668119 351012737 350896597 351168811 351613909 352376640 353611290 355292618 357453406
1415.5 357453406 360279560 363832384 367523879 371532798 376005471 380570799 384934008 388562262
1431.8 388562262 391674221 395160943 398793995 401793540 404631793 407548875 410553277 413499504
1448.1 413499504 416184992 418938071 422319502 427083701 432510018 436812937 441095859 446280658
1464.5 446280658 451649159 456955284 463612676 472548604 481214255 487957865 493680060 498603374
1480.8 498603374 502377331 504845619 506308496 506271660 504137993 501213193 498028994 493558347 488041162
1499.1 488041162 482901454 478864968 474780977 468072057 461391509 456443846 452169806 448432982
1515.4 448432982 445425093 443616658 442238897 440384448 438181788 435640693 433467984 431540549
1531.8 431540549 428918451 426590472 425289035 423443258 420546144 418289751 416917026 416367173
1548.1 416367173 416287541 416589886 417482704 418878704 419782490 418884635 417917579 417162597 416010529
1566.4 416010529 414041221 411101282 408393443 405503482 400682688 395552874 391163826 386394024
1582.8 386394024 381104350 375657707 370303273 364996940 359770507 354817510 350433916 346553415
1599.1 346553415 342842638 339261234 336039424 333085626 329999179 326949388 324393243 321859837
1615.4 321859837 318560869 315716684 313430578 310709745 307800204 304948300 302260399 300380141
1631.7 300380141 299010873 297020346 295112222 294197887 293895990 293938994 294049352 294141650 294569224
1650.1 294569224 295047373 295034111 295482308 296645224 298368543 300591141 303292036 306351572 310102850
1668.4 310102850 314505100 318919808 324130595 330212295 336231411 342489332 350269258 360536247
1684.7 360536247 369902521 378417462 388064444 397916168 409078479 421385020 433370024 446318358
1701.1 446318358 456737012 465451002 474285841 481997252 488612771 494482905 499969184 505218565
1717.4 505218565 509251714 512241066 515189052 518358409 521446943 524328470 527107120 530126989
1733.7 530126989 533025205 535722077 539042115 543240428 548012376 553166687 558843613 565396428
1750 565396428 572259605 578569233 585015357 591777623 597797394 603006721 608108819 613913476 620533288
1768.4 620533288 627135754 632977307 637747049 641900659 645816684 649337649 652551830 655828238
1784.7 655828238 659035206 661963463 664812982 667699635 670234561 672417164 674610436 676988721
1801 676988721 679228485 681081474 682898283 685016394 687193274 688928127 690420449 692119956 694035769
1819.4 694035769 695827901 697416186 699079394 700895071 702468157 703528702 704652548 706152260
1835.7 706152260 707630396 708854556 710181296 711731851 713012934 713838398 714641213 715777516 717001081
1854 717001081 717973948 718836784 719921470 721129894 722191215 723182380 724188149 725020826 725623071
1872.4 725623071 726187706 726931870 727879822 728699088 729295611 729999542 730963886 731828749 732324719 732859194
1892.8 732859194 733644068 734351516 734826922 735357225 736127436 736915410 737479031 737938702 738506258 739118934
1913.2 739118934 739663184 740139782 740682721 741278112 741635144 741788566 742134988 742664158 743067265 743316770
1933.6 743316770 743653417 744176447 744664371 744933486 745098531 745345414 745564103 745670438 745846212 746176362
1954 746176362 746487916 746645987 746796548 747075379 747403800 747599900 747685015 747852445 748070478 748187482
1974.4 748187482 748259783 748439968 748662055 748775303 748827279 748988211 749239981 749391317 749360681 749350667
1994.8 749350667 749493122 749601543 749584377 749577284 749655008 749688447 749624670 749586523 749639094 749683499 749601483
2017.2 749601483 749452472 749333918 749214709 749047875 748909414 748851240 748802185 748695791 748599172 748574972
2037.6 748574972 748540342 748434067 748346984 748355508 748358071 748281717 748220325 748256862 748274922 748151779 747986317
2060 747986317 747935593 747946382 747880042 747838557 747926176 748034418 748057306 748066545 748155296 748259008 748278141 748283625
2084.5 748283625 748414397 748600483 748677731 748689473 748814166 749020100 749160409 749261916 749435902 749671280
2104.9 749671280 749845982 749920964 750008762 750192761 750383914 750523627 750691533 750909328 751066327 751124203
2125.3 751124203 751218736 751458645 751730204 751882255 752031744 752289057 752516448 752630234 752753913 752985656
2145.7 752985656 753260672 753482878 753667653 753928006 754256427 754504740 754677415 754940093 755300522 755607784
2166.1 755607784 755841374 756137848 756518364 756812990 756988585 757235706 757589519 757876158 758055806 758256018
2186.5 758256018 758566558 758882880 759068549 759233117 759512722 759801388 759957314 760075748 760309279 760566294
2206.9 760566294 760694683 760783613 760973752 761217654 761394918 761499226 761662245 761913240 762091041 762145579
2227.3 762145579 762235224 762413740 762551367 762602627 762695849 762905538 763073504 763089955 763107777 763234735
2247.7 763234735 763336957 763329864 763347149 763484836 763628542 763638973 763587654 763621032 763712645 763719976 763639092
2270.1 763639092 763609946 763669014 763697505 763621986 763570487 763623834 763617575 763461530 763304591 763191164 763013899
2292.5 763013899 762779653 762563705 762403250 762222767 761911154 761553526 761285007 760987461 760526299 760020077
2312.9 760020077 759612381 759199977 758572757 757812381 757232666 756860793 756370544 755706608 755163193 754785955
2333.3 754785955 754320443 753709495 753189087 752887368 752775609 752936125 753234565 753107607 752226293 750824928
2353.7 750824928 749446094 748402417 747695506 747282565 747124374 747164071 747367620 747683108 748020589
2372.1 748020589 748290658 748528838 748760641 748882771 748786032 748415530 747749627 746827066 745725930 744509816
2392.5 744509816 743285298 742268622 741630852 741347730 741251111 741162419 741017938 740817130 740525961 740089059
2412.9 740089059 739526093 738926768 738317609 737597764 736649394 735666096 735094070 734999239 734959483 734705389
2433.3 734705389 734344721 733989537 733565867 733028829 732484162 731987596 731467843 730872452 730239689 729622483
2453.7 729622483 729001701 728345871 727696955 727078199 726419568 725639224 724769294 723957419 723247886 722500265
2474.1 722500265 721631467 720774710 720010400 719218791 718367755 717570186 716826916 716019869 715150833 714353561
2494.5 714353561 713668048 712954640 712127507 711299956 710585654 709910631 709142387 708350122 707661450 706999362
2514.9 706999362 706223428 705385566 704658449 704028249 703324854 702538133 701816738 701168358 700458229 699676275
2535.3 699676275 698933065 698233426 697462022 696604550 695793867 695100963 694408178 693595886 692752779 692015469
2555.6 692015469 691297650 690435767 689508736 688698173 687945783 687086761 686169505 685326755 684530139 683654904
2576 683654904 682682455 681751847 680907547 679992199 678958178 677959263 677065432 676148713 675112903 674093246
2596.4 674093246 673207164 672326267 671313465 670255423 669309437 668437183 667488754 666462719 665505648
2614.8 665505648 664639890 663713634 662700713 661744893 660883904 659979701 658971190 658009768 657171369
2633.2 657171369 656280458 655247986 654251814 653411388 652576685 651599467 650592864 649715781 648878038
2651.5 648878038 647924483 646936238 646043062 645163298 644164026 643107474 642149866 641259491 640279293
2669.9 640279293 639186680 638118386 637150645 636142313 635012984 633939326 632966399 631902218 630709291
2688.2 630709291 629569232 628563523 627521694 626315892 625100017 623999715 622871339 621615171
2704.5 621615171 620362401 619202673 618021965 616703033 615339875 614110112 612966776 611698627
2720.9 611698627 610324740 609032214 607830822 606615484 605383933 604239464 603199244 602168798
2737.2 602168798 601115167 600097477 599142611 598162353 597102225 596062124 595119357 594185352 593151510
2755.5 593151510 592067480 591034234 590013027 588922858 587836862 586862087 585907578 584799945 583576858
2773.9 583576858 582430303 581368208 580228031 578994572 577784538 576601565 575324416 573929548
2790.2 573929548 572562993 571259141 569881737 568390310 566876769 565411985 563916922 562274754
2806.5 562274754 560563087 558925033 557309508 555578351 553765059 551951706 550059199 548016548
2822.8 548016548 545901656 543809235 541676521 539346337 536823750 534211397 531431317 528286219
2839.1 528286219 524642229 520399332 515481770 510125875 505211532 501743376 499888808 499007255
2855.5 499007255 498394459 497669816 496638805 495135397 493117303 490764201 488402903 486311466 484593779
2873.8 484593779 483257949 482255846 481407493 480486304 479393125 478172809 476857692 475404769 473786473
2892.2 473786473 472019166 470156938 468243271 466248661 464132071 461877674 459425956 456635326
2908.5 456635326 453337222 449478060 445258617 441198558 437837005 435340881 433622897 432552516
2924.8 432552516 432000816 431881785 432130337 432714641 433632404 434891284 436472476 438220143 439919353
2943.2 439919353 441435277 442676991 443564236 444057912 444233239 444305569 444534570 445079118 445995271
2961.5 445995271 447321266 449032098 451029390 453219742 455538481 457891613 460153669 462262690
2977.8 462262690 464208454 465970635 467530608 468883306 470044374 471023113 471742123 472138077 472245753
2996.2 472245753 472055107 471598715 470969319 470166773 469218880 468230993 467218548 466109961 464949071
3014.5 464949071 463810742 462642461 461375207 460008204 458590001 457159996 455730915 454308659
3030.9 454308659 452896118 451479077 450058967 448657185 447244555 445811361 444386750 442929566
3047.2 442929566 441422909 439961493 438570231 437179416 435782641 434432924 433152616 431913435
3063.5 431913435 430700094 429558665 428514540 427508593 426495641 425529927 424645692 423749119 422773629
3081.9 422773629 421788961 420896679 420074403 419199556 418266594 417355120 416461200 415542036 414580137 413582802
3102.2 413582802 412564427 411522716 410446346 409346253 408252448 407151729 405988008 404730260
3118.6 404730260 403412759 402089924 400767028 399421602 398052841 396652311 395205975 393760264
3134.9 393760264 392335802 390896797 389401138 387848884 386307389 384793252 383272588 381711900
3151.2 381711900 380110621 378517956 376962602 375398874 373791099 372193515 370600581 368965715
3167.5 368965715 367346913 365804613 364300400 362765670 361214519 359707385 358211309 356692523
3183.8 356692523 355196923 353767037 352423429 351129144 349843293 348577112 347319126 346069515
3200.1 346069515 344875574 343763679 342711836 341657698 340574622 339492381 338463783 337529242
3216.5 337529242 336619556 335654795 334672898 333713800 332755983 331796378 330837607 329870760 328882575 327843904
3236.9 327843904 326765090 325667888 324559212 323447526 322310358 321149051 320006490 318868220
3253.2 318868220 317679167 316461235 315256387 314018011 312731653 311481357 310304731 309149623
3269.5 309149623 308009267 306914747 305831313 304762870 303783745 302907437 302077144 301277250 300563008
3287.8 300563008 299941659 299358666 298796803 298244238 297713339 297236025 296765596 296292663 295866489 295447171
3308.2 295447171 294957370 294419289 293872386 293334991 292829782 292274326 291622519 290948063 290260792 289555341
3328.6 289555341 288864493 288193345 287551522 286928535 286320210 285729617 285143703 284566104 284008771 283503413
3349 283503413 283019483 282511681 282023519 281615674 281301200 281011969 280679107 280333906 280029625 279764861
3369.4 279764861 279468656 279120505 278813928 278553963 278266191 277971536 277784824 277711570 277642846 277552128
3389.8 277552128 277427167 277231902 277057499 277032793 277082771 277012497 276832372 276744217 276790768 276911199
3410.2 276911199 277047247 277142376 277273327 277520269 277790755 278028488 278385282 278917044 279491901 280017585
3430.6 280017585 280580699 281225681 281834871 282374382 282957375 283685446 284512281 285331279 286160797 287100613
3451 287100613 288107842 289146155 290267825 291471243 292677850 293877542 295181632 296554714 297826916
3469.4 297826916 298991144 300223380 301588148 303082138 304640681 306086987 307482064 309035629
3485.7 309035629 310659736 312206179 313784003 315496355 317277372 319024444 320791364 322567314
3502 322567314 324244320 325922787 327738315 329643756 331567049 333460689 335321575 337271959 339404255
3520.4 339404255 341670781 343854219 345912933 347987682 350152254 352457225 354893178 357343018
3536.7 357343018 359752834 362300336 365034670 367757082 370323747 372872889 375540048 378331035
3553 378331035 381184697 384067625 387065649 390195340 393409699 396728396 400176346 403494984 406636864
3571.3 406636864 409883797 413359672 416994929 420765340 424645722 428544670 432418585 436254740
3587.7 436254740 440085828 443930328 447922170 452080190 456287086 460477024 464683473 469015896
3604 469015896 473464459 477979422 482457966 486950278 491548151 496107757 500638664 505239308 509739399
3622.3 509739399 514271855 519004762 523908615 528745532 533304811 537845910 542391300 546962202
3638.7 546962202 551696897 556513488 561323225 566258609 571208835 575566888 579447627 583384871
3655 583384871 587503850 591443837 595107615 598679900 602332294 606059611 609715819 613290787 616603136
3673.3 616603136 619347095 621648371 623927653 626280844 628858626 631705344 634430707 636392117
3689.6 636392117 637800813 639336050 641045570 642795980 644451916 645864725 647240341 648905337
3706 648905337 650741100 652327418 653310776 654130459 655196905 656421602 657666028 658764005 659603953
3724.3 659603953 660280883 661207139 662571490 664138913 665246427 665571630 665992081 667015374 668048620
3742.7 668048620 668614209 669423580 670443296 670757890 670689583 671212792 672075391 672665775 673086464 673725843
3763.1 673725843 674420953 674968839 675366342 675686359 676075280 676663816 677440107 678013444 678324878 678692818
3783.5 678692818 679087400 679512024 680015981 680599928 681312740 682025671 682704568 683238029 683388591 683687925
3803.9 683687925 684090972 684125066 684269309 684878528 685564458 685980916 686499417 686874211 686729074 686748505
3824.3 686748505 687043488 687449515 687929630 688449562 689111590 689580500 689571202 689531982 689522624 689467549 689767063
3846.7 689767063 690625608 691550136 691410124 690552115 690626085 691188872 691706896 692029893 692167759 692359626
3867.1 692359626 692466795 692410409 692368567 692412078 692753196 693156958 693407834 693608046 693495274 693411529
3887.5 693411529 693702519 693819404 693733931 693978071 694496036 694847107 694788635 694408178 694035292 693910062
3907.9 693910062 693925500 694068730 694392562 694643140 694613039 694532275 694583356 694619954 694625616 694795668 695029080
3930.3 695029080 695055664 694896221 694745719 694743633 694866836 694948316 695002019 695134938 695232868 695135951 694948614
3952.7 694948614 694893122 694992721 695132434 695166826 695097327 695132136 695294917 695434213 695497930 695493400 695449829
3975.2 695449829 695437193 695493102 695608199 695730865 695783854 695768714 695767343 695810735 695878029 695940614 695974529
3997.6 695974529
##END=$$ End of the data block
