##TITLE=$$ Begin of the data block
##JCAMP-DX=5.00 $$ ACD/SpecManager v 10.08
##SPECTROMETER/DATA SYSTEM=Alpha
##DATE=11 Nov 2014 09:02:30
##DATA TYPE=INFRARED SPECTRUM
##DATA CLASS=XYDATA
##ORIGIN=
##OWNER=
##NPOINTS=1765
##FIRSTX=399.76428223
##LASTX=3997.64306641
##MAXX=3997.64306641
##MINX=399.76428223
##MAXY=0.76454765
##MINY=0.27552623
##XFACTOR=1.0000000000
##YFACTOR=1.000000000000000e-9
##FIRSTY=0.56541085
##DELTAX=2.03961372
##XUNITS=1/CM
##YUNITS=ARBITRARY UNITS
##XYDATA=(X++(Y..Y))
399.8E65410852r99152k813041k210677o38962j163185k530992j629054L58343m27723
$$ 565410852 564411700 561598659 559387982 558749020 557585835 555054843 553425789 553784132 553356409
418.1E53356409l459990l179729j778245k145767k314866p18057O81698j84059j511156
$$ 553356409 549896419 546716690 544938445 542792678 540477812 539759755 540441453 540257394 538746238
436.5E38746238q51751P4923q38577j684010p37250L3021p50363j689017j238286p33793
$$ 538746238 537894487 537969410 537130833 535446823 534709573 534742594 533992231 532303214 531064928 530331135
456.9E30331135j737356k242566j202702m58121j128137j979113j512587o87182j000166
$$ 530331135 528593779 526351213 525148511 524690390 523562253 521583140 520070553 519383371 518383205
475.2E18383205j468241j073063n27739p60854j464962j465858r65476j023769j442432
$$ 518383205 516914964 515841901 515314162 514553308 513088346 511622488 510657012 509633243 508190811
493.6E08190811j533330j440882j533866j889229k205819k292156k469778k685756
$$ 508190811 506657481 505216599 503682733 501793504 499587685 497295529 494825751 492139995
509.9D92139995k723187k754837k914340k933651k748847k630830k494275k357215
$$ 492139995 489416808 486661971 483747631 480813980 478065133 475434303 472940028 470582813
526.2D70582813k322853k223134j912444j485229j102298n88120L80576J663387K481729
$$ 470582813 468259960 466036826 464124382 462639153 461536855 460948735 461329311 462992698 465474427
544.6D65474427K314061J603722J082719P04586Q077o20962l82423K70188K96205O3181
$$ 465474427 467788488 469392210 470474929 471179515 471187592 470566630 470184207 470454395 470750600 470813781
565D70813781L41415M66943j64538p01875m08947J22428q6248o14584k64734L60489
$$ 470813781 471155196 471622139 471457601 470755726 470346779 470469207 470382959 469768375 469503641 469864130
585.4D69864130l7402p37697n80847r0987k21639o77526o30737k73585o03020j580149
$$ 469864130 469826728 469089031 468508184 468417197 468195558 467518032 466887295 466613710 466010690 464430541
605.8D64430541j975060j858443k758473l989249l270269p15822J454026K198785K618313
$$ 464430541 462455481 460597038 457838565 453849316 450579047 449863225 451317251 453516036 456134349
624.1D56134349L483892L719657K559483J459927J509726J601934R48608O37829J377225
$$ 456134349 459618241 463337898 465897381 467357308 468867034 470468968 471417576 472055405 473432630
642.5D73432630K007634J642197J302272J876354K268732J408309K91019K41340N55038
$$ 473432630 475440264 477082461 478384733 480261087 482529819 483938128 484229147 484470487 485025525
660.8D85025525P6622n54800n7876J801222K048224J410246J988769K979964K793938
$$ 485025525 485102147 484547347 484489471 486290693 488338917 489749163 491737932 494717896 497511834
679.2D97511834J794755J667112K300859K020299Q23617M39465J034975J013399J26421
$$ 497511834 499306589 500973701 503274560 505294859 506118476 506557941 507592916 508606315 508732736
697.5E08732736J12712J469791K336204J839400J564860K310872K744437K085447J611054
$$ 508732736 508845448 510315239 512651443 514490843 516055703 518366575 521111012 523196459 524807513
715.9E24807513K430856L373146L106713K612651L226101L881574L116607J896441
$$ 524807513 527238369 530611515 533718228 536330879 539556980 543438554 546555161 548451602
732.2E48451602J869321K398193J866162Q42154R65595J819313J573980M72724L66509
$$ 548451602 550320923 552719116 554585278 555427432 556393027 558212340 559786320 560259044 560625553
750.6E60625553J119256R11594k50221m89354N25475J014530L84927K71499J352370
$$ 560625553 561744809 562656403 562406182 561916828 562442303 563456833 563841760 564113259 565465629
768.9E65465629K105177J526653J063526J939952K892435K653003K205670K797663
$$ 565465629 567570806 569097459 570160985 572100937 574993372 577646375 579852045 582649708
785.3E82649708L492355K954960J927674J968801K534807J988649Q21590O70672J195311
$$ 582649708 586142063 589097023 591024697 592993498 595528305 597516954 598338544 599009216 600204527
803.6F00204527R15885J55866M28319J592517J835108P75159k52784j368344m046201
$$ 600204527 601120412 601276278 601704597 603297114 605132222 605907381 605654597 604286253 600240052
822F00240052o095708l319621J918555L862679K971828L428995N413294O183743N026341
$$ 600240052 594144344 590824723 592743278 596605957 599577785 603006780 608420074 614603817 619630158
840.3F19630158L298402K267957J761853P09892n21660l45469J177967K253830K225518
$$ 619630158 622928560 625196517 626958370 627668262 627146602 626801133 627979100 630232930 632458448
858.7F32458448K164126K445459K156615J127005M92752O59883M09960p99834j768053
$$ 632458448 634622574 637068033 639224648 640351653 640844405 641504288 641914248 641114414 639346361
877F39346361j876294k213657l352046m143536l699780k823174k537668k329349j226664
$$ 639346361 637470067 635256410 631904364 627760828 624061048 621237874 618700206 616370857 615144193
895.4F15144193K53976Q59797O47604O32525P55310P3373j126230j530349j064003
$$ 615144193 615398169 616257966 616905570 617538095 618293405 618366778 617240548 615710199 614646196
913.7F14646196q62956j210868j101017j89781L57508j00612o52433p01904j109898
$$ 614646196 613783240 612572372 611471355 611281574 611639082 611538470 610886037 610184133 609074235
932.1F09074235k530396m082441m878343n575180o977379q384108q645535p947922
$$ 609074235 606543839 602461398 597583055 592007875 585030496 576646388 568000853 560052931
948.4E60052931p266223o532967n075276l366888k582311k721131k757967k551078
$$ 560052931 552786708 546253741 541178465 537811577 535229266 532508135 529750168 527199090
964.7E27199090l007055m257500n357087o010234o997287q607000r951234j0367573
$$ 527199090 524192035 519934535 514577448 508567214 501569927 492962927 483011693 472644120
981.1D72644120j0266512j0085643r486109q205413o845594o166369o126105o208450
$$ 472644120 462377608 452291965 442805856 434600443 427754849 421588480 415462375 409253925
997.4D09253925o406695o942391p363498o949365n899161n098164m709423m154503
$$ 409253925 402847230 395904839 388541341 381591976 375692815 370594651 365885228 361730725
1013.7C61730725l334403k751798k534658k171576j399219o98268m63039l20315J83850
$$ 361730725 358396322 355644524 353109866 350938290 349539071 348840803 348377764 348057449 348241299
1032C48241299P79331R47148P34567M65960K9981o77437j211494j131535o87569n81354
$$ 348241299 349020630 349967778 350702345 351168305 351198286 350520849 349309355 348177820 347490251 346908897
1052.4C46908897q09073p11263k82585q5533j98126k47180j18911j69218m83215m28080
$$ 346908897 346099824 345388561 345105976 345020443 344822317 344575137 344456226 344287008 343803793 343375713
1072.8C43375713M04387J501441K244562K732158L112078K999127K124369R13858m0233
$$ 343375713 343780100 345281541 347526103 350258261 353370339 356369466 358493835 359407693 359367460
1091.2C59367460p37727j506716k175241k238989j765132j165629m00006Q76456K472013
$$ 359367460 358629733 357123017 354947776 352708787 350943655 349778026 349378020 350254476 352726489
1109.6C52726489L666580M232734M637480N013585M888505M245401L825843M006535
$$ 352726489 356393069 360625803 365263283 370276868 375165373 379410774 383236617 387243152
1125.9C87243152M189431L883452L385365K980023K344072J175106N9604j83671K58952
$$ 387243152 391432583 395316035 398701400 401681423 404025495 405200601 405260205 405076534 405335486
1144.2D05335486P02351J257777K354891L642439M445553M850209N591571O784439
$$ 405335486 406037837 407295614 409650505 413292944 417738497 422588706 428180277 434964716
1160.5D34964716P822633Q750141J0174692J1892229J2885570J2815476J2490481J2312055
$$ 434964716 442787349 451537490 461712182 473604411 486489981 499305457 511795938 524107993
1176.9E24107993J1553168R804845P952034O694675N336165L254533J202524o2704
$$ 524107993 535661161 545466006 553418040 560112715 565448880 568703413 569905937 569843233
1193.2E69843233j048863k323509l229379k973974k187073j903177j955986j725673
$$ 569843233 568794370 566470861 563241482 560267508 558080435 556177258 554221272 552495599
1209.5E52495599j617611k335250l424466l973186m055559m336715m741132m644990
$$ 552495599 550877988 548542738 545118272 541145086 537089527 532752812 528011680 523366690
1225.8E23366690m066408l678799l560543l088951k184808j538515j315057r06528
$$ 523366690 519300282 515621483 512060940 508971989 506787181 505248666 503933609 503027081
1242.1E03027081j63197L74198M09782L63886N40138O18338L69430K42114N83887R69529
$$ 503027081 502863884 503238082 503647864 504011750 504551888 505170226 505539656 505781770 506365657 507335186
1262.5E07335186J005828R24230J041114J094938P19845J13904l16619o56605j073063
$$ 507335186 508341014 509265244 510306358 511401296 512121141 512235045 511918426 511261821 510188758
1280.9E10188758j307428j201152j101494j449108k083957k581895l007710l703952
$$ 510188758 508881330 507680178 506578684 505129576 503045619 500463724 497456014 493752062
1297.2D93752062m508167n046845n331218n633920n974830o001859n687386n313933
$$ 493752062 489243895 484197050 478865832 473231912 467257082 461255223 455567837 450253904
1313.5D50253904m915804m372269l726035l171861k968192l013522l083199l204405
$$ 450253904 445338100 440965831 437239796 434067935 431099743 428086221 425003022 421798617
1329.8D21798617l376454l388197l145575l047914l249257l210873k789974k372146
$$ 421798617 418422163 415033966 411888391 408840477 405591220 402380347 399590373 397218227
1346.2C97218227k009660j594245j066387o25610n08189n56887o68495j082927j752377
$$ 397218227 395208567 393614322 392547935 391922325 391414136 390857249 390188754 389105827 387353450
1364.5C87353450k262294k758414l158301l794700m877120n715936q212150j4396637
$$ 387353450 385091156 382332742 379174441 375379741 370502621 364786685 356574535 342177898
1380.8C42177898j6725064n599200J0371923J3495922O629735K210051M71086l66122
$$ 342177898 325452834 319853634 330225557 343721479 350351214 352561265 353032351 352666229
1397.1C52666229p57456o74993j63823K38657M29213P42316J201362J658350K157986
$$ 352666229 351908773 351233780 351069957 351308614 351737827 352480143 353681505 355339855 357497841
1415.5C57497841K821744L547579L712803M011661M428535M533798M378170L650963
$$ 357497841 360319585 363867164 367579967 371591628 376020163 380553961 384932131 388583094
1431.8C88583094L122419L511131L638536K965241K801985K889931K999335K985836
$$ 388583094 391705513 395216644 398855180 401820421 404622406 407512337 410511672 413497508
1448.1D13497508K730935K736956L333658M723639N408465M338235M323959N189956
$$ 413497508 416228443 418965399 422299057 427022696 432431161 436769396 441093355 446283311
1464.5D46283311N342155N286813O653041Q923858Q661360O759107N729288M934847
$$ 446283311 451625466 456912279 463565320 472489178 481150538 487909645 493638933 498573780
1480.8D98573780L800750K472699J445472k7180k106488k941727l226400m479348n497814
$$ 498573780 502374530 504847229 506292701 506265521 504159033 501217306 497990906 493511558 488013744
1499.1D88013744n137592m059196m139036o775766o669253m900486m242777l736169
$$ 488013744 482876152 478816956 474677920 467902154 461232901 456332415 452089638 448353469
1515.4D48353469l053128j837314j328080j811058k223730k566755k162188j899987
$$ 448353469 445300341 443463027 442134947 440323889 438100159 435533404 433371216 431471229
1531.8D31471229k598614k304882j280367j848519k898782k248079j391441n87970
$$ 431471229 428872615 426567733 425287366 423438847 420540065 418291986 416900545 416312575
1548.1D16312575j06036K93284Q57979J342357Q90493q90613r82672p57604j142860
$$ 416312575 416206539 416499823 417357802 418700159 419590652 418700039 417717367 416959763 415816903
1566.4D15816903j965076k939552k724021k900064m797638n113303m390061m770518
$$ 415816903 413851827 410912275 408188254 405288190 400490552 395377249 390987188 386216670
1582.8C86216670n273223n420476n364746n342692n244434m967600m394501l855288
$$ 386216670 380943447 375522971 370158225 364815533 359571099 354603499 350208998 346353710
1599.1C46353710l679276l572464l221661k965420l104210l072262k580374k547920
$$ 346353710 342674434 339101970 335880309 332914889 329810679 326738417 324158043 321610123
1615.4C21610123l316313k853394k280891k712875k916455k884210k714067j888216
$$ 321610123 318293810 315440416 313159525 310446650 307530195 304645985 301931918 300043702
1631.7C00043702j373649j985251j912743r10759k62171Q2522J39982J28597M59224
$$ 300043702 298670053 296684802 294772059 293861300 293599129 293681651 293821633 293950230 294409454
1650.1B94409454N29379K8371M41015J188517J793861K254993K650797L013939L762930
$$ 294409454 294938833 294967204 295408219 296596736 298390597 300645590 303296387 306310326 310073256
1668.4C10073256M439861M425705N213737O114781O060451O280780P788748J0258257
$$ 310073256 314513117 318938822 324152559 330267340 336327791 342608571 350397319 360655576
1684.7C60655576R335667Q489102R652257R873092J1174649J2321323J2006790J2952894
$$ 360655576 369991243 378480345 388132602 398005694 409180343 421501666 433508456 446461350
1701.1D46461350J0416478Q742928Q872509P724136O642431N934835N550623N257904
$$ 446461350 456877828 465620756 474493265 482217401 488859832 494794667 500345290 505603194
1717.4E05603194M010439K998233K977848L186286L086328K890408K797365L015161
$$ 505603194 509613633 512611866 515589714 518776000 521862328 524752736 527550101 530565262
1733.7E30565262K897441K728045L361404M226208M774451N150020N680144O543279
$$ 530565262 533462703 536190748 539552152 543778360 548552811 553702831 559382975 565926254
1750E65926254O853103O322563O449282O754339O035149N249024N144238N825520O603062
$$ 565926254 572779357 579101920 585551202 592305541 598340690 603589714 608733952 614559472 621162534
1768.4F21162534O575882N843878M780948M174531L952920L534854L217220L301740
$$ 621162534 627738416 633582294 638363242 642537773 646490693 650025547 653242767 656544507
1784.7F56544507L209888K907515K864957K917468K530635K176761K194107K375245
$$ 656544507 659754395 662661910 665526867 668444335 670974970 673151731 675345838 677721083
1801F77721083K253890J880288J833141K112508K160013J722395J482010J691639J920462
$$ 677721083 679974973 681855261 683688402 685800910 687960923 689683318 691165328 692856967 694777429
1819.4F94777429J810670J594484J645446J812517J589239J054168J100898J491367
$$ 694777429 696588099 698182583 699828029 701640546 703229785 704283953 705384851 706876218
1835.7G06876218J482725J241267J347661J559079J275778Q09610P97331J152277J241624
$$ 706876218 708358943 709600210 710947871 712506950 713782728 714592338 715389669 716541946 717783570
1854G17783570R69351Q57114J096785J202345J046956R94861J001060Q06153N66244
$$ 717783570 718752921 719610035 720706820 721909165 722956121 723950982 724952042 725758195 726324439
1872.4G26324439N54502P70390R66549Q15868N92113P32601J022994Q79407M51446
$$ 726324439 726878941 727649331 728615880 729431748 730023861 730756462 731779456 732658863 733110309
1890.7G33110309N20527Q15928P17223M70817N25057P39813P60376N65291M71592N90443
$$ 733110309 733630836 734446764 735163987 735634804 736159861 736899674 737660050 738225341 738696933 739287376
1911.1G39287376O53148N67675M75049N37157N85735L46779J46330L46303N43296M13239
$$ 739287376 739940524 740508199 740983248 741520405 742106140 742452919 742599249 742945552 743488848 743902087
1931.5G43902087K27452K86698M68910M66525K92123J89542K58327K32875J22428J97351
$$ 743902087 744129539 744416237 744885147 745351672 745643795 745833337 746091664 746324539 746446967 746644318
1951.9G46644318L40879K87950J14143J21713K82049L41117K09689R5070J56224J99556
$$ 746644318 746985197 747273147 747387290 747509003 747791052 748132169 748341858 748436928 748593152 748792708
1972.3G48792708J11341Q7202K09510K45750J22547N0426J41084K34544J62363j6927
$$ 748792708 748904049 748991251 749200761 749446511 749569058 749619484 749760568 749995112 750157475 750140548
1992.7G50140548j4842J09017O3539j6690L8267J09553K4915q8454m6134O6102N5671
$$ 750140548 750125706 750234723 750298262 750281572 750319839 750429392 750454307 750365853 750319719 750385821 750441492
2015.2G50441492q7917j60337j16229r5784j45436j48117p6831n0068r8824q6725j8835
$$ 750441492 750353575 750193238 750077009 749981225 749835789 749687672 749610841 749560773 749461949 749375224 749356389
2037.6G49356389m4227j25467r9183P272K504p7844o8486K0623O617j06991j30892
$$ 749356389 749312162 749186695 749087512 749094784 749097288 749019444 748950958 748971581 748978198 748871207 748740315
2060G48740315m1365j490p7248p4923M6313J01983K8849K98R8944J42872M4584J7643
$$ 748740315 748698950 748697460 748620212 748545289 748591602 748693585 748722434 748722732 748821676 748964548 749009132 749026775
2084.5G49026775J51635J87933O1929J9789J41621K14100J50263R8944J63078K26259
$$ 749026775 749178410 749366343 749428272 749448061 749589682 749803782 749954045 750052989 750216067 750442326
2104.9G50442326J53959O8426J20401K17736J86920J04547J42574K33531J79768O0856
$$ 750442326 750596285 750664711 750785112 751002848 751189768 751294315 751436889 751670420 751850188 751911044
2125.3G51911044J10507K47181K29835R5606J27733K94685K95460J51873J19448K10106
$$ 751911044 752021551 752268732 752498567 752594173 752721906 753016591 753312051 753463924 753583372 753793478
2145.7G53793478K39968J79351J67131K81811L80337K95758J83821K52247L34263K69651
$$ 753793478 754033446 754212797 754379928 754661739 755042076 755337834 755521655 755773902 756108165 756377816
2166.1G56377816K06351K77460L64542L03149K14935K78532L63410K89321J66416K02954
$$ 756377816 756584167 756861627 757226169 757529318 757744253 758022785 758386195 758675516 758841932 759044886
2186.5G59044886L35872L05831J53303J54198K79247K82646J56343J35243K54333K81870
$$ 759044886 759380758 759686589 759839892 759994090 760273337 760555983 760712326 760847569 761101902 761383772
2206.9G61383772J49488P8738J68324K34067J72019J15335J78397K29954J52231P0810
$$ 761383772 761533260 761611998 761780322 762014389 762186408 762301743 762480140 762710094 762862325 762933135
2227.3G62933135J23382K00510J38819M0889Q6248K03192J71423L9398M3393J55151
$$ 762933135 763056517 763257027 763395846 763436735 763522983 763726175 763897598 763936996 763980389 764135540
2247.7G64135540J31726l994p689J04130J22666K38o3419K3425Q3685M410o8426Q166
$$ 764135540 764267266 764263272 764255583 764359713 764482379 764482617 764419198 764442623 764526308 764530718 764462292 764470458
2272.2G64470458P7188q523r9779l1292O3419j6689j67429j85252j42157j65045j99020
$$ 764470458 764547646 764539123 764439344 764408052 764471471 764454782 764287353 764102101 763959944 763794899 763595879
2294.6G63595879j98781j67191j91570l07143l44038k67386k87294m08590m45605l95596
$$ 763595879 763397098 763229907 763038337 762731194 762387156 762119770 761832476 761423886 760978281 760582685
2315G60582685m31776o26504p43031n90981m13239n16295o73354n51223l84629m32730
$$ 760582685 760150909 759524405 758781374 758190393 757777154 757260859 756587505 756036282 755651653 755218923
2335.4G55218923n29349m94480l21507r5070J69873K75851j52529r19222j450479j380325
$$ 755218923 754689574 754195094 753873587 753778517 753948390 754224241 754071712 753152490 751702011 750321686
2355.8G50321686r80556o33955l97384j87337J8775J83225K65658K81393K89917K90394
$$ 750321686 749341130 748707175 748309791 748122454 748141229 748324454 748590112 748871505 749161422 749451816
2376.2G49451816K08140M8875j42276l67224o63281r51349j126886j223683j227021
$$ 749451816 749659956 749708831 749566555 749199331 748536050 747584701 746457815 745234132 744007111
2394.5G44007111j021505o25968k57373q7797r4176j51693j82867k61665m47094n92709
$$ 744007111 742985606 742359638 742102265 742014468 741920292 741768599 741585732 741324067 740876973 740284264
2414.9G40284264o10828o07729p16746r37104r52602n58018j35661r0658k53260l21567
$$ 740284264 739673436 739065707 738348961 737411857 736459255 735901237 735765576 735674918 735421658 735100091
2435.3G35100091l51489m52340n21302m97937m75645n46277o46293o36756n82338o14047
$$ 735100091 734748602 734296262 733774960 733277023 732801378 732255101 731608808 730972052 730389714 729775667
2455.7G29775667o78778o89089o64592o72578p58708q53419q25167p35879p38680q26597
$$ 729775667 729096889 728407800 727743208 727070630 726311922 725458503 724633336 723897457 723158777 722332180
2476.1G22332180q57473p82370p58052q28684q41796q00610q20994q46088p78735o87182
$$ 722332180 721474707 720692337 719934285 719105601 718263805 717463195 716642201 715796113 715017378 714330196
2496.5G14330196p06732q09371q15332o98090o82950q13723q22246o91354o57320p70450
$$ 714330196 713623464 712814093 711998761 711300671 710617721 709803998 708981752 708290398 707633078 706862628
2516.9G06862628q44895p51853o61195p10249p59482p00772o63578p28727p68125p28667
$$ 706862628 706017733 705265880 704604685 703894436 703134954 702434182 701770604 701041877 700273752 699545085
2537.3F99545085o86764p42138q46684q16405o89446o86110q23795q85427p92980p42257
$$ 699545085 698858321 698116183 697269499 696453094 695763648 695077538 694253743 693368316 692575336 691833079
2557.7F91833079q23975q74221q00669p58469q62956r45569q61644p76351q68976r87649
$$ 691833079 691009104 690134883 689334214 688575745 687712789 686767220 685905576 685129225 684260249 683272600
2578.1F83272600r44733q62003r16838j029432j002848q95560r10759j009226r93133
$$ 683272600 682327867 681465864 680549026 679519594 678516746 677621186 676710427 675701201 674708068
2596.4F74708068q91804r09746j032591j046538r32813q97407r74715j015008r51409
$$ 674708068 673816264 672906518 671873927 670827389 669894576 668997169 668022454 667007446 666056037
2614.8F66056037q83043r37819j017452r58204q76784r31978r96113r19819q27789
$$ 666056037 665172994 664235175 663217723 662259519 661382735 660450757 659454644 658534825 657707036
2633.2F57707036r13859j060486r95695q30174q46565r67085r73463q81493q84771
$$ 657707036 656793177 655732691 654736996 653906822 653060257 652093172 651119709 650238216 649353445
2651.5F49353445j004875j025975r12845q59976r42826j017571r61780r20236j013696
$$ 649353445 648348570 647322595 646409750 645549774 644606948 643589377 642627597 641707361 640693665
2669.9F40693665j080633j021742r70603j067101j182378j100838r73046j008272j100302
$$ 640693665 639613032 638591290 637620687 636553586 635371208 634270370 633297324 632289052 631188750
2688.2F31188750j096904j043975j096309j222550j220644j113355j135707j262784
$$ 631188750 630091846 629047871 627951562 626729012 625508368 624395013 623259306 621996522
2704.5F21996522j270175j178324j169384j280844j347601j255632j184761j267791
$$ 621996522 620726347 619548023 618378639 617097795 615750194 614494562 613309801 612042010
2720.9F12042010j341283j285851j182795j168847j224220j178503j062393j041711
$$ 612042010 610700727 609414876 608232081 607063234 605839014 604660511 603598118 602556407
2737.2F02556407j072526j024007r40264r72330j062989j030624r30608r49561j073182
$$ 602556407 601483881 600459874 599519610 598547280 597484291 596453667 595523059 594573498 593500316
2755.5E93500316j115143j064301j043141j060009j052022r89556r61065j060486j175642
$$ 593500316 592385173 591320872 590277731 589217722 588165700 587176144 586215079 585154593 583978951
2773.9E83978951j153886j115501j194418j251757j190305j163959j270354j360774
$$ 583978951 582825065 581709564 580515146 579263389 578073084 576909125 575638771 574277997
2790.2E74277997j329362j300633j391113j515567j526118j460194j488090j620889
$$ 574277997 572948635 571648002 570256889 568741322 567215204 565755010 564266920 562646031
2806.5E62646031j708209j687288j675725j757026j817525j814723j873910k011240
$$ 562646031 560937822 559250534 557574809 555817783 554000258 552185535 550311625 548300385
2822.8E48300385k101659k124429k184689k327859k495528k619564k779126l126860
$$ 548300385 546198726 544074297 541889608 539561749 537066221 534446657 531667531 528540671
2839.1E28540671l657222m283965m940092n328357m883468l479422j872360q94606
$$ 528540671 524883449 520599484 515659392 510331035 505447567 501968145 500095785 499201179
2855.5D99201179o16491p14124j049608j547127k034158k336174k352000k092659j691848
$$ 499201179 498584688 497870564 496820956 495273829 493239671 490903497 488551497 486458838 484766990
2873.8D84766990j311690j018375q49992q81880j066268j227140j321018j440734j615554
$$ 484766990 483455300 482436925 481586933 480705053 479638785 478411645 477090627 475649893 474034339
2892.2D74034339j781225j867354j908421j993090k113015k260595k498269k854169
$$ 474034339 472253114 470385760 468477339 466484249 464371234 462110639 459612370 456758201
2908.5D56758201l307551l798932m159480m049033l373385k497881j715750j070320
$$ 456758201 453450650 449651718 445492238 441443205 438069820 435571939 433856189 432785869
2924.8D32785869n51880j32710K31386N76406R16034J247794J536310J718461J739293
$$ 432785869 432233989 432101279 432332665 432909071 433825105 435072899 436609209 438327670 440066963
2943.2D40066963J575381J262277Q87871N04106J77384O3509K12997N19424R22442
$$ 440066963 441642344 442904621 443792492 444296598 444473982 444537491 444750488 445269912 446192354
2961.5D46192354J352370J704424J983375K196133K332568K357781K247393K110034
$$ 446192354 447544724 449249148 451232523 453428656 455761224 458119005 460366398 462476432
2977.8D62476432J977921J784533J548261J341819J183778J016379P43300L77357N4389
$$ 462476432 464454353 466238886 467787147 469128966 470312744 471329123 472072423 472449780 472504169
2996.2D72504169k04951m32908o49751q51899r58741r68665r76800j050413j150131
$$ 472504169 472299218 471866310 471216559 470364660 469405919 468437254 467460454 466410041 465259910
3014.5D65259910j189471j187890j256854j359731j422524j474977j448273j361460
$$ 465259910 464070439 462882549 461625695 460265964 458843440 457368463 455920190 454558730
3030.9D54558730j338899j374900j437456j473516j444727j422644j444787j487314
$$ 454558730 453219831 451844931 450407475 448933959 447489232 446066588 444621801 443134487
3047.2D43134487j497597j442492j399159j411915j415491j362652j287251j228095
$$ 443134487 441636890 440194398 438795239 437383324 435967833 434605181 433317930 432089835
3063.5D32089835j175373j101345j049310j050651j023203r58801r14216r15408r63360
$$ 432089835 430914462 429813117 428763807 427713156 426689953 425731152 424816936 423901528 422938168
3081.9D22938168r82583r27507q56728q50409r05871r08882q92401r54598j012832
$$ 422938168 421955585 421028078 420171350 419320941 418415070 417506188 416613787 415659189 414646357
3100.2D14646357j017242j014680j020998j036584j084924j125336j152128j213133
$$ 414646357 413629115 412614435 411593437 410556853 409471929 408346593 407194465 405981332
3116.5D05981332j236021j242847j316964j368940j350463j342535j379847j436442
$$ 405981332 404745311 403502464 402185500 400816560 399466097 398123562 396743715 395307273
3132.8C95307273j463622j458973j483977j536071j554191j544744j530647j522392
$$ 395307273 393843651 392384678 390900701 389364630 387810439 386265695 384735048 383212656
3149.2C83212656j549125j587033j613170j611114j587331j586914j591951j575708
$$ 383212656 381663531 380076498 378463328 376852214 375264883 373677969 372086018 370510310
3165.5C70510310j579642j607836j604586j577944j552552j536727j528770j518637
$$ 370510310 368930668 367322832 365718246 364140302 362587750 361051023 359522253 358003616
3181.8C58003616j500010j484931j444429j346499j297712j298517j253664j227379
$$ 358003616 356503606 355018675 353574246 352227747 350930035 349631518 348377854 347150475
3198.1C47150475j235157j210690j170516j137018j119673j087517j026124r81837
$$ 347150475 345915318 344704628 343534112 342397094 341277421 340189904 339163780 338181943
3214.4C38181943r65834r70751r76205r54628r29206r48221r71854r63837r72300j026541
$$ 338181943 337216109 336245358 335269153 334314525 333385319 332437098 331465244 330501407 329529107 328502566
3234.8C28502566j074642j061589j056284j120507j176507j151919j117170j145839
$$ 328502566 327427924 326366335 325310051 324189544 323013037 321861118 320743948 319598109
3251.1C19598109j208514j238436j216143j213283j257151j262605j202584j165032
$$ 319598109 318389595 317151159 315935016 314721733 313464582 312201977 310999393 309834361
3267.5C09834361j148641j107782j080275j073897j057952r95875q84294q30382q29011
$$ 309834361 308685720 307577938 306497663 305423766 304365814 303369939 302485645 301655263 300826252
3285.8C00826252p52956o59317o30528o03735n41359m65513m05848m02391m54366m82410
$$ 300826252 300073296 299413979 298783451 298179716 297638357 297172844 296766996 296364605 295910239 295427829
3306.2B95427829m77761n04375n24252n26160n35309n43178n93125o56605o83934p10368
$$ 295427829 294950068 294445693 293921441 293395281 292859972 292316794 291723669 291067064 290383130 289672762
3326.6B89672762p23004p11739o99044o64979o48558o57230o27101n80877n53995n26369
$$ 289672762 288949758 288238019 287538975 286873996 286225438 285568208 284941107 284360230 283806235 283279866
3347B83279866n06669n03511n01513n02855m62472l85016l44038l28988l16322l41296
$$ 283279866 282773197 282269686 281768173 281265318 280802846 280417830 280073792 279744804 279428482 279087186
3367.4B79087186l63648l58552l45498k90305k50458k55794k48640k15590j85609j16110
$$ 279087186 278723538 278364986 278019488 277729183 277478725 277222931 276974291 276758701 276573092 276456982
3387.8B76456982j8597o3836k21312k36124r4921j4126o4194j31548q6098K7328J19686
$$ 276456982 276438385 276374549 276153237 275917113 275822192 275808066 275743872 275612324 275526226 275553554 275673240
3410.2B75673240J43081J19806J39117K00748K47240K76804L59297M67211N23865N21541
$$ 275673240 275816321 275936127 276075244 276275992 276523232 276800036 277159333 277626544 278150409 278671950
3430.6B78671950N89430O82891O10798M95583N34296O98895Q39382Q58337Q43107R17226
$$ 278671950 279261380 279944271 280555069 281050652 281584948 282283843 283123225 283981562 284824669 285741895
3451B85741895R84103J026720J131981J232922J192600J162589J306861J409918J329661
$$ 285741895 286725998 287752718 288884699 290117621 291310221 292472810 293779671 295189589 296519250
3469.4B96519250J216799J236707J337051J514137J605362J456558J387120J533299
$$ 296519250 297736049 298972756 300309807 301823944 303429306 304885864 306272984 307806283
3485.7C07806283J609683J577616J614511J702160J762688J741201J770526J822620
$$ 307806283 309415966 310993582 312608093 314310253 316072941 317814142 319584668 321407288
3502C21407288J722455J672894J822233J960934J998811J951308J859337J960873K208233
$$ 321407288 323129743 324802637 326624870 328585804 330584615 332535923 334395260 336356133 338564366
3520.4C38564366K309173K165318K002507K031029K219647K401769K484292K432018
$$ 338564366 340873539 343038857 345041364 347072393 349292040 351693809 354178101 356610119
3536.7C56610119K378226K581149K800345K762527K566307K526701K704889K853035
$$ 356610119 358988345 361569494 364369839 367132366 369698673 372225374 374930263 377783298
3553C77783298K876729K961636L108591L148853L183693L311724L433674L350020L301143
$$ 377783298 380660027 383621663 386730254 389879107 393062800 396374524 399808198 403158218 406459361
3571.3D06459361L412068L500760L558904L716111L903091L981590L969908L914416
$$ 406459361 409871429 413372189 416931093 420647204 424550295 428531885 432501793 436416209
3587.7D36416209L899961L900409M018545M205168M304140M278481M241705M315734
$$ 436416209 440316170 444216579 448235124 452440292 456744432 461022913 465264618 469580352
3604D69580352M430175M561544M621297M647195M632950M543245M599184M696726M512310
$$ 469580352 474010527 478572071 483193368 487840563 492473513 497016758 501615942 506312668 510824978
3622.3E10824978M489303M737198N060256N021334M582881M507840M572153M645348
$$ 510824978 515314281 520051479 525111735 530133069 534715950 539223790 543795943 548441291
3638.7E48441291M806042M887938M872382M931032M918874M408538L920198L901839
$$ 548441291 553247333 558135271 563007653 567938685 572857559 577266097 581186295 585088134
3655E85088134M101336L983736L684401L570736L728628L850818L663480L440559L236770
$$ 585088134 589189470 593173206 596857607 600428343 604156971 608007789 611671269 615111828 618348598
3673.3F18348598K817572K379954K265334K336442K598524K845526K711713K015114
$$ 618348598 621166170 623546124 625811458 628147900 630746424 633591950 636303663 638318777
3689.6F38318777J463711J529813J680494J757264J695633J421570J372099J681924
$$ 638318777 639782488 641312301 642992795 644750059 646445692 647867262 649239361 650921285
3706F50921285J864016J561940Q87394P77721J094580J256764J263797J139462Q81016
$$ 650921285 652785301 654347241 655234635 656012356 657106936 658363700 659627497 660766959 661647975
3724.3F61647975O79434R39190J367212J497149J052380L68297M58240J035810J026690
$$ 661647975 662327409 663266599 664633811 666130960 667183340 667551637 668009877 669045687 670072377
3742.7F70072377N22017P95782J019180L27229L3558O10709Q50498N38111L75867O07729
$$ 670072377 670594394 671390176 672409356 672736585 672770143 673380852 674231350 674769461 675145328 675753057
3763.1F75753057P12872O38723M81725L05950L58522N89013P42019N29468L40998M62115
$$ 675753057 676465929 677104652 677586377 677892327 678250849 678839862 679581881 680111349 680452347 680914462
3783.5F80914462M43518L66330M21524N45561O89090O83546P00473N87702J56880K53439
$$ 680914462 681357980 681724310 682145834 682691395 683380485 684064031 684764504 685352206 685509086 685762525
3803.9F85762525K91347l2782K12490O69539P30574N05090N08308K68817j37567R9242
$$ 685762525 686053872 686021090 686233580 686903119 687633693 688138783 688647091 688915908 688778341 688877583
3824.3F88877583L06248L57747L96431M51863O76334N23269K6464j3709K7657N9L19064
$$ 688877583 689183831 689541578 689938009 690389872 691066206 691589475 691615939 691602230 691629887 691629946 691949010
3846.7F91949010Q16345R14991k5153p53522J9491M27961M13239L41833K47120K48969
$$ 691949010 692765355 693680346 693655193 692901671 692921162 693349123 693762362 694104195 694351315 694600284
3867.1F94600284N2810j24753q225R6440L11196L60429K29657J46449j43469n7161
$$ 694600284 694653094 694528341 694520116 694616556 694927752 695288181 695517838 695664287 695520818 695463657
3887.5F95463657K98798R5427o3061K78830M62413K80380O318k32458k85089j47760
$$ 695463657 695762455 695857882 695794821 696073651 696536064 696816444 696822762 696590304 696305215 696157455
3907.9F96157455o5147Q1539L41773L15130j789o7711L3856l3677o020K14339K40325
$$ 696157455 696092308 696173847 696515620 696830750 696828961 696761250 696795106 696761429 696755409 696969748 697210073
3930.3F97210073m649j75655j18374L8683J47522R3817P3731J40667L4750j03236p3790
$$ 697210073 697205424 697029769 696911395 696950078 697097600 697191417 697265148 697405815 697440565 697337329 697263539
3952.7F97263539j2338k0683j7941j073j5080L4213J31190J39058N6028K4438K4199
$$ 697263539 697251201 697230518 697212577 697211504 697196424 697230637 697361827 697500885 697556913 697581351 697605550
3975.2F97605550j5199K6286J57714J95980P3790m9710l3140L5941N3049O3240M2677
$$ 697605550 697590351 697616637 697774351 697970331 698044121 697994411 697961271 697997212 698050261 698113501 698156178
3997.6F98156178
$$ 698156178
##END=$$ End of the data block
