##TITLE=$$ Begin of the data block
##JCAMP-DX=5.00 $$ ACD/SpecManager v 10.08
##SPECTROMETER/DATA SYSTEM=Alpha
##DATE=11 Nov 2014 09:02:30
##DATA TYPE=INFRARED SPECTRUM
##DATA CLASS=XYDATA
##ORIGIN=
##OWNER=
##NPOINTS=1765
##FIRSTX=399.76428223
##LASTX=3997.64306641
##MAXX=3997.64306641
##MINX=399.76428223
##MAXY=0.76769143
##MINY=0.27016601
##XFACTOR=1.0000000000
##YFACTOR=1.000000000000000e-9
##FIRSTY=0.56287563
##DELTAX=2.03961372
##XUNITS=1/CM
##YUNITS=ARBITRARY UNITS
##XYDATA=(X++(Y..Y))
399.8E62875628r20176k417207j786768j83523j021862k841115k088129j72318r88662
$$ 562875628 561955452 559538245 557751477 557567954 556546092 553704977 551616848 551444530 550455868
418.1E50455868l440916k707601j402736j855611k376736j081884M67003j95861j326084
$$ 550455868 547014952 544307351 542904615 541049004 538672268 537590384 538057387 537861526 536535442
436.5E36535442o64473N1022p94411j483977o97434j38819r51946j862287j289964
$$ 536535442 535870969 535921991 535127580 533643603 532946169 532807350 531855404 529993117 528703153
454.8E28703153n40495j439869k225518j566530p53820j000225j575649j161933o03378
$$ 528703153 528162658 526722789 524497271 522930741 522176921 521176696 519601047 518439114 517835736
473.2E17835736r48250j328409j132071q66472j083196j477420j359344j064837j213610
$$ 517835736 516887486 515559077 514427006 513560534 512477338 510999918 509640574 508575737 507362127
491.5E07362127j397252j318693j371622j569033j869529k152503k230614k497584
$$ 507362127 505964875 504646182 503274560 501705527 499835998 497683495 495452881 492955297
507.9D92955297k858698k866328k725154k715409k702802k758861k880663k692222
$$ 492955297 490096599 487230271 484505117 481789708 479086906 476328045 473447382 470755160
524.2D70755160k349407k145320k019316j836717j467109j017540n79149K47747J576871
$$ 470755160 468405753 466260433 464241117 462404400 460937291 459919751 459340602 459588349 461165220
542.5D61165220K432793K131849J456261J152545P68781L3170m26054j29849L92706
$$ 461165220 463598013 465729862 467186123 468338668 469107449 469140619 468714565 468584716 468977422
560.9D68977422L73870J94162L58194L28660k63572q23587o18190p9035k09421n86421
$$ 468977422 469351292 469545454 469903648 470232308 469968736 469145149 468526959 468447924 468238503 467652082
581.3D67652082j95920L46780q1539p98107o09993j3918j33306o98626o72936j84596
$$ 467652082 467456162 467802942 467721403 466923296 466313303 466299385 466166079 465467453 464794517 464609921
601.7D64609921m10765j422078j969337j941830k763182l930628l226668o97941J460076
$$ 464609921 464199156 462777078 460807741 458865911 456102729 452172101 448945433 448247492 449707568
620D49707568K240210K679408L486037L701568K609253J518726J513630J617372R76295
$$ 449707568 451947778 454627186 458113223 461814791 464424044 465942770 467456400 469073772 470050067
638.4D70050067O00010J347899K046317J657546J297742J936138K392470J444847J91241
$$ 470050067 470650077 471997976 474044293 475701839 476999581 478935719 481328189 482773036 482964277
656.8D82964277J96129N91994J05977m92841K4438J785248K000153J416415K020538
$$ 482964277 483160406 483752400 483858377 483365536 483389974 485175222 487175375 488591790 490612328
675.1D90612328L048062K868653J782417J556426K190739K009094R15766N57244J091003
$$ 490612328 493660390 496529043 498311460 499867886 502058625 504067719 504983485 505540729 506631732
693.5E06631732R78887M4823O2644J489580K407730J912772J587987K322257K822816
$$ 506631732 507610619 507655442 507718086 509207666 511615396 513528168 515116155 517438412 520261228
711.8E20261228K142787J559615K391696L350973L068149K655626L272474L844976
$$ 520261228 522404015 523963630 526355326 529706299 532774448 535430074 538702548 542547524
728.1E42547524L058970J889646J961052K518833J918435Q36253R38535J802623J572311
$$ 542547524 545606494 547496140 549457192 551976025 553894460 554730713 555669248 557471871 559044182
746.5E59044182M61579L55482J113236R02652k33829m55260N30780J021266M33206
$$ 559044182 559505761 559861243 560974479 561877131 561643302 561188042 561718822 562740088 563173294
764.9E63173294L10838J307309J992047J508057J199067K062678K896130K598941K162695
$$ 563173294 563484132 564791441 566783488 568291545 569490612 571553290 574449420 577048361 579211056
783.2E79211056K779544L498256K999127J985252J976549K519965J980305Q12590O97196
$$ 579211056 581990600 585488856 588487983 590473235 592449784 594969749 596950054 597762644 598459840
801.6E98459840J230359R30011J53363L78132J537621J868248Q55624k54452j474440
$$ 598459840 599690199 600620210 600773573 601151705 602689326 604557574 605413198 605158746 603684306
819.9F03684306m147112o064952l169655K031207L895700K994656L449321N465090
$$ 603684306 599537194 593472242 590302587 592333794 596229494 599224150 602673471 608138561
836.2F08138561O271005N061626L274382K230227J716434O89984m88401l26514J136184
$$ 608138561 614409566 619471192 622745574 624975801 626692235 627382219 626893818 626567304 627703488
854.6F27703488K211809K178431K065777K370239K143740J137436N02705O17445L27349
$$ 627703488 629915297 632093728 634159505 636529744 638673484 639810920 640313625 640931070 641258419
873F41258419q21174j722931j850546k220511l374696m174709l711582k802312k491117
$$ 641258419 640437245 638714314 636863768 634643257 631268561 627093852 623382270 620579958 618088841
891.3F18088841k288341j189351L05891Q77082O11305N86510P11978O9856j093566
$$ 618088841 615800500 614611149 614917040 615794122 616405427 616991937 617703915 617773771 616680205
909.7F16680205j555503j118063q72374j221359j153111k67208L12388r8228o88494
$$ 616680205 615124702 614006639 613134265 611912906 610759795 610492587 610804975 610706747 610018253
928F10018253p89284j201570k609551m116357m868746n542159o936311q333028q522212
$$ 610018253 609228969 608027399 605417848 601301491 596432745 590890586 583954275 575621247 567099035
946.4E67099035p768929p115424o439567n055665l422201k669275k791941k820671
$$ 567099035 559330106 552214682 545775115 540719450 537297249 534627974 531836033 529015362
962.7E29015362k606034l029764m297197n422890o034076o984115q609861r974360
$$ 529015362 526409328 523379564 519082367 513659477 507625401 500641286 492031425 482057065
979D82057065j0351569j0171741j0009438r503782q213013o811708o176382o149173
$$ 482057065 471705496 461533755 451524317 442020535 433807522 426995814 420819432 414670259
995.3D14670259o191492o397575o918341p247746o831110n849093n033195m639983
$$ 414670259 408478767 402081192 395162851 387915105 381083995 375234902 370201707 365561724
1011.6C65561724m138977l354102k760202k481401k083987j353502p30395n38320l52501
$$ 365561724 361422747 358068645 355308443 352827042 350743055 349389553 348659158 348120838 347768337
1030C47768337K03788P47979Q40604O23017L47108p1645p00056j158119j068085o77288
$$ 347768337 347972125 348720104 349560708 350183725 350530833 350459188 349759132 348601013 347532928 346855640
1050.4C46855640n12570o25968n99831k61605j0788j07795k15948j28597j82182m69476
$$ 346855640 346343070 345717102 345117271 344855666 344844878 344737083 344521135 344392538 344210356 343740880
1070.8C43740880m32401L36080J423836K180934K635390L029585K985388K104044Q85307
$$ 343740880 343308479 343644559 345068395 347249329 349884719 352914304 355899692 358003736 358889043
1089.2C58889043L9935n95629j419604k102732k131313j638502j082540l98636Q73983
$$ 358889043 358928978 358333349 356913745 354811013 352679700 351041198 349958658 349560022 350434005
1107.5C50434005K496958L664196M219770M640520N017876M903704M263491L818124
$$ 350434005 352930963 356595159 360814929 365455449 370473325 375377029 379640520 383458644
1123.8C83458644L986359M202336L927231L404349K955287K350808J254260J21266
$$ 383458644 387445003 391647339 395574570 398978919 401934206 404285014 405539274 405660540
1140.1D05660540j92613K23756O96212J273722K357334L623753M407615M843652N652368
$$ 405660540 405467927 405691683 406387895 407661617 410018951 413642704 418050319 422893971 428546339
1158.5D28546339O862581P861137Q721799J0074943J1763782J2785613J2768805J2480974
$$ 428546339 435408920 443270057 451991856 462066799 473830581 486616194 499384999 511865973
1174.8E11865973J2301982J1550605R842515Q015454O739199N331397L211320J163304
$$ 511865973 524167955 535718560 545561075 553576529 560315728 565647125 568858445 570021749
1191.1E70021749p4745j056671k346814l256797l011167k245128j964987j999020j738906
$$ 570021749 569947004 568890333 566543519 563286722 560275555 558030427 556065440 554066420 552327514
1209.5E52327514j626730k372265l460527l971278m029393m310489m725337m646719
$$ 552327514 550700784 548328519 544867992 540896714 536867321 532556832 527831495 523184776
1225.8E23184776m079163l679335l523230l036738k156556j510798j271368q79704
$$ 523184776 519105613 515426278 511903048 508866310 506709754 505198956 503927588 503047884
1242.1E03047884j73688L40581L84092L53098N25772O10412L77058K29538N50151R38773
$$ 503047884 502874196 503214777 503598869 503951967 504477739 505088151 505465209 505694747 506244898 507183671
1262.5E07183671R60469Q71420J003802J062810O71506M3691l83795o72400j046121
$$ 507183671 508144140 509015560 510019362 511082172 511753678 511797369 511413574 510741174 509695053
1280.9E09695053j313031j242280j147985j500607k124190k630323l073931l763497
$$ 509695053 508382022 507139742 505991757 504491150 502366960 499736637 496662706 492899209
1297.2D92899209m593938n151511n380690n652308o036669o077528n710066n302727
$$ 492899209 488305271 483153760 477773070 472120762 466084093 460006565 454296499 448993772
1313.5D48993772m924625m393339l733903l181070k979845l016740l075540l186196
$$ 448993772 444069147 439675808 435941905 432760835 429780990 426764250 423688710 420502514
1329.8D20502514l366769l389179l138394l033965l241361l187298k732963k312571
$$ 420502514 417135745 413746566 410608172 407574207 404332846 401145548 398412585 396100014
1346.2C96100014j971304j547307r69708m90337l59714l90411m89861r21964j606137
$$ 396100014 394128710 392581403 391611695 391121358 390761644 390371233 389881372 388959408 387353271
1364.5C87353271k082228k519459k890348l509641m562229n315930p419765j2784421
$$ 387353271 385271043 382751584 379861236 376351595 371789366 366473436 359053671 346269250
1380.8C46269250j4906526n293727Q720756J1613876N670756J755416J87397n10245
$$ 346269250 331362724 326068997 334789753 346403629 352074385 353829801 354017198 353506953
1397.1C53506953p89643o53952j94520J43975L44247O75767J144022J597822K079666
$$ 353506953 352717310 352063358 351868838 352012813 352357060 353032827 354176849 355774671 357854337
1415.5C57854337K732366L484785L685058L982842M411071M531771M386097L654897
$$ 357854337 360586703 364071488 367756546 371739388 376150459 380682230 385068327 388723224
1431.8C88723224L073275L417075L620655L025978K854765K908557K970159K934635
$$ 388723224 391796499 395213574 398834229 401860207 404714972 407623529 410593688 413528323
1448.1D13528323K696634K697706L237426M611671N439609M450739M373759N183369
$$ 413528323 416224957 418922663 422160089 426771760 432211369 436662108 441035867 446219236
1464.5D46219236N366712N321682O622165Q864671Q643002O791949N789876M958302
$$ 446219236 451585948 456907630 463529795 472394466 481037468 487829417 493619293 498577595
1480.8D98577595L770113K396762J343787r0838k103626k916754l257155m564792n514354
$$ 498577595 502347708 504744470 506088257 505997419 503893793 500977039 497719884 493155092 487640738
1499.1D87640738n098313m085421m268974o826550o529480m802853m254460l808201
$$ 487640738 482542425 478457004 474188030 467361480 460832000 456029147 451774687 447966486
1515.4D47966486l091275j857877j373530j754135k067864k437144k115339j914680
$$ 447966486 444875211 443017334 441643804 439889669 437821805 435384661 433269322 431354642
1531.8D31354642k607703k297551j325041j882285k825707k163142j306206n32120
$$ 431354642 428746939 426449388 425124347 423242062 420416355 418253213 416947007 416414887
1548.1D16414887j14769K46584Q00670J238286P10011r35078r07481p34418j164228
$$ 416414887 416300118 416546702 417347372 418585658 419295669 418360591 417453110 416718692 415554464
1566.4D15554464k002984k954513k731502k974451m880637n087137m341096m767656
$$ 415554464 413551480 410596967 407865465 404891014 400010377 394923240 390582144 385814488
1582.8C85814488n306035n463839n383193n341739n265802m997492m425883l914237
$$ 385814488 380508453 375044614 369661421 364319682 359053880 354056388 349630505 345716268
1599.1C45716268l740609l606170l251702l026396l177822l137320k693116k735615
$$ 345716268 341975659 338369489 335117787 332091391 328913569 325776249 323083133 320347518
1615.4C20347518l451407k865613k292096k749861k923816k863824k706409j908779
$$ 320347518 316896111 314030498 311738402 308988541 306064725 303200901 300494492 298585713
1631.7B98585713j409799j968473j790375p79003j72972J28984K03341K84225O07908
$$ 298585713 297175914 295207441 293417066 292638063 292465091 292594075 292797416 293081641 293689549
1650.1B93689549O36727K24053O54161J305283J832932K304762K766699L096193L768414
$$ 293689549 294326276 294550329 295204490 296509773 298342705 300647467 303414166 306510359 310278773
1668.4C10278773M442782M440993N214303O130308O081105O260007P714659J0252327
$$ 310278773 314721555 319162548 324376851 330507159 336588264 342848271 350562930 360815257
1684.7C60815257R473741Q640915R745091R870529J1122466J2291789J2000918J3070643
$$ 360815257 370288998 378929913 388675004 398545533 409667999 421959788 433960706 447031349
1701.1D47031349J0640442Q914292Q993685P821531O707310N936682N476416N260527
$$ 447031349 457671791 466586083 475579768 483401299 490108609 496045291 501521707 506782234
1717.4E06782234M188597L147483L048241L260136L152072K878487K727032L011942
$$ 506782234 510970831 514118314 517166555 520426691 523578763 526457250 529184282 532196224
1733.7E32196224L005087K781034L345132M244983M827261N159497N651057O565511
$$ 532196224 535201311 537982345 541327477 545572460 550399721 555559218 561210275 567775786
1750E67775786O953597O402731O475747O778359O064832N270720N160391N821168O585062
$$ 567775786 574729383 581132114 587607861 594386220 600451052 605721772 610882163 616703331 623288393
1768.4F23288393O560206N891562M924118M292071L988147L539503L237307L323138
$$ 623288393 629848599 635740161 640664279 644956350 648944497 652484000 655721307 659044445
1784.7F59044445L225445K884746K781033K883792K612770K255082K204716K377451
$$ 659044445 662269890 665154636 667935669 670819461 673432231 675687313 677892029 680269480
1801F80269480K300977J919985J815498K074838K173722J773059J509845J700998J928925
$$ 680269480 682570457 684490442 686305940 688380778 690554500 692327559 693837404 695538402 697467327
1819.4F97467327J811147J586437J624227J766920J556396J101077J177728J508594
$$ 697467327 699278474 700864911 702489138 704256058 705812454 706913531 708091259 709599853
1835.7G09599853J458644J211882J295149J523436J331925Q88467Q12471J128733J238704
$$ 709599853 711058497 712270379 713565528 715088964 716420889 717309356 718121827 719250560 720489264
1854G20489264R92298Q73208J096725J203895J030564R36449R57369Q46863O46234
$$ 720489264 721481562 722354770 723451495 724655390 725685954 726622403 727579772 728426635 729072869
1872.4G29072869N88476P43211R34005Q07166N87165P07567R86874Q85785M95493N26369
$$ 729072869 729661345 730404556 731338561 732145727 732732892 733440459 734427333 735313118 735808611 736334980
1892.8G36334980Q13066P46966M64082M89473P37369P79092N70834M42267N61594O59466
$$ 736334980 737148046 737895012 738359094 738848567 739585936 740365028 740935862 741378129 741939723 742599189
1913.2G42599189N70238M47571N12600O01471L92079J82033L55422N18918L73602K22862
$$ 742599189 743169427 743616998 744129598 744731069 745123148 745305181 745660603 746179521 746553123 746775985
1933.6G46775985L12745M93646M76003K68340J37627K36452K70307J43587J60277L08037
$$ 746775985 747088730 747582376 748058379 748326719 748464346 748700798 748971105 749114692 749274969 749583006
1954G49583006K94268J48475J60277L01659L48211K06708Q1718J48774J99377J17958
$$ 749583006 749877274 750025749 750186026 750487685 750835896 751042604 751124322 751273096 751472473 751590431
1974.4G51590431Q7559J70648J85371R4592O0856J71423K45691J35302k5034J133J10984
$$ 751590431 751677990 751848638 752034009 752128601 752189457 752360880 752606571 752741873 752716839 752717972 752828956
1996.8G52828956O6936m948L1174Q6188K3365p3731m5895N7220M0770j13488j69456
$$ 752828956 752895892 752890944 752922118 753008306 753031671 752957940 752912045 752969265 753010035 752896547 752727091
2019.2G52727091r6023p9810j42992j32084n0783l0160j07109j32978m3631r537q2731
$$ 752727091 752631068 752551258 752408266 752276182 752225399 752195239 752088130 751955152 751911521 751901984 751819253
2041.7G51819253r1195l398l635p1168n6625K9564J0431j31667j82211o6996K2948
$$ 751819253 751728058 751724660 751721025 751649857 751593232 751622796 751633227 751501560 751319349 751252353 751275301
2064.1G51275301l8028m6074O1869R3461J7166L934Q1241J12772N0664L0219J50502
$$ 751275301 751237273 751191199 751253068 751346529 751363695 751367629 751448870 751561642 751612306 751642525 751793027
2086.6G51793027K13265J00851J1087J07646K26199J91033J19567J66476K38001J75417
$$ 751793027 752006292 752107143 752118230 752225876 752452075 752643108 752762675 752929151 753167152 753342569
2106.9G53342569P7844J06811J80960J57535J18911J84775K77698K13921P1525J04547
$$ 753342569 753420413 753527224 753708184 753865719 753984630 754169405 754447103 754661024 754732549 754837096
2127.3G54837096K35378K22564J15514J55807K77698K48432J36494J48535K53201K77519
$$ 754837096 755072474 755295038 755410552 755566359 755844057 756092489 756228983 756377518 756630719 756908238
2147.7G56908238J98066J62721K82764L76344K69890J80840K78771L55721K89261K31147
$$ 756908238 757106304 757269025 757551789 757928133 758198023 758378863 758657634 759013355 759302616 759533763
2168.1G59533763L00169L92854L19600J97351K58208L67760L05534J99258K44617L53277
$$ 759533763 759833932 760226786 760546386 760743737 761001945 761369705 761675239 761874497 762119114 762472391
2188.5G62472391L09765J40608J26898K90871L11970J25647P4029K50042L07560J58011
$$ 762472391 762782156 762922764 763049662 763340533 763652503 763778150 763852179 764102221 764409781 764567792
2208.9G64567792J14143K23041K57373J76370R2745J26362K10762J82867J07944J31786
$$ 764567792 764681935 764904976 765162349 765338719 765431464 765557826 765768588 765951455 766059399 766191185
2229.3G66191185J96993J40309J9253O0617K16127J99199M5836J6689J07348J18553
$$ 766191185 766388178 766528487 766547740 766608357 766824484 767023683 767069519 767086208 767193556 767312109
2249.7G67312109K8790K1576J07289J07944p808o7652J7524J14203N7458m5836q821
$$ 767312109 767340899 767362475 767469764 767577708 767569900 767502248 767519772 767633975 767691433 767645597 767636776
2272.2G67636776M7028l3021j30951p1287N1259N603j47879j56462q9228j37627k08855
$$ 767636776 767683804 767650783 767519832 767448545 767499804 767505407 767357528 767201066 767111838 766974211 766765356
2294.6G66765356j86741j25587j67787l02494l42607k55645k61783m02272m47273l74258
$$ 766765356 766578615 766453028 766285241 765982747 765640140 765384495 765122712 764720440 764273167 763898909
2315G63898909m12285o29127p49171n87344m13418m78148n55635m61638m23133n34773
$$ 763898909 763486624 762857497 762108326 761520982 761107564 760629416 760073781 759612143 759189010 758654237
2335.4G58654237n86152m74751k98202j40488Q9108K26021j28030q21233j375854j425505
$$ 758654237 758068085 757593334 757295132 757154644 757243752 757469773 757341743 756520510 755144656 753719151
2355.8G53719151j096725p03693l94761j43588P1764J72555K34247K90036K83539K28107
$$ 753719151 752622426 751918733 751523972 751380384 751452148 751624703 751858950 752148986 752432525 752660632
2376.2G52660632J32144J430j86026m28438p16448r69470j108586j201809j238823
$$ 752660632 752792776 752794206 752608180 752179742 751463294 750493824 749385238 748183429 746944606
2394.5G46944606j054942o61671k76566p8261q5652j63555k10643k72035m33088n87940
$$ 746944606 745889664 745227993 744951427 744873166 744787514 744623959 744413316 744141281 743708193 743120253
2414.9G43120253o05881n92828p13050r15766q99732n42224j76787j36375k96653l95417
$$ 743120253 742514372 741921544 741208494 740292728 739392996 738850772 738673985 738537610 738240957 737845540
2435.3G37845540m36425m89712m96209m59790m68492n40555o36518o59287n99980o01590
$$ 737845540 737409115 736919403 736423194 735963404 735494912 734954357 734317839 733658552 733058572 732456982
2455.7G32456982o88732p24613o83963o83308p84993q76427q13007p14183p53165q44776
$$ 732456982 731768250 731043637 730359674 729676366 728891373 728014946 727201939 726487756 725734591 724889815
2476.1G24889815q44419p79390p80344q37327q26299p82013q05437q51572q13961p05361
$$ 724889815 724045396 723266006 722485662 721648335 720822036 720040023 719234586 718383014 717569053 716863692
2496.5G16863692o90401p88986q24869p46071p07806p87913q23975p39217o95050p77661
$$ 716863692 716173291 715384305 714559436 713813365 713105559 712317646 711493671 710754454 710059404 709281743
2516.9G09281743q28982p41005o66499p17401p57158o85752o47902p42555q32557p75397
$$ 709281743 708452761 707711756 707045257 706327856 705570698 704884946 704237044 703494489 702661932 701886535
2537.3G01886535o77765p43568q63492q02159o75083p17938q51512q70525p79629p50184
$$ 701886535 701208770 700465202 699601710 698799551 698124468 697406530 696555018 695684493 694904864 694154680
2557.7F94154680q37147q79169q03113p77900q64327r17614q75651q37803r13382r91344
$$ 694154680 693317533 692438364 691635251 690857351 689993024 689075410 688199759 687361956 686448574 685457230
2578.1F85457230r13978q23259r07123j053572j047313r32157r13978j001239j012921
$$ 685457230 684543252 683719993 682812870 681759298 680711985 679779828 678865850 677864611 676851690
2596.4F76851690r25303r06706j011133j058161r56178q81254r25899j002252r91523
$$ 676851690 675926387 675019681 674008548 672950387 671994209 671112955 670187056 669184804 668193281
2614.8F68193281r17435r64344j050889r59992q38340r01043j008511r65774q46922
$$ 668193281 667275846 666311502 665260613 664300621 663462281 662561238 661552727 660586953 659740031
2633.2F59740031q61049j021385j044631q82864q55684r82345j000225q97348q77917
$$ 659740031 658878982 657857597 656812966 655930102 655074418 654092073 653091848 652194500 651316583
2651.5F51316583r86039j025022r20116q70407r61900j020849r68277r37581j018584
$$ 651316583 650330544 649305522 648385406 647514999 646553099 645532250 644563973 643626392 642607808
2669.9F42607808j105368j062334r84132j053512j152396j078546r78530j039445j149178
$$ 642607808 641502440 640440106 639455974 638402462 637250066 636171520 635192990 634153545 633004367
2688.2F33004367j140833j063287j089692j216412j237273j136780j142621j251399
$$ 633004367 631863534 630800247 629710555 628494143 627256870 626120090 624977469 623726070
2704.5F23726070j262546j180648j164318j273512j346767j258135j191259j293361
$$ 623726070 622463524 621282876 620118558 618845046 617498279 616240144 615048885 613755524
2720.9F13755524j386225j321912j200914j168669j221239j195848j067996j025915
$$ 613755524 612369299 611047387 609846473 608677804 607456565 606260717 605192721 604166806
2737.2F04166806j093686j078009r53436r31144j027346j043081r67980r54329j041115
$$ 604166806 603073120 601995111 601041675 600110531 599083185 598040104 597072124 596117795 595076680
2755.5E95076680j097202j064658j039446j062691j066029j006186r91166j101255
$$ 595076680 593979478 592914820 591875374 590812683 589746654 588740468 587749302 586648047
2771.8E86648047j192987j151919j102090j157403j222670j190245j181186j307845
$$ 586648047 585455060 584303141 583201051 582043648 580820978 579630733 578449547 577141702
2788.2E77141702j392543j334548j315713j416206j511217j518547j474321j509726
$$ 577141702 575749159 574414611 573098898 571682692 570171475 568652928 567178607 565668881
2804.5E65668881j670837j752735j675725j649081j746714j807631j809000j895369
$$ 565668881 563998044 562245309 560569584 558920503 557173789 555366158 553557158 551661789
2820.8E51661789k037227k117991k138972k187193k342939k522052k640843k810299
$$ 551661789 549624562 547506571 545367599 543180406 540837467 538315415 535674572 532864273
2837.1E32864273l135503l635525m286051m970968n358338m900873l495872j877844
$$ 532864273 529728770 526093245 521807194 516836226 511477888 506577015 503081143 501203299
2853.4E01203299q55148n77837p24614j053512j516193k023340k364665k384424k129197
$$ 501203299 500348151 499770314 499045700 497992188 496475995 494452655 492087990 489703566 487574369
2871.8D87574369j739025j324982r91553q27819q58575j013816j179754j328677j500994
$$ 487574369 485835344 484510362 483518809 482690990 481832415 480818599 479638845 478310168 476809174
2890.1D76809174j674980j780450j830250j896412k000898k107143k233833k456218
$$ 476809174 475134194 473353744 471523494 469627082 467626184 465519041 463285208 460828990
2906.5D60828990k805203l283740l806263m162878m066795l419280k512157j688599
$$ 460828990 458023787 454740047 450933784 446770906 442704111 439284831 436772674 435084075
2922.8D35084075j060248n68211j21891K83837O07878Q86381J219749J579762J782000
$$ 435084075 434023827 433455616 433333725 433617562 434225440 435111821 436331570 437911332 439693332
2941.1D39693332J775562J615882J300008Q98867M98861J54645L4719K44558O12051
$$ 439693332 441468894 443084776 444384784 445283651 445782512 445937157 445971876 446216434 446828485
2959.5D46828485R60618J311749J690745K016098K231717K367943K384276K257347
$$ 446828485 447789103 449100852 450791597 452807695 455039412 457407355 459791631 462048978
2975.8D62048978K104997J964540J778334J578659J405775J219154R95785P21097L78728
$$ 462048978 464153975 466118515 467896849 469475508 470881283 472100437 473096222 473817319 474196047
2994.2D74196047N1617j91688l83765n89818q16315r48608r64284j007169j118005
$$ 474196047 474247664 474055976 473672211 473082393 472266078 471317470 470353186 469346017 468228012
3012.5D68228012j179069j160026j169174j269550j388192j435965j434624j438946
$$ 468228012 467048943 465888917 464719743 463450193 462062001 460626036 459191412 457752466
3028.8D57752466j441866j401335j385182j429230j430363j415848j433701j448184
$$ 457752466 456310600 454909265 453524083 452094853 450664490 449248642 447814941 446366757
3045.1D46366757j482069j492650j444131j426697j447022j453012j400441j291215
$$ 446366757 444884688 443392038 441947907 440521210 439074188 437621176 436220735 434929520
3061.5D34929520j219392j187026j116991j060993j069307j047164r60678r19104r72062
$$ 434929520 433710128 432523102 431406111 430345118 429275811 428228647 427267969 426348865 425376803
3079.8D25376803j008958r54837q75890q64416r02385q90433q64864q90761r23396
$$ 425376803 424367845 423413008 422537118 421672702 420770317 419879884 419015020 418124259 417200863
3098.2D17200863r64015j005233j039564j101852j141846j128286j104534j128614
$$ 417200863 416236848 415231615 414192051 413090199 411948353 410820067 409715533 408586919
3114.5D08586919j213193j268029j266599j285165j338780j394480j420469j411080
$$ 408586919 407373726 406105697 404839098 403553933 402215153 400820673 399400204 397989124
3130.8C97989124j438260j487970j490534j500666j553446j580954j563012j539022
$$ 397989124 396550864 395062894 393572360 392071694 390518248 388937294 387374282 385835260
3147.1C85835260j537561j600892j664310j637042j592696j596778j596481j607686
$$ 385835260 384297699 382696807 381032497 379395455 377802759 376205981 374609500 373001814
3163.4C73001814j675189j703202j642764j600951j611263j581549j526088j519888
$$ 373001814 371326625 369623423 367980659 366379708 364768445 363186896 361660808 360140920
3179.8C60140920j542479j527995j483113j438736j385123j383066j427710j391411
$$ 360140920 358598441 357070446 355587333 354148597 352763474 351380408 349952698 348561287
3196.1C48561287j298487j248926j226872j208306j157522j106232j098156j065314
$$ 348561287 347262800 346013874 344787002 343578696 342421174 341314942 340216786 339151472
3212.4C39151472j009762r86726j019299j027703r76562r75907j029462j051277j014948
$$ 339151472 338141710 337154984 336135685 335107982 334131420 333155513 332126051 331074774 330059826
3230.7C30059826r78529j015067j062960j051634j084834j180649j201064j170635
$$ 330059826 329081297 328066230 327003270 325951636 324866802 323686153 322485089 321314454
3247.1C21314454j194298j217962j203358j211404j242370j282781j313776j270771
$$ 321314454 320120156 318902194 317698836 316487432 315245062 313962281 312648505 311377734
3263.4C11377734j182824j153380j191050j183093j095533j040906j046538j015782
$$ 311377734 310194910 309041530 307850480 306667387 305571854 304530948 303484410 302468628
3279.7C02468628r27121q78155q50797p54654o73145o51509o19560n88328n50687n06491
$$ 302468628 301541507 300663352 299812555 299057901 298384756 297733247 297113687 296525359 295974672 295468181
3300.1B95468181m94599m91798n09918n42640n60314n68568n73129o03765o49542o62863
$$ 295468181 294973582 294481784 293971866 293429226 292868912 292300344 291727215 291123450 290473908 289811045
3320.5B89811045o59078p03007p90269q06331p42436p07954p22289p74801p96795p54624
$$ 289811045 289151967 288448960 287658691 286852360 286109924 285401970 284679681 283904880 283108085 282353461
3340.9B82353461p24256p08759o85990o43820n74111n37724n58913n47081m85778m55945
$$ 282353461 281629205 280920446 280234456 279590636 279016525 278478801 277919888 277372807 276887029 276431084
3361.3B76431084m63873m46707m24177m37558m55767m33564l80575l43800l26067l34680
$$ 276431084 275967211 275520504 275096327 274658769 274203002 273769438 273388863 273045063 272718996 272384316
3381.7B72384316l13431k49178j72585j22010j84596k80380k54005j28925n6237j04517
$$ 272384316 272070885 271821707 271649122 271527112 271342516 271062136 270808131 270679206 270622969 270518452
3402.1B70518452j78397j38432l5613L4034O7264Q9854J14083J42753J92106K55346
$$ 270518452 270340055 270201623 270166010 270200044 270267308 270357162 270471245 270613998 270806104 271061450
3422.5B71061450L53098M66854N42074N33104N45978O17713N99057N16891N68628P52211
$$ 271061450 271414548 271881402 272423476 272956580 273502558 274120271 274719328 275236219 275804847 276557058
3442.9B76557058Q66890Q59052Q25584Q84116R93043J088738J170099J220644J212656
$$ 276557058 277423948 278283000 279108584 279992700 280985743 282074481 283244580 284465224 285677880
3461.2B85677880J253963J376509J418054J369208J297623J297474J374424J514017
$$ 285677880 286931843 288308352 289726406 291095614 292393237 293690711 295065135 296579152
3477.5B96579152J609892J552701J519591J605391J642078J616955J690716J820653
$$ 296579152 298189044 299741745 301261336 302866727 304508805 306125760 307816476 309637129
3493.8C09637129J871735J829028J840711J851112J756846J746446J899243K045095
$$ 309637129 311508864 313337892 315178603 317029715 318786561 320533007 322432250 324477345
3510.2C24477345K096265K040416J951158K036602K257675K385765K280027K159535
$$ 324477345 326573610 328614026 330565184 332601786 334859461 337245226 339525253 341684788
3526.5C41684788K191842K310485K466410K590776K609431K574563K683133K863378
$$ 341684788 343876630 346187115 348653525 351244301 353853732 356428295 359111428 361974806
3542.8C61974806K905845K757550K707719K831400K924800K974569L090919L259331
$$ 361974806 364880651 367638201 370345920 373177320 376102120 379076689 382167608 385426939
3559.1C85426939L361135L374726L381401L505081L551453L517300L566951L677487
$$ 385426939 388788074 392162800 395544201 399049282 402600735 406118035 409684986 413362473
3575.4D13362473L793538L938585M089654M160970M169286M134953M111915M101813
$$ 413362473 417156011 421094596 425184250 429345220 433514506 437649459 441761374 445863187
3591.7D45863187M225135M392088M472881M487157M512847M601597M676611M749327
$$ 445863187 450088322 454480410 458953291 463440448 467953295 472554892 477231503 481980830
3608.1D81980830M745633M769444M814923M765093M844904M956007M776597M731179
$$ 481980830 486726463 491495907 496310830 501075923 505920827 510876834 515653431 520384610
3624.4E20384610M907906N219102N243122M808903M725099M745066M724860M823506
$$ 520384610 525292516 530511618 535754740 540563643 545288742 550033808 554758668 559582174
3640.7E59582174M881501M854441M954219N071342M643797M112661M087746M312039
$$ 559582174 564463675 569318116 574272335 579343677 583987474 588100135 592187881 596499920
3657E96499920M163086L845454L685653L698230L719806L576696L462732L268600K821028
$$ 596499920 600663006 604508460 608194113 611892343 615612149 619188845 622651577 625920177 628741205
3675.4F28741205K465069K434552K468586K614438K808929K676546J996875J562119
$$ 628741205 631206274 633640826 636109412 638723850 641532779 644209325 646206200 647768319
3691.7F47768319J681924J782476J801908J704991J440347J394033J641393J763224
$$ 647768319 649450243 651232719 653034627 654739618 656179965 657573998 659215391 660978615
3708F60978615J515091R94920R45032J168192J208782J169204J074791Q58844O81638
$$ 660978615 662493706 663488626 664433658 665601850 666810632 667979836 669054627 669913471 670595109
3726.4F70595109R39131J331926J420855J038730M84765N07712R29058R15289N43415
$$ 670595109 671534240 672866166 674287021 675325751 675810516 676318228 677247286 678162575 678705990
3744.7F78705990Q34227R97722M00782J57535O31988Q22127N35249M21584O25074O75559
$$ 678705990 679540217 680537939 680938721 681096256 681728244 682550371 683085620 683507204 684132278 684807837
3765.1F84807837O10650M83036L58343M21762N93364P27058N50687L69787M46618M16160
$$ 684807837 685418487 685901523 686259866 686681628 687274992 688002050 688552737 688922524 689369142 689785302
3785.5F89785302L62813M57287O03437O72818N85198N86331N09679J92344L51072L83019
$$ 689785302 690148115 690605402 691208839 691881657 692466855 693053186 693562865 693755209 694106281 694489300
3805.9F94489300M5181K07364O16431O66619M39822M91321K43664j56820J37687L43919
$$ 694489300 694534481 694741845 695358276 696024895 696464717 696956038 697199702 697042882 697180569 697524488
3826.3F97524488L73363M14849M67658O25968M41909R834K2531N4419J8477L42429
$$ 697524488 697897851 698312700 698780358 699406326 699848235 699858069 699880600 699935019 699953496 700295925
3846.7G00295925P77424P76231j47462o81639J46628M88698M43459L39865K30909K98261
$$ 700295925 701073349 701849580 701702118 701020479 701167107 701655805 702099264 702439129 702670038 702968299
3867.1G02968299J41979j11938r0837L0160K99692L43144K54810K27570r7275k6047
$$ 702968299 703110278 702998340 702907503 702937663 703237355 703580499 703835309 704062879 703965604 703939557
3887.5G03939557K90334J7345j16169K53618M17649K66254L0160k21669k45333p2181
$$ 703939557 704229891 704247236 704131067 704384685 704802334 705068588 705098748 704877079 704631746 704559565
3907.9G04559565o259J00315K86460K30252J0848l0994M9770P5400P9095J40309J29760
$$ 704559565 704553306 704653621 704940081 705170333 705181181 705150187 705199957 705275357 705354452 705494761 705624521
3930.3G05624521j967p1645o3717o676R7930R3460N0247P8738M9829n5551r9540l7610
$$ 705624521 705622554 705550909 705487192 705480516 705578446 705671906 705722153 705800891 705850720 705795169 705695629 705658019
3954.8G05658019K1994P8380Q1777J2219L6300J04606R5546N9724P2002Q6427K6941
$$ 705658019 705680013 705758393 705840170 705852389 705888689 705993295 706088841 706148565 706220567 706306994 706333935
3977.2G06333935l9696K2590J32680Q0049l8028M291J23859J33097O2227K9922
$$ 706333935 706294239 706316829 706449509 706529558 706491530 706495821 706619680 706752777 706815004 706844926
3997.6G06844926
$$ 706844926
##END=$$ End of the data block
