##TITLE=$$ Begin of the data block
##JCAMP-DX=5.00 $$ ACD/SpecManager v 10.08
##SPECTROMETER/DATA SYSTEM=Alpha
##DATE=11 Nov 2014 09:02:30
##DATA TYPE=INFRARED SPECTRUM
##DATA CLASS=XYDATA
##ORIGIN=
##OWNER=
##NPOINTS=1765
##FIRSTX=399.76428223
##LASTX=3997.64306641
##MAXX=3997.64306641
##MINX=399.76428223
##MAXY=0.77135777
##MINY=0.26314729
##XFACTOR=1.0000000000
##YFACTOR=1.000000000000000e-9
##FIRSTY=0.55900240
##DELTAX=2.03961372
##XUNITS=1/CM
##YUNITS=ARBITRARY UNITS
##XYDATA=(X++(Y..Y))
399.8E59002399q24570k380073j944542n50866j037121k579987k150715m47034r45747
418.1E46141744l011585k284109j217485j945376k413511j094818L96490j11819j242995
436.5E33216536o92785J25706p23421j711607j011789k58923q31782j484156j070380
454.8E25557399o61731j486421k107858j401961o95765j194656j826465j241625n73158
473.2E14367759r20653j295447j013935o16908q77261j466096j430809r97186j016259
491.5E04733205j395881j495421j392126j513541j932681k226025k227217k379655
507.9D90170658k660632k789051k800762k823055k823532k817064k839804k675235
524.2D67941523k391935k196222k017200j784712j439482r94832m73201M18931J624048
$$ y = [559002399, 558177829, 555797756, 553853214, 553302348, 552265227, 549685240, 547534525, 547087491, 546141744, 543130159, 540846050, 539628565, 537683189, 535269678, 534174860, 534571350, 534459531, 533216536, 532523751, 532649457, 531926036, 530214429, 529202640, 528943717, 528111935, 526627779, 525557399, 524895668, 523409247, 521301389, 519899428, 519203663, 518009007, 516182542, 514940917, 514367759, 513447106, 512151659, 511137724, 510520816, 509643555, 508177459, 506746650, 505749464, 504733205, 503337324, 501841903, 500449777, 498936236, 497003555, 494777530, 492550313, 490170658, 487510026, 484720975, 481920213, 479097158, 476273626, 473456562, 470616758, 467941523, 465549588, 463353366, 461336166, 459551454, 458111972, 457117140, 456643939, 457062870, 458686918]
542.5D58686918K326697K123952J490772J083553Q36044J83523m97252l83735K11984
560.9D66062456L93689J92404K23666K65330k02834p00832m90486M4524N037m06265
581.3D65386689k34396K60026l5823p34389o15268j2875j27435p00563o45846j58817
601.7D62381303m10855j405388j932591j886844k614022l772765l188461o70433J570701
620D48070645K316028K681881L568203L807693K597690J488030J635104J813084J038850
638.4D69017208O51061J455814K108037J758904J392304J927972K378762J487076K71201
656.8D82448339K43932N80848P7545m98741J42991J989126K022773J362205K062797
675.1D90431815L133625K878696J847029J764506K340138J962661P89583M86255J116574
$$ y = [458686918, 461013615, 463137567, 464628339, 465711892, 466547936, 466731459, 466234207, 465850472, 466062456, 466456145, 466648549, 466872215, 467137545, 466934711, 466233879, 465743393, 465787917, 465792954, 465386689, 465152293, 465412319, 465376496, 464642107, 464026839, 464013964, 463886529, 463185966, 462540120, 462381303, 461970448, 460565060, 458632469, 456745625, 454131603, 450358838, 447170377, 446499944, 448070645, 450386673, 453068554, 456636757, 460444450, 463042140, 464530170, 466165274, 467978358, 469017208, 469668269, 471124083, 473232120, 474991024, 476383328, 478311300, 480690062, 482177138, 482448339, 482692271, 483273119, 483350664, 482851923, 482994914, 484984040, 487006813, 488369018, 490431815, 493565440, 496444136, 498291165, 500055671, 502395809, 504358470, 505148053, 505634308, 506750882]
693.5E06750882J057803J14739J36614J499653K323925J904071J674771K358377K780616
711.8E20601451K118588J612306K463102L386080L021896K560914L273546L931225
728.1E42969108L132224J933336J945496K438128J824200P91490R93788J884520J596332
746.5E59508622M57585L12328J115918J038373j60814n19335M99904J071572M50135
764.9E63774288K54929J315236K107084J601398J225769K051175K837658K561629K192497
783.2E79921663K758086L419101K993166K047122J992821K451897J935184Q80003P55847
801.6E99154890J174628Q47340J18792M08590J600921J882374Q51810j64509j315832
819.9F04559004m038393o087363l350675J850665L873169L023267L480613N578518
$$ y = [506750882, 507808685, 507923424, 508060038, 509559691, 511883616, 513787687, 515462458, 517820835, 520601451, 522720039, 524332345, 526795447, 530181527, 533203423, 535764337, 539037883, 542969108, 546101332, 548034668, 549980164, 552418292, 554242492, 555033982, 556027770, 557912290, 559508622, 559966207, 560278535, 561394453, 562432826, 562272012, 561752677, 562252581, 563324153, 563774288, 564029217, 565344453, 567451537, 569052935, 570278704, 572329879, 575167537, 577729166, 579921663, 582679749, 586098850, 589092016, 591139138, 593131959, 595583856, 597519040, 598399043, 599154890, 600329518, 601176858, 601295650, 601704240, 603305161, 605187535, 606039345, 605874836, 604559004, 600520611, 594433248, 591082573, 592933238, 596806407, 599829674, 603310287, 608888805]
836.2F08888805O388962N055309L152310K110839J684726P15315m92513l90649J053631
854.6F28166735K144039K174556K113700K370179K078831J033187L89337N47946K89082
873F41307592q61227j748383j855493k243638l421545m197001l695190k761901k436041
891.3F18087173k276600j255095K44439Q61406N87583N57363P08341M9770j163184
909.7F16401196j619578j137614q85964j240253j159430k74539K70904j83344p86484
928F09384894q81612j271963k659142m188657m943728n558551o876766q210838q396626
946.4E66397011p648647o985545o372094n057454l439546k728819k897084k896488
962.7E28371334k641916l066421m346549n502939o115020p007032q595676r949416
$$ y = [608888805, 615277767, 620333076, 623485386, 625596225, 627280951, 627996266, 627503753, 627113104, 628166735, 630310774, 632485330, 634599030, 636969209, 639048040, 640081227, 640470564, 641018510, 641307592, 640446365, 638697982, 636842489, 634598851, 631177306, 626980305, 623285115, 620523214, 618087173, 615810573, 614555478, 614799917, 615661323, 616248906, 616806269, 617514610, 617564380, 616401196, 614781618, 613644004, 612758040, 611517787, 610358357, 610083818, 610354722, 610171378, 609384894, 608503282, 607231319, 604572177, 600383520, 595439792, 589881241, 583004475, 574793637, 566397011, 558748364, 551762819, 545390725, 540333271, 536893725, 534164906, 531267822, 528371334, 525729418, 522662997, 518316448, 512813509, 506698489, 499691457, 491095781, 481146365]
979D81146365j0289996j0099173r946555r443611q223235o894052o234259o160945
995.3D13854539o183534o317765o762773p127732o775617n833358n039096m615247
1011.6C65199417m095346l335863k762348k478808k061516j343369p43926n40793l60608
1030C47476840J66178O89715P30634M58419K33024q2522o68854j116425r83357n73814
1050.4C46329838m79788o13182m84318j24812J7732j27434k12640j23143j82688m74215
1070.8C43525350m31865L34501J394123K167165K639860K957523K882033K108127R57608
1089.2C58534425P7427n55128j351297k051204k078444j572251j007170l00377R44107
1107.5C50640088K511174L675729M220426M605234N011826M948110M295319L821224
$$ y = [481146365, 470856369, 460757196, 450810641, 441367030, 433143795, 426249743, 420015484, 413854539, 407671005, 401353240, 394590467, 387462735, 380687118, 374853760, 369814664, 365199417, 361104071, 357768208, 355005860, 352527052, 350465536, 349122167, 348378241, 347837448, 347476840, 347643018, 348332733, 349063367, 349521786, 349754810, 349672288, 349003434, 347887009, 346903652, 346329838, 345850050, 345236868, 344752550, 344627738, 344645470, 344518036, 344305396, 344182253, 343999565, 343525350, 343093485, 343427986, 344822109, 346989274, 349629134, 352586657, 355468690, 357576817, 358534425, 358611852, 358056724, 356705427, 354654223, 352575779, 351003528, 349996358, 349695981, 350640088, 353151262, 356826991, 361047417, 365652651, 370664477, 375612587, 379907906, 383729130]
1123.8C83729130L953844M133612L899515L448337L022284K401262J290828J60486
1140.1D06039298j73897K25633P27714J313030K329350L544509M372358M870415N649805
1158.5D28898215O806135P830054Q682966R945184J1589557J2674242J2744755J2489349
1174.8E11660457J2324094J1576951R856462Q005560O701291N311131L223538J174331
1191.1E69833815q3089j084804k363742l246069k988338k205789j924217k023280j826405
1209.5E52088082j691878k389610l478765m019618m074097m323304m718423m619479
1225.8E22772908m034221l617465l458202k994418k121628j471221j243949q78453
1242.1E02953351j81020L56436L93569L40462N30482O14702L64185K18153N05268Q48234
$$ y = [383729130, 387682974, 391816586, 395716101, 399164438, 402186722, 404587984, 405878812, 406039298, 405865401, 406091034, 406818748, 408131778, 410461128, 414005637, 418377995, 423248410, 428898215, 435704350, 443534404, 452217370, 462162554, 473752111, 486426353, 499171108, 511660457, 523984551, 535561502, 545417964, 553423524, 560124815, 565435946, 568659484, 569833815, 569750726, 568665922, 566302180, 563056111, 560067773, 557861984, 555937767, 553914487, 552088082, 550396204, 548006594, 544527829, 540508211, 536434114, 532110810, 527392387, 522772908, 518738687, 515121222, 511663020, 508668602, 506546974, 505075753, 503831804, 502953351, 502772331, 503128767, 503522336, 503862798, 504393280, 505007982, 505372167, 505590320, 506095588, 506943822]
1262.5E06943822Q95858Q60691R95099J032472O39617N007m30345p08878j086235j376748
1282.9E07770360j320720j202584j544535k204299k719074l146380l840775m673183
1299.2D87118810n212813n438984n699306o053150o096900n751788n341172m915774
1315.6D42608923m355997l738850l227205l018498l042638l101290l213822l389448
1331.9D15521175l410817l172040l051459l234208l199518k781093k362937j971423
1348.2C92337680j457334q21292l27289j67936j92166k95818o71982j285285j744807
1366.6C85373771k178013k561122l163070m116475m719139o275117j0358810j1959553
1382.9C40042472m567832O183684Q480102M084915J180321m5181o11215q58009p38412
$$ y = [506943822, 507839680, 508700371, 509695470, 510727942, 511367559, 511372566, 510942221, 510233343, 509147108, 507770360, 506449640, 505247056, 503702521, 501498222, 498779148, 495632768, 491791993, 487118810, 481905997, 476467013, 470767707, 464714557, 458617657, 452865869, 447524697, 442608923, 438252926, 434514076, 431286871, 428268373, 425225735, 422124445, 418910623, 415521175, 412110358, 408938318, 405886859, 402652651, 399453133, 396672040, 394309103, 392337680, 390880346, 390059054, 389731765, 389563829, 389371663, 389075845, 388403863, 387118578, 385373771, 383195758, 380634636, 377471566, 373355091, 368635952, 362360835, 352002025, 340042472, 335474640, 341658324, 350138426, 354223341, 355403662, 355358481, 354747266, 353889257, 353150845]
1401.2C53150845k78622Q3178L03835O13451J053840J525580K037555K697081L463506
1419.6C64650249L685594L975093M382194M485666M326970L605336L049016L408759
1435.9C95568877L652484L057450K833456K873271K954245K934128K723873K739518
1452.2D19337302L237695M557580N416006M461944M373878N207449N395532N312592
1468.5D57299978O593316Q821339Q634805O828249N809843M931391L707736K351463
1484.9E04978120J294196k24948k232194k961755l302514m598528n505324n117684
1501.2D82329369m131169m313558o879330o540805m750311m179150l757745l087550
1517.5D44689751j876444j331001j644254j997948k373159k017647j821577k500385
$$ y = [353150845, 352872223, 352955401, 353259236, 353872687, 354926527, 356452107, 358489662, 361186743, 364650249, 368335843, 372310936, 376693130, 381178796, 385505766, 389111102, 392160118, 395568877, 399221361, 402278811, 405112267, 407985538, 410939783, 413873911, 416597784, 419337302, 422574997, 427132577, 432548583, 437010527, 441384405, 446591854, 451987386, 457299978, 463893294, 472714633, 481349438, 488177687, 493987530, 498918921, 502626657, 504978120, 506272316, 506047368, 503815174, 500853419, 497550905, 492952377, 487447053, 482329369, 478198200, 473884642, 467005312, 460464507, 455714196, 451535046, 447777301, 444689751, 442813307, 441482306, 439838052, 437840104, 435466945, 433449298, 431627721, 429127336]
1533.8D29127336k186627j283943j875758k685100j962245j171917m69774r5933K31921
1552.2D17627960P35671J091301M98980r52392q05408p12991j218855k124131l073990
1570.5D11066145k777219l022909m978091n175739m401982m813999n362898n544484
1586.8C74988824n467385n421519n359709n103440m513442m013598l885031l776341
1603.2C37448359l435791l212541l348142l284395k818614k861351l573000k948434
1619.5C11966091k349436k771407k921701k898454k763242j916200j335978j783967
1635.8B93225706j544208n66601N990K88635L86328N32746Q42631Q69870N31614Q74847
1656.2B95447558J434446J940071K417326K864659L142059L775120M440903M450143
$$ y = [429127336, 426940709, 425656766, 423781008, 421095908, 419133663, 417961746, 417491972, 417396039, 417627960, 418363631, 419454932, 419953912, 419001520, 418196112, 417483121, 416264266, 414140135, 411066145, 408288926, 405266017, 400287926, 395112187, 390710205, 385896206, 380533308, 374988824, 369521439, 364099920, 358740211, 353636771, 349123329, 345109731, 341224700, 337448359, 334012568, 330800027, 327451885, 324167490, 321348876, 318487525, 314914525, 311966091, 309616655, 306845248, 303923547, 301025093, 298261851, 296345651, 295009673, 293225706, 291681498, 291114897, 291120887, 291409522, 291795850, 292328596, 293171227, 294041097, 294572711, 295447558, 296882004, 298822075, 301239401, 304104060, 307246119, 311021239, 315462142, 319912285]
1672.5C19912285N232840O158591O107241O278783P734298J0304273R529888Q641869
1688.8C79900068R746879R904355J1148811J2331813J2104333J3192683J0706097Q990556
1705.1D68025595R133398P974685O820470N978107N482435N336702M327476L237963
1721.5E16316831L071904L250480L143609K893865K759874L032267L015577K790332
1737.8E40274739L357709M268408M848420N165458N643606O582439P009268O439447
1754.1E83589494O483674O787300O112338N376458N207002N735934O509840O600499
1770.4F32402539N958021M958212M336536M060805L601611L247738L314197L234207
1786.7F65113866K903045K772927K853930K616107K274156K206325K378583K319515
$$ y = [319912285, 325145125, 331303716, 337410957, 343689740, 351424038, 361728311, 371258199, 379900068, 389646947, 399551302, 410700113, 423031926, 435136259, 448328942, 459035039, 468025595, 477158993, 485133678, 491954148, 497932255, 503414690, 508751392, 513078868, 516316831, 519388735, 522639215, 525782824, 528676689, 531436563, 534468830, 537484407, 540274739, 543632448, 547900856, 552749276, 557914734, 563558340, 570140779, 577150047, 583589494, 590073168, 596860468, 602972806, 608349264, 613556266, 619292200, 625802040, 632402539, 638360560, 643318772, 647655308, 651716113, 655317724, 658565462, 661879659, 665113866, 668016911, 670789838, 673643768, 676259875, 678534031, 680740356, 683118939, 685438454]
1803F85438454J939476J815974K060950K182126J803816J520216J699925J934289J799465
1821.4G02194691J548409J597583J775027J578688J109481J154661J494587J490295
1837.7G13943422J257658J314342J503527J305699Q81195Q10504J141012J259506R88841
1856.1G24405706Q52942J092256J218259J040578R21070R33767Q53657O62923N86570
1874.4G32567728P44819R48310Q07405N72443P01904R93371Q77321M55975M77195P80404
1894.8G39926875P55429N00500N01990P25687P80582N88537M59492N55873O34730N48362
1915.2G45978057M28081M98176N87821L92973K09928L61144M95434L61204K17915L05712
1935.6G49836445N16713N11646K52425J08242K38538K63274J27554J53422L00765K85626
$$ y = [685438454, 687377930, 689193904, 691254854, 693436980, 695240796, 696761012, 698460937, 700395226, 702194691, 703743100, 705340683, 707115710, 708694398, 709803879, 710958540, 712453127, 713943422, 715201080, 716515422, 718018949, 719324648, 720205843, 721016347, 722157359, 723416865, 724405706, 725258648, 726350904, 727569163, 728609741, 729530811, 730464578, 731318235, 731981158, 732567728, 733312547, 734260857, 735068262, 735640705, 736342609, 737335980, 738213301, 738669276, 739146471, 739926875, 740682304, 741182804, 741684794, 742410481, 743191063, 743779600, 744239092, 744794965, 745429695, 745978057, 746406138, 746904314, 747492135, 747885108, 748095036, 748456180, 748951614, 749312818, 749530733, 749836445, 750353158, 750864804, 751117229, 751225471, 751464009, 751727283, 751854837, 752008259, 752309024, 752594650]
1956G52594650J37985J42455K81512L20495J81555Q5533J55926J93596J10149P9811
1976.4G54283667J80900K04861J06871P8142J91033K53498J17839o4016k1458J12355
1996.8G55443692N9664k1159L2246J00911K4020q4519m5002N1856K5154j00077j47640
2019.2G55339146j11580j06097j41441j27018o9141m3094r2149j09315m0531l2723
2039.6G54466057r5785p0155J9968j848p3492n5671K7180K5868q7976j43171o9618
2062.1G53941357j0788l8207r775P9095Q9705P749Q881J29759J70589P5936M5359J63734
2086.6G54653394K17080J09434L3558J28627K34067K00331J28746J73331K54929J94251
2106.9G56327748Q4043J14739K09927J85788J39773K12431K88784K06411Q5056J35779
$$ y = [752594650, 752732635, 752875090, 753156602, 753477097, 753658652, 753744185, 753900111, 754093707, 754203856, 754283667, 754464567, 754669428, 754776299, 754854441, 755045474, 755298972, 755416811, 755352795, 755331337, 755443692, 755503356, 755482197, 755514443, 755615354, 755639374, 755554855, 755509853, 755561709, 755586863, 755486786, 755339146, 755227566, 755121469, 754980028, 754853010, 754783869, 754740775, 754648626, 754539311, 754498780, 754466057, 754370272, 754300117, 754320085, 754318237, 754244745, 754189074, 754216254, 754242122, 754154146, 754010975, 753941357, 753930569, 753892362, 753882587, 753961682, 754051387, 754059136, 754068017, 754197776, 754368365, 754444301, 754489660, 754653394, 754870474, 754979908, 755013466, 755142093, 755376160, 755576491, 755705237, 755878568, 756133497, 756327748, 756411791, 756526530, 756736457, 756922245, 757062018, 757274449, 757563233, 757769644, 757854700, 757990479]
2127.3G57990479K55943K38001J32442J67727K92897K85268J70768J38103K32578K81095
2147.7G60185301K12610J95265L19242L96252K89798J90377K68519L55124K99335K40207
2168.1G62952030L14891M11868L37660K09392K56955L56257L02553K08557K53975L51191
2188.5G65955329L04997J63913J55806K81453L09885J69337J09195K48313L13938J76430
2208.9G68188596Q9109J79469K53380J78814Q1837J47223K67029J91331M9472J07467
2229.3G69733727K30312J69814L5882O6459J99974J90675O9559M3869J11639J08004
2249.7G70959914J669j3531J08958J46627J7703n3287K4736Q1837J5974o2167R596
2272.2G71238029J06454J3292j39237r7871L8803L159j32203j30653r1315j59502k06768
$$ y = [757990479, 758246422, 758484423, 758616865, 758784592, 759077489, 759362757, 759533525, 759671628, 759904206, 760185301, 760397911, 760593176, 760912418, 761308670, 761598468, 761788845, 762057364, 762412488, 762711823, 762952030, 763266921, 763678789, 764016449, 764225841, 764482796, 764839053, 765141606, 765350163, 765604138, 765955329, 766260326, 766424239, 766580045, 766861498, 767171383, 767340720, 767449915, 767698228, 768012166, 768188596, 768277705, 768457174, 768710554, 768889368, 768971205, 769118428, 769385457, 769576788, 769626260, 769733727, 769964039, 770133853, 770169735, 770236194, 770436168, 770626843, 770696402, 770740271, 770851910, 770959914, 770961583, 770948052, 771057010, 771203637, 771221340, 771168053, 771192789, 771274626, 771290600, 771228433, 771238029, 771344483, 771357775, 771218538, 771120667, 771159470, 771162629, 771030426, 770899773, 770808458, 770648956, 770442188]
2294.6G70442188j71602j08838j20044k42114k94208k12372k17318l43919l82722l26693
2315G68022358l58879n28157o25789m88401l26693m28378o00815n36263m12881m65036
2335.4G63251066n30720m36782k99573k14875m4882J35362q8155o84679j188099j224637
2355.8G58674026r62973o29187l48568k56836j62661J2755R9421J16467P7903J6690
2376.2G56637037j6391j18375l25620n35906p40707r60350j134693j249373j277984
2394.5G50277638j092553p12812l40402j13666n8532j08063j79767k77818m44591n91278
2414.9G46358156o20365n82814o25670q15511q74340n81086k43068k18868l74556m09245
2435.3G41012633l75688m55737n52833n38648n00142n37753o32108o71982o18339o00219
$$ y = [770442188, 770270586, 770161748, 770041704, 769799590, 769505382, 769293010, 769075692, 768731773, 768349051, 768022358, 767663479, 767135322, 766509533, 766021132, 765694439, 765266061, 764665246, 764128983, 763716102, 763251066, 762720346, 762283564, 761983991, 761769116, 761724234, 761859596, 761771441, 761086762, 759898663, 758674026, 757711053, 757081866, 756733298, 756476462, 756313801, 756326556, 756425977, 756542444, 756620347, 756637037, 756620646, 756502271, 756176651, 755640745, 754900038, 753939688, 752804995, 751555622, 750277638, 749185085, 748472273, 748131871, 748018205, 747959673, 747851610, 747671843, 747394025, 746949434, 746358156, 745737791, 745154977, 744529307, 743713796, 742839456, 742258370, 742015302, 741796434, 741421878, 741012633, 740636945, 740181208, 739628375, 739089727, 738589585, 738051832, 737419724, 736747742, 736129403, 735529184]
2455.7G35529184o79135p20739o83129o85156p72714q50737q12412p49349p96676q74817
2476.1G27904320q57115p71701p60019q36432q53181q10981q37326q75294q08060p08401
2496.5G19785810p21694q08119q21591p42137p08699p93159q25167p26402o73711p65801
2516.9G12199330q45968p69735o72996p00116p61986p28726o68287p20501q13067p90477
2537.3G04727471p22051p72059q53181q08298p11084p21335q11994q41260p93338p65443
2557.7F96927428q31425q87573q10742p64549q70526r40859q69215q13543r03607j002967
2578.1F88232422r61185r03606r58145j020491r82284r07660r35614j040518j031876
2596.4F79491043r11832q88884j007259j066863r84550r32991r77457j011312r55105
$$ y = [735529184, 734850049, 734129310, 733446181, 732761025, 731988311, 731137574, 730325162, 729575813, 728779137, 727904320, 727047205, 726275504, 725515485, 724679053, 723825872, 723014891, 722177565, 721302271, 720494211, 719785810, 719064116, 718255997, 717434406, 716692269, 715983570, 715190411, 714365244, 713638842, 712965131, 712199330, 711353362, 710583627, 709910631, 709210515, 708448529, 707719803, 707051516, 706331015, 705517948, 704727471, 704005420, 703233361, 702380180, 701571882, 700860798, 700139463, 699327469, 698486209, 697692871, 696927428, 696096003, 695208430, 694397688, 693633139, 692762613, 691821754, 690952539, 690138996, 689235389, 688232422, 687271237, 686367631, 685409486, 684388995, 683406711, 682499051, 681563437, 680522919, 679491043, 678579211, 677690327, 676683068, 675616205, 674631655, 673698664, 672721207, 671709895, 670754790]
2614.8F70754790q92579r60410j036525r50634q51572r19997j027108r75847q45373
2633.2F62294745q94486j071513j043737q54135q38816r81450j012027r05335q76010
2651.5F53817236r95159j049697r39369q76904r71138j038671r71615r17614r96351
2669.9F45060718j105666j074791r81510j046061j148820j069069r70662j060426j196682
2688.2F35407031j164794j052738j079499j216531j254201j154959j130820j236915
2704.5F26116574j268268j189530j181304j283527j328349j237631j188039j301170
2720.9F16138756j384198j307547j217545j203656j210332j163900j083791j061976
2737.2F06505811j077115j028776r32098r43005j064539j089454r81748r48548j068890
$$ y = [670754790, 669862211, 668901801, 667865276, 666914642, 666063070, 665143073, 664115965, 663140118, 662294745, 661400259, 660328746, 659285009, 658430874, 657592058, 656610608, 655598581, 654693246, 653817236, 652822077, 651772380, 650833011, 649956107, 648984969, 647946298, 646974683, 646057069, 645060718, 643955052, 642880261, 641898751, 640852690, 639703870, 638634801, 637664139, 636603713, 635407031, 634242237, 633189499, 632110000, 630893469, 629639268, 628484309, 627353489, 626116574, 624848306, 623658776, 622477472, 621193945, 619865596, 618627965, 617439926, 616138756, 614754558, 613447011, 612229466, 611025810, 609815478, 608651578, 607567787, 606505811, 605428696, 604399920, 603467822, 602524817, 601460278, 600370824, 599389076, 598440528, 597371638]
2755.5E97371638j130045j049041j004100j050890j061022r94086r73642j087845j203715
2773.9E87817252j155913j093507j172662j254022j225769j191497j268685j376331
2790.2E78078866j383841j339257j375198j485467j528561j479924j510918j673341
2806.5E66302359j755178j678169j645445j750410j835525j830578j886904k042830
2822.8E51877320k128065k117693k176583k350628k537251k664268k821028l153026
2839.1E31928778l670037m327059n006432n361379m883349l486394j899243r16481
2855.5E02378404o48618p58767j043677j496166j999080k346307k374649k091527j693994
2873.8D87925619j311094r98705q37237q71926j035750j194776j327067j458794j598299
$$ y = [597371638, 596241593, 595192552, 594188452, 593137562, 592076540, 591082454, 590108812, 589020967, 587817252, 586661339, 585567832, 584395170, 583141148, 581915379, 580723882, 579455197, 578078866, 576695025, 575355768, 573980570, 572495103, 570966542, 569486618, 567975700, 566302359, 564547181, 562869012, 561223567, 559473157, 557637632, 555807054, 553920150, 551877320, 549749255, 547631562, 545454979, 543104351, 540567100, 537902832, 535081804, 531928778, 528258741, 523931682, 518925250, 513563871, 508680522, 505194128, 503294885, 502378404, 501729786, 500971019, 499927342, 498431176, 496432096, 494085789, 491711140, 489619613, 487925619, 486614525, 485615820, 484778583, 483906657, 482870907, 481676131, 480349064, 478890270, 477291971]
2892.2D77291971j734525j820504j892179k004058k108782k219200k450645k826661
2908.5D60235417l298849l809571m170895m069120l412157k491563j650989j025171
2924.8D36307102n51134j32263K60801O28381R74238J326651J651495J827002J801014
2943.2D44093287J616746J317114R32216N12690J74612P8022K69979N98878R48459
2961.5D50542003J347899J754374K057254K239406K373099K423883K320915K170474
2977.8D67229307K030551J842201J630247J429647J222253J012414P54863M36575J42574
2996.2D77730632j33366l80128n76794p76470r44138j014381j015723j055926j123667
3014.5D70710039j130134j143098j252710j392752j444072j405388j383245j413256
$$ y = [477291971, 475557446, 473736942, 471844763, 469840705, 467731923, 465512723, 463062078, 460235417, 456936568, 453126997, 448956102, 444886982, 441474825, 438983262, 437332273, 436307102, 435755968, 435623705, 435884506, 436512887, 437487125, 438813776, 440465271, 442292273, 444093287, 445710033, 447027147, 447959363, 448472053, 448646665, 448724687, 448994666, 449593544, 450542003, 451889902, 453644276, 455701530, 457940936, 460314035, 462737918, 465058833, 467229307, 469259858, 471102059, 472732306, 474161953, 475384206, 476396620, 477151483, 477588058, 477730632, 477597266, 477217138, 476640344, 475863874, 474919736, 473905355, 472889632, 471833706, 470710039, 469579905, 468436807, 467184097, 465791345, 464347273, 462941885, 461558640, 460145384]
3030.9D60145384j414239j396060j429856j470506j466841j442700j429409j449347
3047.2D48646426j471132j453221j432597j415134j388490j360834j303255j227260
3063.5D37594503j186192j166671j113952j028508r65029r38355r27240r55075r88960
3081.9D28324521r60291q96901q50022q54075q97973r17465r05812r03844r36479r91851
3102.2D19209808j048386j088262j107037j109570j079678j085490j171858j251995
3118.6D10267532j308918j367092j379073j370668j420796j482845j507789j504987
3134.9C98925364j472563j472294j556188j623124j613110j569182j541793j582205
3151.2C86494905j633048j657695j654088j637310j654655j666844j681238j692534
$$ y = [460145384, 458731145, 457335085, 455905229, 454434723, 452967882, 451525182, 450095773, 448646426, 447175294, 445722073, 444289476, 442874342, 441485852, 440125018, 438821763, 437594503, 436408311, 435241640, 434127688, 433099180, 432134151, 431195796, 430268556, 429313481, 428324521, 427364230, 426467329, 425617307, 424763232, 423865259, 422947794, 422041982, 421138138, 420201659, 419209808, 418161422, 417073160, 415966123, 414856553, 413776875, 412691385, 411519527, 410267532, 408958614, 407591522, 406212449, 404841781, 403420985, 401938140, 400430351, 398925364, 397452801, 395980507, 394424319, 392801195, 391188085, 389618903, 388077110, 386494905, 384861857, 383204162, 381550074, 379912764, 378258109, 376591265, 374910027, 373217493]
3167.5C73217493j634836j583993j604915j645863j661718j610428j554966j538992
3183.8C60381782j531869j527280j491368j447022j419484j368821j313507j302511
3200.1C48979920j310229j288772j214891j169354j181990j137287j054108j042127
3216.5C39581162j077503j050502j007736j040518j091272j095146j062006j046300
3232.8C31110179j076102j110971j132458j159013j194030j242786j263827j229316
3249.1C21701676j206458j249820j294255j278699j265973j293241j302153j269400
3265.4C11541677j237721j218706j195163j146286j111329j114786j050412r22799
3281.7C02544475q81970q94487q15004o91057o54518o97196p03931o28829n63502n73605
$$ y = [373217493, 371582657, 369998664, 368393749, 366747886, 365086168, 363475740, 361920774, 360381782, 358849913, 357322633, 355831265, 354384243, 352964759, 351595938, 350282431, 348979920, 347669691, 346380919, 345166028, 343996674, 342814684, 341677397, 340623289, 339581162, 338503659, 337453157, 336445421, 335404903, 334313631, 333218485, 332156479, 331110179, 330034077, 328923106, 327790648, 326631635, 325437605, 324194819, 322930992, 321701676, 320495218, 319245398, 317951143, 316672444, 315406471, 314113230, 312811077, 311541677, 310303956, 309085250, 307890087, 306743801, 305632472, 304517686, 303467274, 302544475, 301662505, 300768018, 299953014, 299261957, 298607439, 297910243, 297206312, 296577483, 296013981, 295440376]
3302.1B95440376o12766o20246o16610o51687o76751o76424p17938p86870q33035q54969
3322.5B88393080q63045q84205r26257r09358q36193q10713q64923r27687r40680r19223
3342.9B79510796q55654p58827p33912p91907q17687q14736q03291p30128o38425o27816
3363.3B71938413o66201o39945n71519n82695o15090n49853m82410m96805n23657m76122
3383.7B66334116l82125k95669k82973l46362l54678k79933j72317j15514k07424l22968
3404.1B63574153k64078j35243k7537K2619r566K2113J09911J09792R7513K38270M31239
3426.5B64169186N22197N19514N74916O55443N98341N11587N83499P69288Q82357Q84891
3446.9B70671219Q77946R71318J086980J169771J278638J333654J254350J266957J457840
$$ y = [295440376, 294827610, 294207364, 293590754, 292939067, 292262316, 291585892, 290867954, 290081084, 289248049, 288393080, 287530035, 286645830, 285719573, 284810215, 283974022, 283163309, 282298386, 281370699, 280430019, 279510796, 278655142, 277896315, 277162403, 276370496, 275552809, 274738073, 273934782, 273204654, 272566229, 271938413, 271272212, 270632267, 270060748, 269478053, 268862963, 268313110, 267830700, 267333895, 266810238, 266334116, 265951991, 265656322, 265373349, 265026987, 264672309, 264392376, 264220059, 264104545, 263897121, 263574153, 263310075, 263174832, 263147295, 263169914, 263160348, 263182461, 263292372, 263402164, 263499677, 263737947, 264169186, 264691383, 265210897, 265785813, 266441256, 267039597, 267551184, 268134683, 268903971, 269786328, 270671219, 271549165, 272520483, 273607463, 274777234, 276055872, 277389526, 278643876, 279910833, 281368673]
3465.3B81368673J530796J411677J318275J392425J521647J666963J738995J622707
3481.6B93572158J568287J715809J789809J759350J805216J851529J907855J983911
3497.9C07953924K034306J990468J870751J881629K017647K119512K210080K244443
3514.2C24322760K159298K166569K343267K511770K451181K331763K363265K471775
3530.6C43121648K606362K735406K772242K729714K826989L033340L099143K911389
3546.9C65836233K828509L002077L150344L185183L269285L430902L519208L540158
3563.2C91761899L601164L762841L806680L760785L802270L911316M054964M243195
3579.5D22705114M358411M342288M349291M433781M482627M436463M561543M755110
$$ y = [281368673, 282899469, 284311146, 285629421, 287021846, 288543493, 290210456, 291949451, 293572158, 295140445, 296856254, 298646063, 300405413, 302210629, 304062158, 305970013, 307953924, 309988230, 311978698, 313849449, 315731078, 317748725, 319868237, 322078317, 324322760, 326482058, 328648627, 330991894, 333503664, 335954845, 338286608, 340649873, 343121648, 345728010, 348463416, 351235658, 353965372, 356792361, 359825701, 362924844, 365836233, 368664742, 371666819, 374817163, 378002346, 381271631, 384702533, 388221741, 391761899, 395363063, 399125904, 402932584, 406693369, 410495639, 414406955, 418461919, 422705114, 427063525, 431405813, 435755104, 440188885, 444671512, 449107975, 453669518, 458424628]
3595.8D58424628M828334M814177M793406M821777M892856N059570N112291N114227
3612.1D97861266N160391N090535N148053N277455N020738M874646N055249N423844
3628.5E38912177N471766N018413M939377M960835M940927N046428N044698M919827
3644.8E79254448M951716N097806M796863M259884M119158M277170M144490L874242
3661.1F14775777L748298L714501L665090L540874L456592L222108K782941K496421
3677.4F41402602K499283K551496K697050K834737K655030K019286J627743J730502
3693.7F60017729J808166J811683J720429J489580J438081J635432J720369J475453
3710F73116922J023710R98616J185120J210868J142084J014472Q34167O96778R22084
$$ y = [458424628, 463252962, 468067139, 472860545, 477682322, 482575178, 487634748, 492747039, 497861266, 503021657, 508112192, 513260245, 518537700, 523558438, 528433084, 533488333, 538912177, 544383943, 549402356, 554341733, 559302568, 564243495, 569289923, 574334621, 579254448, 584206164, 589303970, 594100833, 598360717, 602479875, 606757045, 610901535, 614775777, 618524075, 622238576, 625903666, 629444540, 632901132, 636123240, 638906181, 641402602, 643901885, 646453381, 649150431, 651985168, 654640198, 656659484, 658287227, 660017729, 661825895, 663637578, 665358007, 666847587, 668285668, 669921100, 671641469, 673116922, 674140632, 675139248, 676324368, 677535236, 678677320, 679691792, 680525959, 681222737, 682144821]
3728.4F82144821J267910J368522J051307N33879N83708J002073R02057M51565P91430
3746.7F90097272R55105K84136J47879P39813Q88943N27621L90827O14524O72102O15001
3767.1F95933223M88221L57092M58717O36459P13348N03063L31044M40777M67419M48645
3787.5G00778008N02884N53965N74708N29290N62966M29391Q7977L40223M19378P4149
3807.9G04852939K64048O77884O60539L62575M40359K76208r4772J78397L51906L76343
3828.3G08346426M60625M92871N71132L21150q6725M3988J27792J04249M45902Q70407
3848.7G11697817P86006k45332p87318R9540N06341M65930K95221J51515K47002J43588
3869.1G13360310j2637M8697Q5652K98441L00526J55867K14099K444O199K40862K7955
$$ y = [682144821, 683412731, 684781253, 685832560, 686366439, 686950147, 687952220, 688854277, 689305842, 690097272, 691052377, 691336513, 691484392, 692224205, 693113148, 693640769, 694031596, 694646120, 695318222, 695933223, 696421444, 696778536, 697237253, 697873712, 698587060, 699090123, 699421167, 699861944, 700329363, 700778008, 701280892, 701834857, 702409565, 702938855, 703501821, 703931212, 704019189, 704359412, 704778790, 704852939, 705116987, 705794871, 706455410, 706817985, 707258344, 707534552, 707439780, 707618177, 707970083, 708346426, 708807051, 709299922, 709871054, 710192204, 710105479, 710149467, 710277259, 710381508, 710827410, 711697817, 712483823, 712238491, 711451173, 711550713, 712057054, 712522984, 712818205, 712969720, 713216722, 713360310, 713347673, 713396370, 713482022, 713780463, 714080989, 714236856, 714450955, 714453399, 714459598, 714700460, 714728415]
3891.6G14728415n0426K82646M09782K59339L040k87294k57671l3796L0101J40607
3912G15224743K94268K01046k7954m4942O7651L6180J1266J69694K14815J1385j31965
3934.4G16026187r1314L5703J24216P0870N9366J05798L5227n4360o4313k1577M3571
3956.8G16269374J04248Q6904J4782J9312P3016Q7976O1572L7908M1843P4803R9421
3979.3G16971159Q5354P3373K7061o4254j9789J22905J45197Q3506N5075
3997.6G17479587
$$ y = [714728415, 714677989, 714960635, 715370417, 715629756, 715632796, 715345502, 715087831, 715054035, 715084136, 715224743, 715519011, 715720057, 715692103, 715647161, 715714812, 715750992, 715762258, 715931952, 716146767, 716158152, 716026187, 715934873, 715970576, 716094792, 716165662, 716225028, 716330826, 716366053, 716311693, 716247380, 716225803, 716269374, 716373622, 716460526, 716475308, 716494620, 716567636, 716655612, 716717184, 716755092, 716796935, 716871738, 716971159, 717056513, 717129886, 717156947, 717092693, 717072904, 717195809, 717341006, 717424512, 717479587]
##END=$$ End of the data block
