##TITLE=$$ Begin of the data block
##JCAMP-DX=5.00 $$ ACD/SpecManager v 10.08
##SPECTROMETER/DATA SYSTEM=Alpha
##DATE=11 Nov 2014 09:02:30
##DATA TYPE=INFRARED SPECTRUM
##DATA CLASS=XYDATA
##ORIGIN=
##OWNER=
##NPOINTS=1765
##FIRSTX=399.76428223
##LASTX=3997.64306641
##MAXX=3997.64306641
##MINX=399.76428223
##MAXY=0.83814102
##MINY=0.48160750
##XFACTOR=1.0000000000
##YFACTOR=1.000000000000000e-9
##FIRSTY=0.74904960
##DELTAX=2.03961372
##XUNITS=1/CM
##YUNITS=ARBITRARY UNITS
##XYDATA=(X++(Y..Y))
399.8G49049604Q72493j802027k613009o86466M53591j253664k667427j337886K01225
$$ 749049604 749922097 748120070 745507061 744820595 745274186 744020522 741353095 740015209 740216434
418.1G40216434p48217k014935j134694P19607L89397j771509j553655O52432R58741
$$ 740216434 739468217 737453282 736318588 737038195 737427592 735656083 734102428 734754860 735713601
436.5G35713601q78274j716316k93195O57320n45502j367331j95205R98080k51770
$$ 735713601 734835327 733119011 732825816 733483136 732937634 731570303 731375098 732373178 732121408
454.8G32121408k520382j850367R34958J033068j311719k145589l98576P14660n79894
$$ 732121408 729601026 727750659 728685617 729718685 728406966 726261377 725862801 726577461 725997567
473.2G25997567j696884l91126J262665K93672j929522j608193P13527R80616j111388
$$ 725997567 724300683 723909557 725172222 725465894 723536372 721928179 722641706 723622322 722510934
491.5G22510934j687825K14994J056850o37233k144158j029134O77586N8293j672268
$$ 722510934 720823109 721038103 722094953 721457720 719313562 718284428 718962014 719020307 717348039
509.9G17348039j672625k59042n4538j653493k312302o14465P13289m01020j819491
$$ 717348039 715675414 715416372 715361834 713708341 711396039 710781574 711494863 711093843 709274352
528.3G09274352j027048N48482L17633j046181q96036P50661J596212O08504m94242
$$ 709274352 708247304 708795786 709113419 708067238 707171202 707921863 709518075 710126579 709632337
546.6G09632337J08123J136422M05490j160204j131177K75076P50422j97470o10233
$$ 709632337 709740460 710876882 711282372 710122168 708990991 709266067 710016489 709819019 709208786
565G09208786L07024R49860N960j210034p12693O93560P12991n45859q00133M91142
$$ 709208786 709515810 710465670 710471630 709261596 708548903 709242463 709955454 709409595 708609462 709100604
585.4G09100604J247466K28524r76503l99113Q84772N98609p45714q71002L33905P01249
$$ 709100604 710348070 710576594 709600091 709200978 710085750 710684359 709938645 709067643 709401548 710102797
605.8G10102797m98355j441181p97867K16961o2526q53240q8215J752436K218247J044571
$$ 710102797 709604442 708163261 707365394 707582355 707519829 706666589 706578374 708330810 710549057 711593628
626.2G11593628M99308J340568J774848O62386m67002K25365J691580J598239K66790
$$ 711593628 712092936 713433504 715208352 715870738 715403736 715629101 717320681 718918920 719185710
644.5G19185710O4969J352012J946628Q11518k08021M31538J359463O13928p22230
$$ 719185710 719250679 720602691 722549319 723360837 723152816 723584354 724943817 725557745 724835515
662.9G24835515l18289J639545K340198L34263j7763J373768K409458J621366K93732
$$ 724835515 724517226 726156771 728496969 728831232 728813469 730187237 732596695 734218061 734511793
681.2G34511793M71770J596868J410246r1493n87702N22316J219451K89023o52551
$$ 734511793 734983563 736580431 737990677 737899184 737311482 737833798 739053249 739342272 738689721
699.6G38689721J13487J550317J568734M74751L59595J531601K131760J264632M70519
$$ 738689721 738803208 740353525 741922259 742397010 742756605 744288206 746419966 747684598 748155117
717.9G48155117J152933K223670J922846R41515J051903K059042K108097Q03352J8835
$$ 748155117 749308050 751531720 753454566 754396081 755447984 757507026 759615123 760418475 760437310
736.3G60437310P67290J544595R19283p9871J62542J145184J097858p9036n65886L18587
$$ 760437310 761204600 762749195 763668478 763588607 763751149 764896333 765994191 765915155 765349269 765667856
756.7G65667856R94563L53813l85582K54511J488448J500010M84765K33948J183152
$$ 765667856 766662419 767016232 766630650 766885161 768373609 769873619 770358384 770592332 771775484
775.1G71775484J798987J187087N53190J064956J952947J714348O11961M06444J410544
$$ 771775484 773574471 774761558 775314748 776379704 778332651 780046999 780658960 781065404 782475948
793.4G82475948J952470J148045K41458N42879J287103R53972q1956j90318P90656
$$ 782475948 784428418 785576463 785817921 786360800 787647903 788601875 788519919 788329601 789120257
811.8G89120257J246512L92556m43637j33932K47061m78148j192212m07160J154900
$$ 789120257 790366769 790759325 790315688 790181756 790428817 789950669 788758457 788351297 789506197
830.1G89506197J678407R49145N90026J639008K849639K362311Q06868L60787R70721
$$ 789506197 791184604 792133749 792723775 794362783 797212422 799574733 800381601 800742388 801713109
848.5H01713109Q30233k20775n66066M91679J495242R25720k49028j68741O78599M35948
$$ 801713109 802543342 802322567 801756501 802248180 803743422 804669142 804420114 804251373 804929972 805365920
868.9H05365920q85427j408875n41568N186r53555k105057j793802q24809j019240
$$ 805365920 804480493 803071618 802530050 802535236 801581681 799476624 797682822 796858013 795838773
887.2G95838773k024472j948297n57780L66271p7844m99368L00110J140654N25772
$$ 795838773 793814301 791866004 791308224 791674495 791596651 791097283 791397393 792538047 793063819
905.6G93063819q18133j137316m02332k95460j342237j967489j118601n1021k92123
$$ 793063819 792245686 791108370 790706038 790410578 789068341 787100852 785982251 785931230 785639107
923.9G85639107j141906j012682j84894l54171j769364k716183k378941k143860l120303
$$ 785639107 784497201 783484519 783299625 782945454 781176090 778459907 776080966 773937106 770816803
942.3G70816803m234850m050553l044963k684653l067851k891779j754463r95278j529455
$$ 770816803 766581953 762531400 759486437 756801784 753733933 750842154 749087691 748092413 746562958
960.7G46562958k305269k060116j438439j900792l232598l906727l648221l798843
$$ 746562958 744257689 742197573 740759134 738858342 735625744 731719017 728070796 724271953
977G24271953m950523n898714n564094m627168m341364m565299m152178l044606k556800
$$ 724271953 719321430 713422716 707858622 703231454 698890090 694324791 690172613 687128007 684571207
995.3F84571207l245950l997326l862858l432691l679276m266619m078627l165424
$$ 684571207 681325257 677327931 673465073 670032382 666353106 662086487 658007860 654842436
1011.6F54842436k639770k804160k699256j731873o97315n14328p50124l72470M95493
$$ 654842436 652202666 649398506 646699250 644967377 644270062 643755734 643005610 642633140 643128633
1030F43128633Q35360M63843K72870O77168Q53360J00136q47340q35776n8651K82943
$$ 643128633 643963993 644427836 644700706 645377874 646231234 646331370 645484030 644648254 644589603 644872546
1050.4F44872546j08599k62559K88963P29621M25696m0591J2935K67982j4484p46488
$$ 644872546 644763947 644501388 644790351 645519972 645945668 645905077 645918012 646185994 646171510 645425022
1070.8F45425022r02832p15J102328J508355J558483J975477K434015K044260R33290
$$ 645425022 644522190 644521475 645623803 647132158 648690641 650666118 653100133 655144393 656077683
1089.2F56077683J87457K00390K00808k88069o73234l13461M90904R08136Q80122J186431
$$ 656077683 656265140 656465530 656666338 656378269 655705035 655391574 655882478 656790614 657670736 658857167
1109.6F58857167K056300K687276K510607K072632K128005K425671K178371J547158
$$ 658857167 660913467 663600743 666111350 668183982 670311987 672737658 674916029 676463187
1125.9F76463187J528740K304613K643049J831889Q62420O07133O01172J54495l84211
$$ 676463187 677991927 680296540 682939589 684771478 685633898 686241031 686842203 686996698 686612487
1144.2F86612487j36137Q08358J405716J306534J376211K192021L096700L374338L469169
$$ 686612487 686476350 687284708 688690424 689996958 691373169 693565190 696661890 700036228 703505397
1162.6G03505397M253030N539298O233871N997121N733132O032467O180764N452454
$$ 703505397 707758427 713297725 719531596 725528717 731261849 737294316 743475080 748927534
1178.9G48927534M365325L873229L805101L175497J896143R02473N89669K36631o77288
$$ 748927534 753292859 757166088 760971189 764146686 766042829 766945302 767534971 767771602 767094314
1197.3G67094314j497149j421094q10504o28948r93908j083851o64234n55932j229823
$$ 767094314 765597165 764176071 763365567 762736619 761742711 760658860 759994626 759438694 758208871
1215.6G58208871j953185j926779j563788j675427k135873k128839j522899j102388
$$ 758208871 756255686 754328907 752765119 751089692 748953819 746824980 745302081 744199693
1231.9G44199693j239180j311839q04842j66177n7578l06309j90019L59952O22750
$$ 744199693 742960513 741648674 740843832 740677655 740620077 740313768 740123749 740483701 741106451
1250.3G41106451K57253q8453J50025N70237N19634J90615L45648R25719J121283P16925
$$ 741106451 741363704 741275251 741425276 741995513 742515147 742705762 743051410 743977129 745098412 745815337
1270.7G45815337M27544O92248R47178N81324j8061r4413K60830K95043k09332o04033
$$ 745815337 746242881 746935129 747882307 748463631 748445570 748351157 748611987 748907030 748697698 748093665
1291.1G48093665n20409m41968r28044j606703j731753j430273j462758j979828k260745
$$ 748093665 747573256 747131288 746203244 744596541 742864788 741434515 739971757 737991929 735731184
1309.4G35731184j965105j626730j722217j903653j540005q54373p40468j174212j340330
$$ 735731184 733766079 732139349 730417132 728513479 726973474 726119101 725378633 724204421 722864091
1327.8G22864091r77397o49154q10086j071871q62419k06292Q0705k44379m87805l54349
$$ 722864091 721886694 721237540 720427454 719355583 718493164 718286872 718367577 718123198 717635393 717281044
1348.2G17281044l26038o78360r79245q61287p16925j219749k016306k111316j863420
$$ 717281044 716955006 716276646 715297401 714436114 713719189 712499440 710483134 708371818 706508398
1366.6G06508398k242446k994478l945291m771411n540133j0293066k1526098k5871218
$$ 706508398 704265952 701271474 697326183 692554772 687014639 676721573 655195475 629324257
1382.9F29324257p079780K0181418K5264263J2692273M469931J507044J24752n71251
$$ 629324257 622244477 642425895 667690158 680382431 684852362 686359406 686484158 685912907
1399.2F85912907l60072J71483L86953L73364L64303O03497Q85547P24315L45052P90417
$$ 685912907 685552835 685724318 686111271 686484635 686848938 687452435 688337982 689062297 689407349 690197766
1419.6F90197766J680136J883387J723349J562536J632035J808941J516640J106084
$$ 690197766 691877902 693761289 695484638 697047174 698679209 700488150 702004790 703110874
1435.9G03110874J411199J751900J472771R26435N98967P76470J098275R38952N55337
$$ 703110874 704522073 706273973 707746744 708673179 709272146 710048616 711146891 712085843 712641180
1454.3G12641180O71863K019286K640844K064109J919269K618969L127098L316998
$$ 712641180 713313043 715332329 717973173 720037282 721956551 724575520 727702618 731019616
1470.6G31019616M184187N008220M843176M094183L110230K390325J805723J030981
$$ 731019616 735203803 740212023 745055199 749149382 752259612 754649937 756455660 757486641
1486.9G57486641J06097l10243l41713j021087k187073k529264k129674j973927l037214
$$ 757486641 757592738 757282495 756940782 755919695 753732622 751203358 749073684 747099757 744062543
1505.2G44062543m435718k522350j216590j430690j773834j728177j317382j108408
$$ 744062543 739626825 737104475 735887885 734457195 732683361 730955184 729637802 728529394
1521.6G28529394p66218q82268j306236j129031j249552j630723j215399j325607k321720
$$ 728529394 727763176 726880908 725574672 724445641 723196089 721565366 720349967 719024360 716702640
1539.9G16702640j567662k90274p8023j3351J25110L36051K91467l5465m44114N87701
$$ 716702640 715134978 714844704 714766681 714753330 714878440 715214491 715505958 715470493 715026379 715614080
1560.3G15614080J286567N76853N2035k79426n44429o08027j348496k328097j951874
$$ 715614080 716900647 717477500 717529535 717250109 716705680 716097653 714749157 712421060 710469186
1578.7G10469186j941323k745092l148019l286183l589153l949106l998935l700734
$$ 710469186 708527863 705782771 702634752 699348569 695759416 691810310 687811375 684110641
1595F84110641l296852l192901l338456l239453k935946k980948l311515l195762k811015
$$ 684110641 680813789 677620888 674282432 671042979 668107033 665126085 661814570 658618808 655807793
1613.4F55807793l305554m031301k952099k492904l069401k976596k896667k749681
$$ 655807793 652502239 648470938 645518839 643025935 639956534 636979938 634083271 631333590
1629.7F31333590j975298j885057k481758j405180p6354K86580K33948j0371O44922
$$ 631333590 629358292 627473235 624991477 623586297 623509943 623796523 624030471 624020100 624665022
1648F24665022J366258J110374J676202K651394K677738K759874L091753L454089L322601
$$ 624665022 626031280 627141654 628817856 631469250 634146988 636906862 639998615 643452704 646775305
1666.4F46775305L516317M353225M326105M250288M749417M644335M118323L975749
$$ 646775305 650291622 654644847 658970952 663221240 667970657 672614992 676733315 680709064
1682.7F80709064N265415N758702N113721N028904M521668M566550N135953M985393
$$ 680709064 685974479 691733181 696846902 701875806 706397474 710964024 716099977 721085370
1699G21085370N302250M642844L886461L809452L110230K254487J711308J273275J025200
$$ 721085370 726387620 731030464 734916925 738726377 741836607 744091094 745802402 747075677 748100877
1717.4G48100877J220822J280308J118779J050890P77363M97938M37617O68347J411319
$$ 748100877 749321699 750602007 751720786 752771676 753549039 754046977 754484594 755152941 756564260
1735.7G56564260J491010J379549J889527K299309K220154K163827K692282L465474
$$ 756564260 758055270 759434819 761324346 763623655 765843809 768007636 770699918 774165392
1752G74165392L275752K788246K819299K890766K918065K709210K294898K203285K195716
$$ 774165392 777441144 780229390 783048689 785939455 788857520 791566730 793861628 796064913 798260629
1770.4G98260629K052903J973510J861870J753807J568854J207292R92835J198769
$$ 798260629 800313532 802287042 804148912 805902719 807471573 808678865 809671700 810870469
1786.7H10870469J247942O85155M12465R45627J219869R09686N64694O46830R36329
$$ 810870469 812118411 812803566 813216031 814161658 815381527 816291213 816855907 817502737 818439066
1805.1H18439066R68695N84483K97427N49019Q40366P10666M25041L31878M32909N50747
$$ 818439066 819407761 819992244 820289671 820838690 821679056 822389722 822814763 823146641 823579550 824130297
1825.5H24130297L50833O9856M55618Q80599O14464K38359K42949L36766K38598K49385
$$ 824130297 824481130 824550986 825006604 825887203 826501667 826740026 826982975 827319741 827558339 827807724
1845.9H27807724L70563N14447O42181M38690R4712R4354M03583M90486J67311k09391
$$ 827807724 828178287 828692734 829334915 829773605 829868317 829962671 830366254 830856740 831024051 830814660
1866.3H30814660p8082N16831N96762K06769J19805L42131L42309R8348j79J13428
$$ 830814660 830736578 831253409 831850171 832056940 832176745 832518876 832861185 832959533 832959354 833072782
1886.7H33072782J57833J37925R9957J19805L39568L72648P9334p3672J14739K48492
$$ 833072782 833230615 833368540 833468497 833588302 833927870 834300518 834379852 834306180 834420919 834669411
1907.1H34669411R0480k8431J14023K30611J18792j1266o5088N5969K90453J95921
$$ 834669411 834759891 834731460 834845483 835076094 835194886 835183620 835118532 835174501 835464954 835660875
1927.5H35660875n3287l0756J54376J67549l8683k11478j51694J01805J79649L397
$$ 835660875 835607588 835576832 835731208 835898757 835860074 835648596 835496902 835598707 835778356 835781753
1947.9H35781753k7418J11103R3460q8870j56999m590J11699k5630j96218o0916J91689
$$ 835781753 835754335 835865438 835958898 835870028 835713029 835708439 835820138 835794508 835598290 835537374 835729063
1970.3H35729063J58369q9764j96398l3438J10626J6034j38939j07884L5465o974j71781
$$ 835729063 835887432 835797668 835601270 835567832 835678458 835694492 835555553 835447669 835483134 835476160 835304379
1992.7H35304379j38103L8206J08004m1902k20657j34170N0545N186j89007k29060
$$ 835304379 835166276 835204482 835312486 835270584 835049927 834915757 834966302 834971488 834782481 834553421
2013.1H34553421r1553p332q5234j94788j41204N365k0385k13146k48134n6804L1531
$$ 834553421 834461868 834454536 834369302 834174514 834033310 834038675 834018290 833805144 833557010 833500206 833531737
2035.6H33531737j17778k38717j25349M1843j5795k00034j93476k1100N4717n7459
$$ 833531737 833413959 833175242 833049893 833091736 833075941 832875907 832682431 832661331 832716048 832658589
2056H32658589j65582o0201Q7560k027j73747j28150N1140O6579j12117j73807n781
$$ 832658589 832493007 832432806 832520366 832518339 832344592 832216442 832267582 832334161 832222044 832048237 832042456
2078.4H32042456J31905K4378j71661j54257K7656P3433p3135j16825N4002J69099
$$ 832042456 832174361 832198739 832027078 831872821 831900477 831973910 831900775 831783950 831837952 832007051
2098.8H32007051N6028q8334m3392R0301O7234r1851r8109Q7857J47998k6762j33872
$$ 832007051 832063079 831974745 831931353 832021654 832088888 831997037 831898928 831986785 832134783 832108021 831974149
2121.2H31974149j9491J10030N5015q5354n8829R9301J51575K6583o2823N1200J58012
$$ 831974149 831954658 832064688 832119703 832034349 831975520 832074821 832226396 832252979 832190156 832241356 832399368
2143.7H32399368N9784q4460p3671P1346J50025N6029l1174M4108J59323J25706R597
$$ 832399368 832459152 832374692 832301021 832372367 832522392 832578421 832547247 832591355 832750678 832876384 832885981
2166.1H32885981K0444J48177J75834N3942l040R3520J62244Q2016n365N9247J92523
$$ 832885981 832906425 833054602 833230436 833284378 833281338 833374858 833537102 833619118 833613753 833673000 833865523
2188.5H33865523J99557O9618n782N3048J17302Q3089R418L3438J25468J12653J2755
$$ 833865523 834065080 834134698 834128916 834181964 834299266 834382355 834391773 834425211 834550679 834663332 834676087
2211H34676087k1994K6226P8678O1095r54J6034J05381J20759L4988k4200J4663N4657
$$ 834676087 834654093 834680319 834758997 834820092 834819138 834835172 834940553 835061312 835096300 835072100 835086763 835141420
2235.4H35141420M0114M2379O5148P0334M9650J2458q047J1682M5777L4630M709K7776
$$ 835141420 835181534 835223913 835289061 835359395 835409045 835421503 835413456 835425138 835470915 835505545 835510254 835538030
2259.9H35538030P0393N7995J79l1054J5795O5684k741q8275m2498K7180J6808j1861
$$ 835538030 835608423 835666418 835666597 835635543 835651338 835717022 835714281 835626006 835583508 835610688 835627496 835615635
2284.4H35615635j1206K9445N9187L1710J4067P1764J34647R3817J0968M1842J82569
$$ 835615635 835604429 835633874 835693061 835724771 835738838 835810602 835945249 836039066 836050034 836091876 836274445
2306.8H36274445K37703J40846O9499J19090K21074K73943K38120K01047J93059J27316
$$ 836274445 836512148 836652994 836722493 836841583 837062657 837336600 837574720 837775767 837968826 838096142
2327.2H38096142K0563m5657n5551n0307k2530l6955j77145l98874o73592n68688j0074
$$ 838096142 838116705 838071048 838015497 837965190 837942660 837905705 837728560 837329686 836656094 836087406 836077332
2349.7H36077332N21124P20799N84364K37405j72496m10020o03616p78854p71344p18236
$$ 836077332 836598456 837319255 837903619 838141024 837968528 837558508 836954892 836176038 835404694 834686458
2370.1H34686458p30872p72953p93517p21812o21080n72026n09560l68774k33472k21371
$$ 834686458 833955586 833182633 832389116 831667304 831046224 830474198 829964638 829595864 829362392 829141021
2390.4H29141021k53618Tk36153j86384j73867k09868j81377j22606j56522k44141
$$ 829141021 828887403 828633785 828397632 828211248 828037381 827827513 827646136 827523530 827367008 827122867
2410.8H27122867k67982k37704k46405l02732m03703n44190n51403k69651Q4579J67787
$$ 827122867 826854885 826617181 826370776 826068044 825664341 825120151 824568748 824299097 824383676 824551463
2431.2H24551463L2544p1287j30772j99736k20477j75417j50919j95384k65896l11732
$$ 824551463 824584007 824512720 824381948 824182212 823961735 823786318 823635399 823440015 823174119 822862387
2451.6H22862387k96474k40028k06113k03669k03967k04205k31624k76565k96474k83718
$$ 822862387 822565913 822325885 822119772 821916103 821712136 821507931 821276307 820999742 820703268 820419550
2472H20419550k73168k95878l09050k70247k24710k35378l05236l56674l21269k74599
$$ 820419550 820146382 819850504 819541454 819271207 819046497 818811119 818505883 818149209 817827940 817553341
2492.4H17553341k72214k53916k34246k53737k82288l07619l09944k59281k23994k46286
$$ 817553341 817281127 817027211 816792965 816539228 816256940 815949321 815639377 815380096 815156102 814909816
2512.8H14909816k72572k67685k72035l09825k95341k45333k51889k81751k92480k79069
$$ 814909816 814637244 814369559 814097524 813787699 813492358 813247025 812995136 812713385 812420905 812141836
2533.2H12141836k51949k47896k84195l10302l00347k92063l05772l16858k91765k45392
$$ 812141836 811889887 811641991 811357796 811047494 810747147 810455084 810149312 809832454 809540689 809295297
2553.6H09295297k21372k65062l32117l18766k66134k84672l43442l33846k79963k56955
$$ 809295297 809073925 808808863 808476746 808157980 807891846 807607174 807263732 806929886 806649923 806392968
2574H06392968k74778l33249l94464l97861l35991k77341k77280k95222l05176l37720
$$ 806392968 806118190 805784941 805390477 804992616 804656625 804379284 804102004 803806782 803501606 803163886
2594.4H03163886l77297l90947l79622l56436l28124l32474l61562l52442l45886l88742
$$ 803163886 802786589 802395642 802016020 801659584 801331460 800998986 800637424 800284982 799939096 799550354
2614.8G99550354m15980m00842l90946l72589l49104l75569m01795m06206m73261n24223
$$ 799550354 799134374 798733532 798342586 797969997 797620893 797245324 796843529 796437323 795964062 795439839
2635.2G95439839m36306l52621l84748m37379m33683m08292m20749m58956m84049m65036
$$ 795439839 795003533 794650912 794266164 793828785 793395102 792986810 792566061 792107105 791623056 791158020
2655.6G91158020m23192m25041m59373m39167l72648l95179m82500m96924m50313m12226
$$ 791158020 790734828 790309787 789850414 789411247 789038599 788643420 788160920 787663996 787213683 786801457
2676G86801457m07934m33564m49657m53055m69446m83394m66347m19140m00245m51565
$$ 786801457 786393523 785959959 785510302 785057247 784587801 784104407 783638060 783218920 782818675 782367110
2696.4G82367110m85182m39941m17591m92274n73993n43118m62770m60923m83691m55916
$$ 782367110 781881928 781441987 781024396 780532122 779958129 779415011 778952241 778491318 778007627 777551711
2716.8G77551711m35114m74215n16355n07116m93050n13255n33760n16653m51446l88682
$$ 777551711 777116597 776642382 776126027 775618911 775125861 774612606 774078846 773562193 773110747 772722065
2737.2G72722065m05848m74453m79340l84927l14414l78549m90070m98295m36187m58598
$$ 772722065 772316217 771841764 771362424 770977497 770663083 770284534 769794464 769296169 768859982 768401384
2757.6G68401384n31077n14030m22419l70323m20571m92215m66823m29571n08845o06060
$$ 768401384 767870307 767356277 766933858 766563535 766142964 765650749 765183926 764754355 764245510 763639450
2778G63639450o26564n96940n66125n48482n14627n14924n90146o66797o72281o51955
$$ 763639450 763012886 762415946 761849821 761301339 760786712 760271788 759681642 759014845 758342564 757690609
2798.4G57690609o98090p77781p96616p29978o64294p22349q64744r26852q97885q71539
$$ 757690609 756992519 756214738 755418122 754688144 754023850 753301501 752436757 751509905 750612020 749740481
2818.8G49740481q93414r69052j020431j018823j052200j147986j276970j378238j435280
$$ 749740481 748847067 747878015 746857584 745838761 744786561 743638575 742361605 740983367 739548087
2837.1G39548087j670003k133071k525687k789796k988994k910972k335012j426935
$$ 739548087 737878084 735745013 733219326 730429530 727440536 724529564 722194552 720767617
2853.4G20767617o48975k48432j83165l63231o43253r07302j154602j243472j034319
$$ 720767617 720118642 719870210 719687045 719323814 718680561 717773259 716618657 715375185 714340866
2871.8G14340866q15750p90953p10488n18620m46617n50687p21276q60095r19402r31621
$$ 714340866 713525116 712734163 712023675 711505055 711058438 710507751 709786475 708926380 708006978 707075357
2892.2G07075357r80913j090646j204133j266837j285315j319229j437486j630783
$$ 707075357 706094444 705003798 703799665 702532828 701247513 699928284 698490798 696860015
2908.5F96860015j853704k148986k511620k698720k513587k084315j548708r58085
$$ 696860015 695006311 692857325 690345705 687646985 685133398 683049083 681500375 680542290
2924.8F80542290l77476R5367L48270N70536R17435J186728J314759J446963J519024
$$ 680542290 680164814 680260181 680608451 681178987 682096422 683283150 684597909 686044872 687563896
2943.2F87563896J332760R06229N04136L20256J49012p9334n8711K54512O49691R30667
$$ 687563896 688896656 689802885 690307021 690627277 690776289 690696955 690638244 690892756 691542447 692473114
2963.6F92473114J113474J342416J556754J681983J697421J581014J491546J433909
$$ 692473114 693586588 694929004 696485758 698167741 699865162 701446176 702937722 704371631
2979.9G04371631J199842R35852Q44419Q16524P88570O49035L28779Q5294m8757k11179
$$ 704371631 705571473 706507325 707351744 708168268 708956838 709605873 709934652 710019946 709971189 709760010
3000.3G09760010l27646l97683m29272l61026k58743l06011n41031p60853q16226q00729
$$ 709760010 709432364 709034681 708605409 708244383 707985640 707679629 707138598 706377745 705561519 704760790
3020.7G04760790q16047q45373q47340p69555o92725p03812q21710r66787q98778p44999
$$ 704760790 703944743 703099370 702252030 701482475 700789750 700085938 699264228 698297441 697398663 696653664
3041.1F96653664q22961j008690j077532j026154r79900j004994j002968r96112j033068
$$ 696653664 695830703 694822013 693744481 692718327 691738427 690733433 689730465 688734353 687701285
3059.4F87701285r93788q61168p46310p87914r50694r92477q41021o51181o18637p53581
$$ 687701285 686707497 685846329 685100019 684312105 683361411 682368934 681527913 680876732 680258095 679504514
3079.8F79504514q61705r05990r50575r09567q49605r62495j114071j043856q18133
$$ 679504514 678642809 677736819 676786244 675876677 675027072 674064577 672950506 671906650 671088517
3098.2F71088517p68841r61363j090050j010477q89957r37581j004756q89599q20816
$$ 671088517 670319676 669358313 668268263 667257786 666367829 665430248 664425492 663535893 662715077
3116.5F62715077r32872j163185j389205j397490j233519j112163j148581j253188
$$ 662715077 661782205 660619020 659229815 657832325 656598806 655486643 654338062 653084874
3132.8F53084874j203477j045525j089096j346708j438439j311361j256526j222491
$$ 653084874 651881397 650835872 649746776 648400068 646961629 645650268 644393742 643171251
3149.2F43171251j141668j252651j484573j536548j474023j434564j405955j426339
$$ 643171251 642029583 640776932 639292359 637755811 636281788 634847224 633441269 632014930
3165.5F32014930j462579j453995j444936j467705j469552j421035j396775j438558
$$ 632014930 630552351 629098356 627653420 626185715 624716163 623295128 621898353 620459795
3181.8F20459795j488507j489937j432061j387596j406849j455128j482129j420260
$$ 620459795 618971288 617481351 616049290 614661694 613254845 611799717 610317588 608897328
3198.1F08897328j333058j355826j401961j352966j300812j323879j346111j311719
$$ 608897328 607564270 606208444 604806483 603453517 602152705 600828826 599482715 598170996
3214.4E98170996j273692j294315j340210j323104j269043j259327j266121j201213
$$ 598170996 596897304 595602989 594262779 592939675 591670632 590411305 589145184 587943971
3230.7E87943971j111150j178860j354933j404822j307964j204074j118123j119614
$$ 587943971 586832821 585653961 584299028 582894206 581586242 580382168 579264045 578144431
3247.1E78144431j305103j401901j254261j164556j259982j315177j254677j185358
$$ 578144431 576839328 575437427 574183166 573018610 571758628 570443451 569188774 568003416
3263.4E68003416j130998j072943j026690j075387j184345j227498j210570j137018
$$ 568003416 566872418 565799475 564772785 563697398 562513053 561285555 560074985 558937967
3279.7E58937967j052082j035928j022101r48727q56638q53181r66966j054883j088440
$$ 558937967 557885885 556849957 555827856 554879129 554022491 553169310 552202344 551147461 550059021
3298E50059021j086414r81927q19206q20101j065254j310468j353621j240671j168966
$$ 550059021 548972607 547990680 547171474 546351373 545286119 543975651 542622030 541381359 540212393
3316.4E40212393j206458j278758j308083j269699j321256j448869j457870j414061
$$ 540212393 539005935 537727177 536419094 535149395 533828139 532379270 530921400 529507339
3332.7E29507339j352191j230836j284301j499653j566470j528144j456916j331687
$$ 529507339 528155148 526924312 525640011 524140358 522573888 521045744 519588828 518257141
3349E18257141j380622j584888j609504j424968j286507j316965j355648j220524j078069
$$ 518257141 516876519 515291631 513682127 512257159 510970652 509653687 508298039 507077515 505999446
3367.4E05999446j227260j538396j583278j361787j214087j180679j169264j155883
$$ 505999446 504772186 503233790 501650512 500288725 499074638 497893959 496724695 495568812
3383.7D95568812j081824q61705o11037o74486r99659j080305p48634m93914p69555
$$ 495568812 494486988 493625283 493014246 492339760 491340101 490259796 489511162 489017248 488247693
3402.1D88247693j158596j028448o23017m42952n01097o40541o83516n37396m03106
$$ 488247693 487089097 486060649 485437632 484994680 484493583 483853042 483169526 482632130 482229024
3420.4D82229024l59714k36004k5809J25229O9559M8548K24948J43468j95175k08289
$$ 482229024 481869310 481633306 481607497 481732726 481802285 481850833 482075781 482219249 482024074 481815785
3440.8D81815785J28240L89367M36485M08858M55200N70357O57916P46102Q54432P83444
$$ 481815785 481944025 482333392 482769877 483178735 483633935 484204292 484862208 485608310 486462742 487246186
3461.2D87246186P41750J040935J230836R54956O29246O68556R21547J172543J207530
$$ 487246186 487987936 489028871 490259707 491214663 491843909 492512465 493434012 494606555 495814085
3479.6D95814085J010835J033783J259893J236767J117051J209139J372457J457274
$$ 495814085 496824920 497858703 499118596 500355363 501472414 502681553 504054010 505511284
3495.9E05511284J389861J319051J370907J311004J198351J342893J603186J721382
$$ 505511284 506901145 508220196 509591103 510902107 512100458 513443351 515046537 516767919
3512.2E16767919J603901J413346J444399J639247J826167J743257J504243J566112
$$ 516767919 518371820 519785166 521229565 522868812 524694979 526438236 527942479 529508591
3528.5E29508591J781583J889228K007068K029597J913369J996577K166748K106905
$$ 529508591 531290174 533179402 535186470 537216067 539129436 541126013 543292761 545399666
3544.8E45399666J867533J773178J962900K233208K313315K266705K315462K342880
$$ 545399666 547267199 549040377 551003277 553236485 555549800 557816505 560131967 562474847
3561.1E62474847K110779J918197K440452L059745K910257K625525K580881K629399
$$ 562474847 564585626 566503823 568944275 572004020 574914277 577539802 580120683 582750082
3577.5E82750082K786160K938628K837419K603472K677977L016769K979160K867997
$$ 582750082 585536242 588474870 591312289 593915761 596593738 599610507 602589667 605457664
3593.8F05457664L051102L233552L212571L120065K890050K618849K797485L085017
$$ 605457664 608508766 611742318 614954889 618074954 620965004 623583853 626381338 629466355
3610.1F29466355L063619L097773L023862L131807L629327L452242K719819K196968
$$ 629466355 632529974 635627747 638651609 641783416 645412743 648864985 651584804 653781772
3626.4F53781772K710521L740072L515840L093242K841294K631664K626896K562821
$$ 653781772 656492293 660232365 663748205 666841447 669682741 672314405 674941301 677504122
3642.7F77504122K213538J988888K689957L474594K875268K350688K714276K753616
$$ 677504122 679717660 681706548 684396505 687871099 690746367 693097055 695811331 698564947
3659F98564947K177834J787126J559258J209318J293242J772464J437723J377702J954615
$$ 698564947 700742781 702529907 704089165 705298483 706591725 708364189 709801912 711179614 713134229
3677.4G13134229J841784J600742J412451J025439Q32498J048982J285553J269102
$$ 713134229 714976013 716576755 717989206 719014645 719847143 720896125 722181678 723450780
3693.7G23450780J032472O94394N02824P08461Q85010N62251J25646L8445N78285J025557
$$ 723450780 724483252 725177646 725680470 726388931 727273941 727836192 727961838 728000283 728578568 729604125
3714.1G29604125P92861M29451K37346K19345L52741N35011L99172p8618k97726J22071
$$ 729604125 730396986 730826437 731063783 731283128 731635869 732170880 732570052 732491434 732193708 732315779
3734.5G32315779P89106P72595M5478m66823p689M38273o199J26243Q35955P38084
$$ 732315779 733104885 733877480 733922958 733456135 733448446 733886719 733880520 734006763 734842718 735580802
3754.9G35580802L38376L21090M67181L04103M2200k6822J39356M01139M27246K11775
$$ 735580802 735919178 736240268 736707449 737011552 737053752 737026930 737166286 737567425 737994671 738206446
3775.3G38206446M7505J08421J60396P2062O9618J54615K20418J58727p8201j97471
$$ 738206446 738253951 738362372 738522768 738594830 738664448 738819063 739039481 739198208 739120007 738922536
3795.7G38922536j90794k89738m0353K54155J53362L12209L89994K7060l07917k00570
$$ 738922536 738731742 738442004 738401651 738655806 738809168 739121377 739511371 739538431 739230514 739029944
3816.1G39029944q3089j91808J64807L97027J93655J2040j03831n7995K6405j27256
$$ 739029944 738946855 738755047 738919854 739316881 739510536 739522576 739418745 739360750 739387155 739259899
3836.5G39259899k07603O5088L24309M09961K03132l56138r72688p89284N39124Q25226
$$ 739259899 739052296 739117384 739441693 739851654 740054786 739698648 738725960 737936676 738475800 739301026
3856.9G39301026K43127j76549k84791j19209r4771j39177M6789K15650K82705M6193
$$ 739301026 739544153 739367604 739082813 738963604 738868833 738729656 738776445 738992095 739274800 739320993
3877.3G39320993k28285j10865J9252J29104Q4758j86146r2744R8526j27613m03703
$$ 739320993 739092708 738981843 739001095 739130199 739214957 739028811 738936067 739034593 738906980 738503277
3897.7G38503277m22954k12074J64628M57108L46423P2121j27911k85209k67744m1365
$$ 738503277 738080323 737868249 738032877 738489985 738836408 738908529 738780618 738495409 738227665 738186300
3918.1G38186300N5134p1943j21534l3617q8870j98722l7849J62542O3062j45197k30730
$$ 738186300 738241434 738169491 738047957 738014340 737925470 737726748 737688899 737851441 737914503 737769306 737538576
3940.5G37538576j25885j8716q1897j22725n8115l6776p9453p2956l3558m8220p9691
$$ 737538576 737412691 737393975 737312078 737189353 737131238 737094462 737015009 736942053 736908495 736860275 736780584
3962.9G36780584j16646j65225j31964k8968j8835o6519l4749k7359p8440l5047j252
$$ 736780584 736663938 736498713 736366749 736337781 736318946 736252427 736217678 736190319 736111879 736076832 736075580
3985.4G36075580q9705j25110q3625q1063p7068l2068
$$ 736075580 735985875 735860765 735777140 735696077 735619009 735586941
3997.6G35586941
$$ 735586941
##END=$$ End of the data block
