##TITLE=$$ Begin of the data block
##JCAMP-DX=5.00 $$ ACD/SpecManager v 10.08
##SPECTROMETER/DATA SYSTEM=Alpha
##DATE=11 Nov 2014 09:02:30
##DATA TYPE=INFRARED SPECTRUM
##DATA CLASS=XYDATA
##ORIGIN=
##OWNER=
##NPOINTS=1765
##FIRSTX=399.76428223
##LASTX=3997.64306641
##MAXX=3997.64306641
##MINX=399.76428223
##MAXY=0.86019152
##MINY=0.46872327
##XFACTOR=1.0000000000
##YFACTOR=1.000000000000000e-9
##FIRSTY=0.73695493
##DELTAX=2.03961372
##XUNITS=1/CM
##YUNITS=ARBITRARY UNITS
##XYDATA=(X++(Y..Y))
399.8G36954927J087130j725197k352655n69046k18332j780629k105057n45144M84705
418.1G29230702j082003k624572j427948O88970L22282j744270j618922M99249Q72075
436.5G23115563j051843j751661o9618J089036k60532j589536o19650R18328J35005
454.8G19915092k118111j723528Q75295Q33273j519263k200306m62174O06358m16100
473.2G13790536j296341k00630J137913K33709j711905j382887P70032J041413j012683
491.5G11369157j707256K5988R44435n04970j956821j040458M38392j16468j643657
509.9G05808342j632035k65360K2650j443386k098024o08325N82337l40164j626193
528.3F98399842j078546K36153J27077j076221r82583P76887J841486Q35121n20468
$$ y = [736954927, 738042057, 736316860, 733964205, 733395159, 733176827, 731396198, 729291141, 728745997, 729230702, 728148699, 725524127, 724096179, 724785149, 725107431, 723363161, 721744239, 722243488, 723115563, 722063720, 720312059, 720242441, 721331477, 721070945, 719481409, 718861759, 719780087, 719915092, 717796981, 716073453, 716948748, 717782021, 716262758, 714062452, 713600278, 714206636, 713790536, 712494195, 712293565, 713431478, 713665187, 711953282, 710570395, 711340427, 712381840, 711369157, 709661901, 709687889, 710632324, 710127354, 708170533, 707130075, 707568467, 707451999, 705808342, 704176307, 703910947, 703933597, 702490211, 700392187, 699783862, 700366199, 700026035, 698399842, 697321296, 697557449, 697684526, 696608305, 695625722, 696402609, 698244095, 699079216, 698558748]
546.6F98558748j31607J011848N00024j133442j252652J86146Q52585R179o74129L3677
567F97960377Q45134J48594r13500m76659Q07941Q62479m16815q25465M10319J239121
587.4F99641526L17335p88152k50697R62913Q03351m42267o51717N15282R25303k42651
607.8G00790226j170873o44088L24428J99437n14745K01582K003611K538383J428127
626.2G05156088P97510J592994K061903R38416j83344M96745J894534J839995N63860
644.5G15158701K16782J436532K216041J134872m9591M86791J518667R80079l14891
662.9G22783983j00434J687467K416134M98772J54674J534462K572298J781761L84808
681.2G33713925N51700J837433J813590K72334m29511N47707J269579M12047m79221
$$ y = [698558748, 698427141, 699438989, 699939013, 698805571, 697552919, 697739065, 698591650, 698600829, 697926700, 697960377, 698805511, 698954105, 698040605, 697563946, 698371887, 699234366, 698817551, 697992086, 698402405, 699641526, 699958861, 699170709, 698920012, 699882925, 700686276, 700244009, 699592292, 700107574, 701032877, 700790226, 699619353, 698975265, 699299693, 699499130, 698984385, 699185967, 701189578, 703727961, 705156088, 705953598, 707546592, 709608495, 710546911, 710363567, 710860312, 712754846, 714594841, 715158701, 715375483, 716812015, 719028056, 720162928, 720113337, 720600128, 722118795, 723098874, 722783983, 722683549, 724371016, 726787150, 727285922, 727440596, 728975058, 731547356, 733329117, 733713925, 734265625, 736103058, 737916648, 738188982, 737759471, 738307178, 739576757, 739988804, 739509583]
699.6G39509583K55882J648307J662672M99189L60667J692474K396345J404226M67777
717.9G49897122J166284K336622K061546R88185J029253K054214K146543Q56757R834
736.3G62546360P33674J595199R99928o3122J32263J102686J078546m1068n37037K95221
756.7G67842650J064361N91874j87099K44558J427829J590907O44029K79843J137138
775.1G74636090J782417J183450N00203J024246J977980J798749P31706M67003J393676
793.4G85495520J936853J118660J70826M72904J259684R88066k9265j89066P54535
811.8G91978717J256704M74692l91245k07782J20997n36799j198530l90947J263857
830.1G92369664J937926J241087P27118J586318K672374K138972O01351J51337Q02874
$$ y = [739509583, 739765465, 741413772, 743076444, 743575633, 743936300, 745628774, 748025119, 749429345, 749897122, 751063406, 753400028, 755461574, 756449759, 757479012, 759533226, 761679769, 762536526, 762546360, 763280034, 764875233, 765875161, 765812039, 765944302, 767046988, 768125534, 768084466, 767547429, 767842650, 768907011, 769498885, 769311786, 769556344, 770984173, 772575080, 773219109, 773498952, 774636090, 776418507, 777601957, 778102160, 779126406, 781104386, 782903135, 783634841, 784101844, 785495520, 787432373, 788551033, 788721859, 789194763, 790454447, 791442513, 791413248, 791224182, 791978717, 793235421, 793710113, 793318868, 793111086, 793232083, 792695284, 791496754, 791105807, 792369664, 794307590, 795548677, 796275795, 797862113, 800534487, 802673459, 803274810, 803426147, 804229021]
848.5H04229021P97212k32160o26683M42445J413524Q04246m06206l45826O38664N37932
868.9H07252169q91626j639486q06093r1314r44853k174139j931369q56877r17554
887.2G96998858j949071j983583o04749L57330r6917n46039K38896J134276N60463
905.6G94109464q59201j274884n44190l25323j304626k022743j245857j01625k94805
923.9G86136210j253843j231253l66509m41075j824856k808034k456069k095461l017843
942.3G70641267m198312l995121k843678k393246k861559k824068j774132j060009
958.6G48691142j632274k485573k273023j575351j949250l297568m045546l773868
974.9G27658689l836036m922032n840182n465091m497468m242838m526257m170001
$$ y = [804229021, 805026233, 804794073, 804167390, 804609835, 806023359, 806827605, 806421399, 806075573, 806714237, 807252169, 806360543, 804721057, 803914964, 803823650, 802878797, 800704658, 798773289, 797916412, 796998858, 795049787, 793066204, 792461455, 792818785, 792721868, 792175829, 792414725, 793549001, 794109464, 793250263, 791975379, 791431189, 791105866, 789801240, 787778497, 786532640, 786431015, 786136210, 784882367, 783651114, 783284605, 782843530, 781018674, 778210640, 775754571, 773659110, 770641267, 766442955, 762447834, 759604156, 757210910, 754349351, 751525283, 749751151, 748691142, 747058868, 744573295, 742300272, 740724921, 738775671, 735478103, 731432557, 727658689, 723822653, 718900621, 713060439, 707595348, 703097880, 698855042, 694328785, 690158784]
991.3F90158784l072679k514183l157258l925383l751755l216267l427267m094362
1007.6F62999630m007459l115594k516091k641857k626657j738131o61731m40955p34449
1025.9F44516706m31895M19140P55072K97486q404L79563O83009J00076p78794p60317
1046.3F45171642N0843M25518J9490j98900L12805Q02100N06043o7115m5299L34084
1066.7F47311211J87099n46396q28445m5419R99451J381457J406729J826405K360702
1085.1F54052794K055168R86695K91765M00663N02288M5061l75450o1571O75499J007140
1105.5F59580052R35972J225292K035082K633929K501130K091169K152086K447188
1121.8F75601900K158343J441002J357258K202272K690196J948178R72450P39515P85172
$$ y = [690158784, 687086105, 684571922, 681414664, 677489281, 673737526, 670521259, 667093992, 662999630, 658992171, 655876577, 653360486, 650718629, 648091972, 646353841, 645692110, 645251155, 644516706, 644084811, 644503951, 645259023, 645556509, 645548105, 645927668, 646610677, 646710753, 645931959, 645171642, 645222485, 645648003, 645667493, 645468593, 645781398, 646583498, 647089541, 647022426, 646977127, 647311211, 647498310, 646951914, 646123469, 646078050, 647077501, 648458958, 649865687, 651692092, 654052794, 656107962, 657094657, 657386422, 657787085, 658289373, 658334434, 657958984, 657897413, 658572912, 659580052, 660516024, 661741316, 663776398, 666410327, 668911457, 671002626, 673154712, 675601900, 677760243, 679201245, 680558503, 682760775, 685450971, 687399149, 688371599, 689111114, 689896286]
1140.1F89896286L51130k35855p1108Q08894J388729J266479J292587K086937L020406
1158.5F99804485L360033L443181M110575N320311O049931N891204N687475O013632
1174.8G39680827O208300N528629M408300L854632L797770L208220J899838Q57473
1191.1G69443989N40495K19285o47664j452267j386404p91013o36995j043022j186073
1209.5G63060331p79330o33479j266062j985311j978278j553238j546323j973033k012849
1227.9G49332428j418829r54688j058697j139999o46651p331R0122j81138j01149M09066
1248.2G44323134O48618K68996r0420J40190N87106N77271K27928L10838Q79347J125276
1268.6G48998284P14183L83496O61552R51827N93543m7684j65045K15709K59161l04222
$$ y = [689896286, 690247416, 690011561, 689940453, 690749347, 692138076, 693404555, 694697142, 696784079, 699804485, 703164518, 706607699, 710718274, 716038585, 722088516, 727979720, 733667195, 739680827, 745889127, 751417756, 755826056, 759680688, 763478458, 766686678, 768586516, 769443989, 769984484, 770203769, 769556105, 768103838, 766717434, 765926421, 765289426, 764246404, 763060331, 762281001, 761647522, 760381460, 758396149, 756417871, 754864633, 753318310, 751345277, 749332428, 747913599, 746958911, 745900214, 744760215, 744113564, 744106233, 744196355, 744015217, 743914068, 744323134, 744971752, 745240748, 745150328, 745290518, 745877624, 746454895, 746682823, 746993661, 747873008, 748998284, 749712467, 750095963, 750757515, 751709342, 752302885, 752255201, 752090156, 752305865, 752565026, 752260804]
1289G52260804p35104o13749n12302j028538j725733j828968j480878j482606k005636
1307.4G40847290k296150j952231j520217j606404j878143j568556q73446p24912j163125
1325.8G27264106j374066j008093o46651p96020j071036q70525k36333J6153l20673
1344.1G20956862n17726k71499j52767n06878q46624p01189m66168r04560j724780
1362.5G14864671j854837j527369j732290k342164l116310l669858m085481p371306
1378.8F89165056j5073180j7832518m922330J3439357J6837478Q454263K912342Q33750
1395.1F93814218j78695p05659m47273Q7619K81453K55763K52485N06461Q28743P64668
1415.5F95459783M36485P64429J589001J811087J624763J485467J593113J747369J475275
$$ y = [752260804, 751525700, 750911951, 750399649, 749371111, 747645378, 745816410, 744335532, 742852926, 740847290, 738551140, 736598909, 735078692, 733472288, 731594145, 730025589, 729152143, 728427231, 727264106, 725890040, 724881947, 724235296, 723439276, 722368240, 721497715, 721261382, 721277535, 720956862, 720439136, 720167637, 720014870, 719507992, 718661368, 717960179, 717494011, 716589451, 714864671, 713009834, 711482465, 709750175, 707408011, 704291701, 700621843, 696536362, 689165056, 674091876, 656259358, 651337028, 664776385, 681613863, 690068126, 692980468, 693814218, 693635523, 692929864, 692482591, 692570210, 692851663, 693107426, 693359911, 693866372, 694695115, 695459783, 695896268, 696660697, 698249698, 700060785, 701685548, 703171015, 704764128, 706511497, 707986772]
1433.9G07986772J073957J322805J687229J474798R76622O58154Q05259J139701J056254
1452.2G18181551P25984P99537K011239K640426K122999J972198K665520L207564L401518
1470.6G37728536M174471M893959M707396L987491L042459K334833J767636J008510
1486.9G63645291l5405o33597n81324j111329k277255k659321k194881j901806k845347
1505.2G49405026m303991k571762j239538j333416j582682j509785j074493q25823
1521.6G34963536n08904o45220j055778q57532r31143j277745q85844r53555j865983
1539.9G25981832j284481j70230K1576R2328K12133L53098K49565r2626o24657J56641
1560.3G24895179R57668L39985j80006n49853q57532q33869j552880k693772k361536
$$ y = [707986772, 709060729, 710383534, 712070763, 713545561, 714522183, 715180337, 715985596, 717125297, 718181551, 718907535, 719707072, 721718311, 724358737, 726481736, 728453934, 731119454, 734327018, 737728536, 741903007, 746796966, 751504362, 755491853, 758534312, 760869145, 762636781, 763645291, 763609886, 762976289, 762394965, 761283636, 759006381, 756347060, 754152179, 752250373, 749405026, 745101035, 742529273, 741289735, 739956319, 738373637, 736863852, 735789359, 734963536, 734454632, 733809412, 732753634, 731896102, 730964959, 729687214, 728801370, 727847815, 725981832, 724697351, 724527121, 724548697, 724641025, 724853158, 725206256, 725455821, 725363195, 724738538, 724895179, 725852847, 726192832, 726012826, 725462973, 724605441, 723771572, 722218692, 719524920, 717163384]
1578.7G17163384k290130l114164l550827l718615m076540m497647m591883m361212
1595F86962366m034340l963590m109442m026771l734112l777086m133225l994882l515184
1613.4F51673734m013777m769563l367543k600968l121555l068507k998769k790272
1629.7F24942780j816452j390874j613975n72562O42061J135528J243413J257419J954973
1648F25782311K299428K126813K977967L435314L227830L376543L735841L977894L727854
1666.4F54667795L920316M690648M530131M423380M937887M841268M329205M145980
1682.7F90486610N322039N797625N183637N091071M613995M709185N281925N104601
1699G31590688N413771M802883M061818L923118L203749K386690J874447J451313J145005
$$ y = [717163384, 714873254, 711759090, 708208263, 704489648, 700413108, 695915461, 691323578, 686962366, 682928026, 678964436, 674854994, 670828223, 667094111, 663317025, 659183800, 655188918, 651673734, 647659957, 642890394, 639522851, 636921883, 633800328, 630731821, 627733052, 624942780, 623126328, 621735454, 620121479, 619548917, 620190978, 621326506, 622569919, 623827338, 625782311, 628081739, 630208552, 633186519, 636621833, 639849663, 643226206, 646962047, 650939941, 654667795, 658588111, 663278759, 667808890, 672232270, 677170157, 682011425, 686340630, 690486610, 695808649, 701606274, 706789911, 711880982, 716494977, 721204162, 726486087, 731590688, 737004459, 741807342, 745869160, 749792278, 752996027, 755382717, 757257164, 758708477, 759853482]
1717.4G59853482J266659J340627J189888J127422Q79347O40571O18756P91490J406789
1735.7G69115031J501143J433849J942754K345621K265156K204835K679587L400504
1752G86888480L277242K839148K826930K896487K965391K803564K434969K347231K324343
1770.4H11603785K135634J995802J886189J787960J593054J236737J023590J234055
1786.7H24496806J339733P99775M20630Q80480J226664R76801N97298O49452R66072
1805.1H32353711J019776O32763L19779N61535Q65996P23600M14849L26812M61221
1823.4H37680042O13868M40121J26719M38631Q74638O46890K62260K67148L72529K28226
1843.8H41951072K24710M06921N50270O40571M48406J24573R2686L87012N09561K34723
$$ y = [759853482, 761120141, 762460768, 763650656, 764778078, 765657425, 766297996, 766916752, 767708242, 769115031, 770616174, 772050023, 773992777, 776338398, 778603554, 780808389, 783487976, 786888480, 790165722, 793004870, 795831800, 798728287, 801693678, 804497242, 806932211, 809279442, 811603785, 813739419, 815735221, 817621410, 819409370, 821002424, 822239161, 823262751, 824496806, 825836539, 826636314, 827056944, 827937424, 829164088, 830140889, 830738187, 831387639, 832353711, 833373487, 834006250, 834326029, 834887564, 835753560, 836477160, 836892009, 837218821, 837680042, 838293910, 838734031, 838860750, 839299381, 840174019, 840820909, 841083169, 841350317, 841722846, 841951072, 842175782, 842582703, 843132973, 843773544, 844221950, 844346523, 844439209, 844826221, 845335782, 845570505]
1864.2H45570505j11103l1174M62830N29230J83761J14799L54945L97504J46925o55
1884.6H47617567J27494K08616J54734Q5652J09434L44753M06623J10269p5579J09434
1905H49198997K75016J31547k3544P4327J93656J07646J967k8670Q1480K88248J96337
1927.5H50497007l7431j6570J71780K00033j2695j95444j27375R9838J27852o0380
1947.9H50646615n8949J34826J36316o7950j52945M530J51574J7643k03907q8036J96397
1970.3H50716114J67728q3983j75357j5736J15633P987j61648j22547O3896N3943j46211
1992.7H50419819j51157M7028J40011l159j80483j19447O1273N4181j53184k56121
2013.1H49858761j15693K5511l0935j55330j18255J6212l874j82629k32458n5849P7724
$$ y = [845570505, 845459402, 845428228, 845891058, 846420288, 846604049, 846718848, 847073793, 847471297, 847618222, 847617567, 847745061, 847953677, 848108411, 848194063, 848303497, 848648250, 849054873, 849165142, 849089563, 849198997, 849474013, 849605560, 849582016, 849656343, 849849999, 849957645, 849959612, 849930942, 850012422, 850300670, 850497007, 850459576, 850443006, 850614786, 850814819, 850802124, 850606680, 850479305, 850579143, 850706995, 850646615, 850587666, 850722492, 850858808, 850790858, 850637913, 850642443, 850794017, 850811660, 850607753, 850519717, 850716114, 850883842, 850799859, 850624502, 850608766, 850724399, 850732386, 850570738, 850448191, 850512087, 850566030, 850419819, 850268662, 850315690, 850455701, 850452542, 850272059, 850152612, 850213885, 850268066, 850114882, 849858761, 849743068, 849768579, 849737644, 849582314, 849464059, 849480271, 849476397, 849293768, 849061310, 849005461, 849083185]
2035.6H49083185l1411j84477q6546J04428L0815j80721j52767O4135J27494l0517
2056H48743618j38522j8537J31071M1962j31250p3671J05381J23977l5703j08421N8413
2078.4H48698318K11179R7871j01268q1301J11461J52111k3425o6638J39475K65956
2098.8H49403739J11580n6565J2517J55151J37448j669k4497J24633K01821O1095o6221
2121.2H50059032L4273J83046J23203l7074l577J87993K41876O8724p4923K5869J93238
2143.7H51001680J69396K3783L218J51038K20061J04308K6703J06990J96576J42694
2164.1H52146447M6789J02282K42650K29061P7367L4571J35660K07007J55210P1705
2184.5H53448749R7692K13325K38955J22249N9485J28687J69158J03116L8921Q1957
$$ y = [849083185, 849051774, 848867297, 848780751, 848885179, 848915994, 848735273, 848582506, 848646641, 848774135, 848743618, 848605096, 848586559, 848717630, 848759592, 848628342, 848554671, 848660052, 848784029, 848748326, 848639905, 848698318, 848909497, 849007368, 848906100, 848824799, 848936260, 849088371, 849064946, 848998308, 849137783, 849403739, 849515319, 849458754, 849471271, 849626422, 849763870, 849762201, 849737704, 849862337, 850064158, 850125253, 850059032, 850093305, 850276351, 850399554, 850362480, 850358903, 850546896, 850788772, 850857496, 850782573, 850808442, 851001680, 851171076, 851194859, 851198077, 851349115, 851569176, 851673484, 851700187, 851807177, 852003753, 852146447, 852193236, 852295518, 852538168, 852767229, 852844596, 852879167, 853014827, 853221834, 853377044, 853448749, 853546441, 853759766, 853998721, 854120970, 854180455, 854309142, 854478300, 854581416, 854620337, 854702294]
2204.8H54702294J69992J63138O4731J9789P5161J17958Q2612L2246N6326J45972J71244
2227.3H55801463Q9646K0921K5987N0486N3346N4836R2030J50442J36613M6015l397
2249.7H56518388K7537Q2374Q1062K7478M2498J28388J29938K4379k5869N2929J06097
2272.2H57195199J5795p5162k7597P1228Q2195K7239J5318O5506Q8930N6505N1379
2294.6H57566535J08064J71184J57953O5565M4167J62363K37584J60813P7307J22130
2315H58873665K51115K77579J69992J31011J76072J45495N1677J5855N6148J7464r0718
2337.4H60075355j48237j89543l41833o30498m83810R6380N32151O30736M77672J73151
2357.8H60191524j31488l00169m57406o75976p78496o56248o06298p25269p41601o15180
$$ y = [854702294, 854872286, 855035424, 855100155, 855119944, 855195105, 855313063, 855395675, 855427921, 855484247, 855630219, 855801463, 855891109, 855912030, 855938017, 855988503, 856041849, 856096685, 856188715, 856339157, 856475770, 856521785, 856518388, 856545925, 856628299, 856709361, 856736839, 856779337, 856907725, 857037663, 857062042, 857036173, 857089102, 857195199, 857210994, 857135832, 857108235, 857179463, 857261658, 857288897, 857304215, 857369721, 857458651, 857515156, 857566535, 857674599, 857845783, 858003736, 858069301, 858113468, 858275831, 858513415, 858674228, 858751535, 858873665, 859124780, 859402359, 859572351, 859703362, 859879434, 860024929, 860076606, 860092461, 860148609, 860166073, 860075355, 859927118, 859737575, 859395742, 858765244, 858281434, 858377814, 858909965, 859540701, 860018373, 860191524, 860060036, 859759867, 859302461, 858626485, 857847989, 857191741, 856585443, 855860174, 855118573, 854503393]
2378.2H54503393n10096m70341m28080l34561k25961j91391k11835k28107k04563j37448
2398.6H51561010j22726j64151j64449j22130j32084k05159k44260k23697j97827k06948
2419H49777579l01480m38511m18365j92225J5378L4988m2439q5592j20938j88053k06589
2441.4H47833753j22309p7307j61350k61843l01719k76923k13981j82569j70112j48534
2461.8H45917106j79053k50220k75195k48968k24054k38061k76029k76446k42174k13266
2482.2H43493640k14159k77281l16977k62320k33949k63929k45631k05278k11656k38419
2502.6H41024041k66552k73764k59697k47240k19226j96815j93119k11596k54929k74361
2523H38626742k72095k69115k61247k51055k35259k11180k07424k59459k99215k88069
$$ y = [854503393, 853993297, 853522956, 853094876, 852760315, 852534354, 852342963, 852131128, 851903021, 851698458, 851561010, 851438284, 851274133, 851109684, 850987554, 850855470, 850650311, 850406051, 850182354, 849984527, 849777579, 849476099, 849037588, 848619223, 848426998, 848442376, 848477364, 848434925, 848349333, 848228395, 848040342, 847833753, 847711444, 847634137, 847472787, 847210944, 846909225, 846632302, 846418321, 846235752, 846065640, 845917106, 845738053, 845487833, 845212638, 844963670, 844739616, 844501555, 844225526, 843949080, 843706906, 843493640, 843279481, 843002200, 842685223, 842422903, 842188954, 841925025, 841679394, 841474116, 841262460, 841024041, 840757489, 840483725, 840224028, 839976788, 839757562, 839560747, 839367628, 839156032, 838901103, 838626742, 838354647, 838085532, 837824285, 837573230, 837337971, 837126791, 836919367, 836659908, 836360693, 836072624]
2543.4H36072624k71917k59399k47777k37941k32518k32995k55525k93255k89380k62320
2563.8H33489597k71022k76566k44260k30729k53439k96355l36945l35335l23713l14534
2584.2H30606699k61545k33650k60771k72155k95519l34680l54469l62635l35574k91467
2604.6H27604234l03924l43203l35634l12805l26097l47793l57330l78907l72112l27468
2625H24198961l35216l77775l93748m41730m85003m25756l43740l31640l78072m06504
2645.4H20279777l95179l96609m24326m62949m58658m02569l77357m22120m36306l64125
2665.8H16139579l46780m20392m57286m32372m03345l99470m16935m20272l97861m12882
2686.2H12031984m56869m38452m00305m01020l96788l99530m23133m45009m85718n26726
$$ y = [836072624, 835800707, 835541308, 835293531, 835055590, 834823072, 834590077, 834334552, 834041297, 833751917, 833489597, 833218575, 832942009, 832697749, 832467020, 832213581, 831917226, 831580281, 831244946, 830921233, 830606699, 830345154, 830111504, 829850733, 829578578, 829283059, 828948379, 828593910, 828231275, 827895701, 827604234, 827300310, 826957107, 826621473, 826308668, 825982571, 825634778, 825277448, 824898541, 824526429, 824198961, 823863745, 823485970, 823092222, 822650492, 822165489, 821739733, 821395993, 821064353, 820686281, 820279777, 819884598, 819487989, 819063663, 818600714, 818142056, 817739487, 817362130, 816940010, 816503704, 816139579, 815792799, 815372407, 814915121, 814482749, 814079404, 813679934, 813262999, 812842727, 812444866, 812031984, 811575115, 811136663, 810736358, 810335338, 809938550, 809539020, 809115887, 808670878, 808185160, 807658434]
2706.6H07658434m95255m30524m33267m59492m24027l90649m53115n11825m69207m38214
2727H03152859m69267n01454m82619l81291l37004m17769m56334m09364l47495l18528
2747.4G99031734l65257m28498m34279l95358m01973m76420m84824m05252l65735m11212
2767.8G94862926m60386m29213l89159m68433n98013o24895n64039n08011m76300m69387
2788.2G89875090n22852o18636o57618o21796o06477o60301p39216p81358p30216o44446
2808.6G83292174o90043q40246r01223q58664q47936r03070r67204j005471j016200
2826.9G75262117j077234j210451j317740j380861j457035j697362k139866k532542
2843.2G62449026k795458k996683k955079k429485j540721p36296k69830j34587k93613
$$ y = [807658434, 807163179, 806732655, 806299388, 805839896, 805415869, 805025220, 804572105, 804060280, 803591073, 803152859, 802683592, 802182138, 801699519, 801318228, 800981224, 800563455, 800107121, 799697757, 799350262, 799031734, 798666477, 798237979, 797803700, 797408342, 797006369, 796529949, 796045125, 795639873, 795274138, 794862926, 794402540, 793973327, 793584168, 793115735, 792517722, 791892827, 791328788, 790820777, 790344477, 789875090, 789352238, 788733602, 788075984, 787454188, 786847711, 786187410, 785448194, 784666836, 783936620, 783292174, 782602131, 781761885, 780860662, 780001998, 779154062, 778250992, 777283788, 776278317, 775262117, 774184883, 772974432, 771656692, 770275831, 768818796, 767121434, 764981568, 762449026, 759653568, 756656885, 753701806, 751272321, 749731600, 748995304, 748725474, 748590887, 748297274]
2861.6G48297274o07610r10639j139284j200199j016974q11815p62105o53387m61459
2879.9G40733802m28378n62310p14303q07344q65400r24051r70781j049817j184165
2898.3G33227253j264274j268447j316964j449108j630307j851141k134621k475798
2914.6G19836593k674938k525329k104342j551390r38535l25501J82689M70698O71386
2933G11041331R50754J245916J495659J703441J751125J507223J048565O24895L92377
2951.3G21761286K08378O2287J45674M19676P53284J032888J240194J443684J609564
2969.7G28676915J756072J858175J800478J687526J575649J338720J097322J012504
2986G40803361R98199R83238Q06809M32610J81914N7518j07646k53081l57867l56972
$$ y = [748297274, 747689664, 746779025, 745639741, 744439542, 743422568, 742610753, 741848648, 741195261, 740733802, 740305424, 739743114, 739028811, 738221467, 737356067, 736432016, 735461235, 734411418, 733227253, 731962979, 730694532, 729377568, 727928460, 726298153, 724447012, 722312391, 719836593, 717161655, 714636326, 712531984, 710980594, 710042059, 709716558, 709899247, 710369945, 711041331, 711992085, 713238001, 714733660, 716437101, 718188226, 719695449, 720744014, 721368909, 721761286, 721969664, 722031951, 722177625, 722597301, 723350585, 724383473, 725623667, 727067351, 728676915, 730432987, 732291162, 734091640, 735779166, 737354815, 738693535, 739790857, 740803361, 741801560, 742784798, 743591607, 744024217, 744206131, 744263649, 744156003, 743902922, 743545055, 743188083]
3006.4G43188083k23517j41442k52783m77910o45101p05183p31826p55191p89463q06034
3026.8G37659633p26640o33717o23107p30753q94308q80599p59542p80761r04262r95159
3047.2G29730785r81212r13977r04859r42468r92954r91046q70109p37548o99580p74204
3067.6G20922828q97527q97110p47978n88656n58734o87956q00491q30412q95798r04739
3088G13113427q36611q98122j010597r54628p90596p82490r52601j001537q66831q19683
3108.4G04199731r65297j000047q44895q24273r73821j182914j353144j329839j207531
3126.7F94517970j135647j179040j276552j207710j052797j135766j401782j470327
3143F84658349j369894j343966j277685j174748j296877j555801j644134j586974j513004
$$ y = [743188083, 742964566, 742823124, 742570341, 742092431, 741447330, 740742147, 740010321, 739255130, 738465667, 737659633, 736932993, 736299276, 735676169, 734945416, 734051108, 733170509, 732410967, 731630206, 730725944, 729730785, 728749573, 727835596, 726930737, 725988269, 724995315, 724004269, 723134160, 722396612, 721697032, 720922828, 720025301, 719128191, 718380213, 717791557, 717232823, 716544867, 715744376, 714913964, 714018166, 713113427, 712276816, 711378694, 710368097, 709413469, 708622873, 707840383, 706887782, 705886245, 705019414, 704199731, 703234434, 702234387, 701389492, 700565219, 699591398, 698408484, 697055340, 695725501, 694517970, 693382323, 692203283, 690926731, 689719021, 688666224, 687530458, 686128676, 684658349, 683288455, 681944489, 680666804, 679492056, 678195179, 676639378, 674995244, 673408270, 671895266]
3161.4F71895266j473189j490533j528680j589716j623571j592636j570642j584709
3177.7F59441590j597523j606226j607299j609206j613260j601696j599848j638651
3194F46567881j662254j608670j574934j589477j573920j543224j528799j542926j560330
3212.4F32383347j543463j509189j512945j570046j586676j507818j443625j436949
3228.7F20272636j389861j343906j474321j653194j632154j524687j461208j379966
3245F08413339j367390j495660j540899j430512j353204j411378j485706j428187j318931
3263.4E95581472j254916j201272j152575j210273j358986j461088j451492j321972
3279.7E85168898j218557j256466j303733j248002j138508j109064j220643j362383
$$ y = [671895266, 670422077, 668931544, 667402864, 665813148, 664189577, 662596941, 661026299, 659441590, 657844067, 656237841, 654630542, 653021336, 651408076, 649806380, 648206532, 646567881, 644905627, 643296957, 641722023, 640132546, 638558626, 637015402, 635486603, 633943677, 632383347, 630839884, 629330695, 627817750, 626247704, 624661028, 623153210, 621709585, 620272636, 618882775, 617538869, 616064548, 614411354, 612779200, 611254513, 609793305, 608413339, 607045949, 605550289, 604009390, 602578878, 601225674, 599814296, 598328590, 596900403, 595581472, 594326556, 593125284, 591972709, 590762436, 589403450, 587942362, 586490870, 585168898, 583950341, 582693875, 581390142, 580142140, 579003632, 577894568, 576673925, 575311542]
3296E75311542j452446j447559j310050j154304j239180j561940j806259j837015j751960
3314.4E61750829j712739j740635j793086j857877j878798j957834k097249k139211
3330.7E46573400k099573k004564j902342j993954k215207k313852k341032k288878
3347E29413998k116144k157151k415717k476871k325892k214075k250373k278864k104223
3365.4E09074688j946986k119422k435505k401590k078206j898289j839578j806736
3381.7D92548376j807540j727999j455545j139492j179009j496643j520127j145393
3398D81076628r20236j233399j606286j404851r68576q18640q71420r75817r67980
3416.3D71309423p56084o38366o46711m40448j04547P2062K9922L8028K10911J73747
$$ y = [575311542, 573859096, 572411537, 571101487, 569947183, 568708003, 567146063, 565339804, 563502789, 561750829, 560038090, 558297455, 556504369, 554646492, 552767694, 550809860, 548712611, 546573400, 544473827, 542469263, 540566921, 538572967, 536357760, 534043908, 531702876, 529413998, 527297854, 525140703, 522724986, 520248115, 517922223, 515708148, 513457775, 511178911, 509074688, 507127702, 505008280, 502572775, 500171185, 498092979, 496194690, 494355112, 492548376, 490740836, 489012837, 487557292, 486417800, 485238791, 483742148, 482222021, 481076628, 480156392, 478922993, 477316707, 475911856, 474943280, 474124640, 473253220, 472277403, 471309423, 470553339, 469914973, 469268262, 468827814, 468723267, 468795329, 468825251, 468863279, 469074190, 469247937]
3436.7D69247937q0883p0513K44320N28604O73174P45297Q03828Q42422R19074J107097
3457.1D74960357J280874J219720J189410J503170J733750J458496J036286J070470
3473.4D85452533J419335J692802J699656J493901J510144J737505J763642J682132
3489.8D98451650J740337J849949J945317J963079J947760J954079J838386J710832
3506.1E13401389J840949K140880K351343K245903J989842J996338K222479K453625
3522.4E30642748K410889K162635K161026K398491K589583K713561K714396K593934
3538.7E50387263K692521K911985K880037K629757K547502K689183K886832L051757
3555E72676837L120542L174901L203332L020645K838134L316820L912926L782809L557205
$$ y = [469247937, 469167054, 469096541, 469340861, 469869465, 470542639, 471287936, 472091764, 472934186, 473853260, 474960357, 476241231, 477460951, 478650361, 480153531, 481887281, 483345777, 484382063, 485452533, 486871868, 488564670, 490264326, 491758227, 493268371, 495005876, 496769518, 498451650, 500191987, 502041936, 503987253, 505950332, 507898092, 509852171, 511690557, 513401389, 515242338, 517383218, 519734561, 521980464, 523970306, 525966644, 528189123, 530642748, 533053637, 535216272, 537377298, 539775789, 542365372, 545078933, 547793329, 550387263, 553079784, 555991769, 558871806, 561501563, 564049065, 566738248, 569625080, 572676837, 575797379, 578972280, 582175612, 585196257, 588034391, 591351211, 595264137, 599046946, 602604151]
3573.4F02604151L599822L699303L917754M149913L980101L579378L666281M166127
3589.7F33362830M156232L990173M135430M317462M319906M297138M140973L819823
3606F66539967L874660M132390M166066M236162M106820M019916M437029M389286L760398
3624.4G03662694L152668L338516M227400M091203L689348L493250L303945L226995
3640.7G32186019L131986K790868K365411K682447L577590L361642K709091K804578
3657G55609632K924799K455712K058685J903414J519263J226485J644254J527726J173735
3675.4G72043705J802921K103687J883626J680910J329184R19282Q67486J270950J488268
3693.7G85390019J277745R15885O07848O09160R36329Q89957L55482r6261K70843J114309
$$ y = [602604151, 606203973, 609903276, 613821030, 617970943, 621951044, 625530422, 629196703, 633362830, 637519062, 641509235, 645644665, 649962127, 654282033, 658579171, 662720144, 666539967, 670414627, 674547017, 678713083, 682949245, 687056065, 691075981, 695513010, 699902296, 703662694, 706815362, 710153878, 714381278, 718472481, 722161829, 725655079, 728959024, 732186019, 735318005, 738108873, 740474284, 743156731, 746734321, 750095963, 752805054, 755609632, 758534431, 760990143, 763048828, 764952242, 766471505, 767697990, 769342244, 770869970, 772043705, 773846626, 775950313, 777833939, 779514849, 780844033, 781763315, 782630801, 783901751, 785390019, 786667764, 787583649, 788191497, 788800657, 789736986, 790626943, 790982425, 790886164, 791157007, 792271316]
3714.1G92271316J156628O55472K85984K33173L65972N64278O09159K38001j88529
3732.5G96191454r6619N54085R61780M98772m34399n10752L97682J80900j73628O65247
3752.9G98234522J045287N60164K41042M60624M60744J31488R775J01626L83020N56171
3773.3H02184463L65495Q9884O437J32382J59443J54912K61903L00527K32756M4644
3793.7H03932846r7692n8532l09348l21925K74479K40565K27749N79536L72052k43664
3814.1H04596066l61025K5034j90258r0778M44055L67105J87933R4712Q2254J16468
3834.4H05271566k30670n22375j00017L77178N55873M59433O0022o80804j300216j45614
3854.8H03744376J049638P31885J35899k17736j07229M947k48551j30773K55704M04000
$$ y = [792271316, 793427944, 794083416, 794369400, 794602573, 794968545, 795532823, 796141982, 796379983, 796191454, 796094835, 796648920, 797610700, 798109472, 797675073, 797164321, 797562003, 797742903, 797569275, 798234522, 799279809, 799839973, 800081015, 800541639, 801002383, 801133871, 801143646, 801245272, 801628292, 802184463, 802549958, 802639842, 802646279, 802778661, 802938104, 803093016, 803354919, 803655446, 803888202, 803932846, 803835154, 803776622, 803467274, 803145349, 803419828, 803660393, 803888142, 804467678, 804839730, 804596066, 804235041, 804260075, 804069817, 803979039, 804423094, 804790199, 804978132, 805072844, 805155098, 805271566, 805040896, 804518521, 804418504, 804795682, 805351555, 805810988, 805871010, 805190206, 803889990, 803744376, 804794014, 805525899, 805661798, 805444062, 805336833, 805341780, 805093229, 804962456, 805218160, 805622160]
3875.2H05622160K00928k00808o2764J61767O4015J60575L1710j47104J19269J51097
3895.6H06100845k32398m70102l65198r477M14252M75646K13265j7107j26779j51872
3916H05831075m8459O2466l2246j12593M2378O4969j14262p3075J26004J10925l2425
3938.5H05824757j26303p8380O8665L6955j05679q9348M6254J13129N8115m0055q7559
3960.9H05620551l3617J6868n4836q2433N2511R1792J0132L8386O5803o914l1769k6524
3985.4H05659950n8711p5340o5982j4663N2988P6175
3997.6H05574417
$$ y = [805622160, 805823088, 805622280, 805559516, 805721283, 805785298, 805945873, 805977583, 805830479, 805949748, 806100845, 805868447, 805398345, 805033147, 805023670, 805437922, 805913568, 806126833, 806109726, 805982947, 805831075, 805782616, 805845082, 805812836, 805700243, 805742621, 805807590, 805693328, 805620253, 805746257, 805857182, 805824757, 805698454, 805620074, 805688739, 805725694, 805620015, 805530667, 805576921, 805690050, 805748165, 805708110, 805620551, 805586934, 805603802, 805548966, 805466533, 805519044, 805610836, 805620968, 805659354, 805725157, 805718243, 805686474, 805659950, 805601239, 805525899, 805459917, 805445254, 805498242, 805574417]
##END=$$ End of the data block
