##TITLE=$$ Begin of the data block
##JCAMP-DX=5.00 $$ ACD/SpecManager v 10.08
##SPECTROMETER/DATA SYSTEM=Alpha
##DATE=11 Nov 2014 09:02:30
##DATA TYPE=INFRARED SPECTRUM
##DATA CLASS=XYDATA
##ORIGIN=
##OWNER=
##NPOINTS=1765
##FIRSTX=399.76428223
##LASTX=3997.64306641
##MAXX=3997.64306641
##MINX=399.76428223
##MAXY=0.78710204
##MINY=0.42733258
##XFACTOR=1.0000000000
##YFACTOR=1.000000000000000e-9
##FIRSTY=0.65337253
##DELTAX=2.03961372
##XUNITS=1/CM
##YUNITS=ARBITRARY UNITS
##XYDATA=(X++(Y..Y))
$$ plain form
399.8 653372526 652330816 652035892 652574241 651900530 649831533 648890615 649258375 648261964 645368755
418.1 645368755 643943012 644528687 644086897 642651260 642264962 642730355 642289162 641289532 641484082
436.5 641484082 642425656 642352462 641643226 641704679 642070055 641896248 641469657 641148865 640842736 640332997
456.9 640332997 639769077 639386296 638867915 637919605 636886120 636278033 635899365 635503411 635225773 634888589
477.3 634888589 634483397 634175241 633805275 633369207 633138120 633111894 632887661 632309020 631804645 631599069
497.7 631599069 631122887 629966080 628858387 628395677 627757609 626162410 624463558 623626649 622861147
516 622861147 621193409 619657099 619319141 619081497 617774010 616305292 615881443 615794182 614949107 614155948
536.4 614155948 614747763 616025627 616531074 616766989 618033946 619409561 619064152 617909849 618026972
$$ packed form
399.8F53372526j041710k94924N38349o73711k068997r40918L67760r96411k893209
418.1F45368755j425743N85675m41790j435637l86298M65393m41193r99630J94550
436.5F41484082R41574p3194p09236O1453L65376j73807m26591l20792l06129n09739
456.9F40332997n63920l82781n18381r48310j033485o08087l78668l95954k77638l37184
477.3F34888589m05192l08156l69966m36068k31087k6226k24233n78641n04375k05576
497.7F31599069m76182j156807j107693m62710o38068j595199j698852q36909p65502
516F22861147j667738j536310l37958k37644j307487j468718m23849q7261q45075p93159
536.4F14155948N91815J277864N05447K35915J266957J375615l45409j154303J17123
$$ plain form
554.8 618026972 618590474 617818892 616793215 617352366 618446827 617956042 616755664 617061436 618079782
573.1 618079782 617615521 616413176 616876483 618431747 618569255 617630124 618036032 619421124 619350016
591.5 619350016 618037343 618003309 619181812 619023085 617596090 617399871 618338645 617962599 616348207
609.8 616348207 616099536 617359161 617558122 616512120 617013991 619492650 621079385 620864034 621490836
628.2 621490836 623777390 625067413 624457777 624571323 626510561 627862692 627533376 628002763 630621672
646.6 630621672 632837236 632916033 633178294 635323584 636992812 636307538 635625422 637072265 638635993
664.9 638635993 637961149 637284696 639726400 642220438 642822325 643232524 645622373 648208320 648577690
683.3 648577690 648372650 650008857 652043700 652029157 651157916 651942253 653445303 653266132 652529180
$$ packed form
554.8F18026972N63502p71582j025677N59151J094461m90785j200378L05772J018346
573.1F18079782m64261j202345M63307J555264J37508r39131M05908J385092p1108
591.5F19350016j312673l4034J178503j58727j426995j96219R38774l76046j614392
609.8F16348207k48671J259625J98961j046002N01871K478659J586735k15351O26802
628.2F21490836K286554J290023o09636J13546J939238J352131l29316M69387K618909
646.6F30621672K215564P8797K62261K145290J669228o85274o82116J446843J563728
664.9F38635993o74844o76453K441704K494038O01887M10199K389849K585947L69370
683.3F48577690k05040J636207K034843j4543q71241P84337J503050j79171p36952
$$ plain form
701.6 652529180 653977811 656637251 657539487 657347858 658936441 661773622 663038790 663143873 665006816
720 665006816 668538272 670732200 671419263 673412442 676846623 678749561 678711295 679615736 682102680
738.3 682102680 683433592 682901382 683265448 685329080 686367333 685397804 685083389 686552107 687240839
756.7 687240839 685992777 685388803 686920345 688273013 687871099 687944472 690170944 692294896 692427456
775.1 692427456 692624032 694878399 697420835 698243141 698931158 701512218 704430819 705409169 705816567
793.4 705816567 707928479 710458636 711022854 710636854 711683750 713345528 713355184 712542117 713325262
811.8 713325262 715054631 715265036 714302778 714383960 715034306 713786721 711247385 710822463 713004768
830.1 713004768 714836657 715486228 717288852 720792174 723540783 724517763 725539207 727281690 727886319
$$ packed form
701.6F52529180J448631K659440R02236j91629J588583K837181J265168J05083J862943
720F65006816L531456K193928O87063J993179L434181J902938l8266R04441K486944
738.3F82102680J330912n32210L64066K063632J038253r69529l14415J468718O88732
756.7F87240839j248062o03974J531542J352668m01914P3373K226472K123952J32560
775.1F92427456J96576K254367K542436Q22306O88017K581060K918601R78350M07398
793.4G05816567K111912K530157N64218l86000J046896J661778R656q13067P83145
811.8G13325262J729369K10405r62258Q1182O50346j247585k539336m24922K182305
830.1G13004768J831889O49571J802624L503322K748609R76980J021444J742483O04629
$$ plain form
848.5 727886319 726716161 725958884 726927638 727972865 727930069 728284121 729901850 731045008 730524957
866.8 730524957 729871571 730309010 730335176 728677273 726725638 725783706 724564254 721690774 718444049
885.2 718444049 716502786 715034902 712736070 710667491 710361600 710987389 710899472 710513532 711115897
903.5 711115897 711954355 711333930 709659815 708564579 707910478 706321239 704079628 702821910 702519238
921.9 702519238 701632857 700099707 699215353 698811769 697300315 694466591 691672027 689160883 685618520
940.3 685618520 680749595 675978243 671986043 667828619 663211942 659415662 657059371 654972315
956.6 654972315 652296424 649798989 648033798 646034122 642966926 639460683 636152864 632357657
972.9 632357657 627351522 621752739 616404355 610977054 604964077 599077642 594325006 590459287
$$ packed form
848.5G27886319j170158p57277R68754J045227m2796L54052J617729J143158n20051
866.8G30524957o53386M37439K6166j657903j951635r41932j219452k873480l246725
885.2G18444049j941263j467884k298832k068579l05891O25789q7917l85940O02365
903.5G11115897Q38458o20425j674115j095236o54101j589239k241611j257718l02672
921.9G02519238q86381j533150q84354m03584j511454k833724k794564k511144l542363
940.3F85618520m868925m771352l992200m157424m616677l796280k356291k087056
956.6F54972315k675891k497435j765191j999676l067196l506243l307819l795207
972.9F32357657n006135n598783n348384n427301o012977n886435m752636l865719
$$ plain form
989.2 590459287 586662233 583034396 580106676 577436686 574073136 570150137 566610038 563580453
1005.5 563580453 560412169 557103693 554372251 552348197 550389647 548371613 546957672 546367586
1021.8 546367586 545998931 545546532 545499802 546078384 546709239 547067106 547609091 548575997 549362004 549414337
1042.2 549414337 549120069 549098790 549190879 549024582 548917294 549311340 549878180 550123632 550313115 550860882
1062.6 550860882 551426768 551446974 551010787 550608277 550364375 550171494 550395310 551552773 553493142
1081 553493142 555553138 557358444 559013724 560445905 561251879 561414361 561349928 561260283 561090052 560943186
1101.4 560943186 561182201 562051475 563367009 564894199 566829324 569344759 572073758 574616611 577043176
1119.8 577043176 579470932 581697464 583594799 585458696 587670207 589996696 591808796 592949092
$$ packed form
989.2E90459287l797054l627837k927720k669990l363550l922999l540099l029585
1005.5E63580453l168284l308476k731442k024054j958550k018034j413941n90086
1021.8E46367586l68655m52399m6730N78582O30855L57867N41985R66906P86007N2333
1042.2E49414337k94268k1279R2089j66297j07288L94046N66840K45452J89483N47767
1062.6E50860882N65886K0206m36187m02510k43902j92881K23816J157463J940369
1081E53493142K059996J805306J655280J432181Q05974J62482o4433q9645j70231j46866
1101.4E60943186K39015Q69274J315534J527190J935125K515435K728999K542853K426565
1119.8E77043176K427756K226532J897335J863897K211511K326489J812100J140296
$$ plain form
1136.1 592949092 593609810 593764126 593367040 592759252 592426002 592556655 593067050 593977869 595485806
1154.4 595485806 597613037 600187421 603211641 606958747 611632288 617096007 623109758 629644573
1170.7 629644573 636655390 643761516 650587320 657114983 663303733 668830752 673481286 677355647
1187.1 677355647 680464804 682556510 683519542 683613658 683153868 682265401 681130528 680117249 679466784
1205.4 679466784 679019928 678518832 677910328 677114487 675907254 674206793 672177374 670003057 667759418
1223.8 667759418 665484548 663279831 661262453 659493029 657978117 656765997 655929089 655425370 655180514
1242.1 655180514 655193150 655450821 655871987 656397223 656998813 657619596 658194065 658752978 659407258 660205901
1262.5 660205901 661102533 662036538 662986517 663907170 664741099 665439546 665918648 666078806 665942073 665683568
$$ packed form
1136.1E92949092O60718J54316l97086o07788l33250J30653N10395R10819J507937
1154.4E95485806K127231K574384L024220L747106M673541N463719O013751O534815
1170.7F29644573P010817P106126O825804O527663O188750N527019M650534L874361
1187.1F77355647L109157K091706R63032R4116m59790q88467j134873j013279o50465
1205.4F79466784m46856n01096o08504p95841j207233j700461k029419k174317k243639
1223.8F67759418k274870k204717k017378j769424j514912j212120q36908n03719k44856
1242.1F55180514J2636K57671M21166N25236O01590O20783N74469N58913O54280P98643
1262.5F60205901Q96632R34005R49979R20653Q33929O98447M79102J60158j36733k58505
$$ plain form
1282.9 665683568 665442526 665146470 664602816 663746953 662634254 661249876 659461319 657313287 654997170
1301.3 654997170 652552426 649894834 647067964 644261122 641520381 638825655 636293232 634116471
1317.6 634116471 632380486 630924702 629556775 628283024 627053618 625712276 624313772 623100877
1333.9 623100877 622157216 621329427 620674312 620410979 620411038 620332241 620007217 619581282 619284987 619047284
1354.3 619047284 618638873 618077457 617420912 616585672 615548730 614323735 612925887 611425817 609492362
1372.7 609492362 606967568 604039550 598850727 588028133 574834824 570762098 580051422 591835082
1389 591835082 597462356 599001944 599049687 598476589 597651958 597073257 596792519 596538186 596339107 596331477
1409.4 596331477 596569479 596895933 597086966 597315609 598194599 599559367 600928962 602413476 604050457
$$ packed form
1282.9F65683568k41042k96056n43654q55863j112699j384378j788557k148032k316117
1301.3F54997170k444744k657592k826870k806842k740741k694726k532423k176761
1317.6F34116471j735985j455784j367927j273751j229406j341342j398504j212895
1333.9F23100877r43661q27789o55115k63333N9p8797l25024m25935k96295k37703
1354.3F19047284m08411n61416o56545q35240j036942j224995j397848j500070j933455
1372.7F09492362k524794k928018n188823j0822594j3193309m072726R289324J1783660
1389E91835082N627274J539588M7743n73098q24631n78701k80738k54333j99079p630
1409.4E96331477K38002L26454J91033K28643Q78990J364768J369595J484514J636981
$$ plain form
1427.7 604050457 605703354 607159972 608315825 609548330 611136317 612540126 613697648 614876986
1444.1 614876986 616010368 616921604 617769480 618722737 619700968 620858014 622944057 625567496 628025055
1462.4 628025055 630468071 633152008 636140049 639729798 644566655 649963439 654998481 659572184
1478.7 659572184 663424850 666429162 668619752 670191705 671046317 671137631 670756817 669700682 667594910
1497.1 667594910 664997339 662680149 660608232 657678306 653270721 650325954 648640037 646734297
1513.4 646734297 644399345 642240763 640965879 640175521 639330566 638280094 637206018 636334598 635099828
1531.8 635099828 633392692 632211268 631283224 629760444 628575683 628480673 628896713 629272819 629470885
1550.1 629470885 629925907 630772769 631472230 631754935 632696390 633900583 634386718 634087622 633191049
$$ packed form
1427.7F04050457J652897J456618J155853J232505J587987J403809J157522J179338
1444.1F14876986J133382R11236Q47876R53257R78231J157046K086043K623439K457559
1462.4F28025055K443016K683937K988041L589749M836857N396784N035042M573703
1478.7F59572184L852666L004312K190590J571953Q54612R1314l80814j056135k105772
1497.1F67594910k597571k317190k071917k929926m407585k944767j685917j905740
1513.4F46734297k334952k158582j274884p90358q44955j050472j074076q71420j234770
1531.8F35099828j707136j181424r28044j522780j184761r5010M16040L76106J98066
1550.1F29470885M55022Q46862O99461K82705R41455J204193M86135k99096q96573
$$ plain form
1568.5 633191049 632196605 631253898 629416466 626309693 623554349 621033788 617673337 613736212 609813690
1586.8 609813690 605938852 601835072 597649813 593793154 590409517 587167323 583848000 580750346
1603.2 580750346 578039467 575310528 572340906 569588423 567183673 564342976 560870826 558299780
1619.5 558299780 556222200 553636551 550948739 548435390 546213984 544497371 542765200 540783048
1635.8 540783048 539805293 539639473 539447069 539132357 538997650 539516866 540164411 540498376 541560173
1654.1 541560173 543382108 544990480 546559334 548618078 551245689 553621531 555950522 559076071
1670.5 559076071 562489808 566014111 569848418 573555648 577074945 580881119 586057544 591430962
1686.8 591430962 596335292 601474404 606174707 611110747 616846561 622695506 629226983 634826899
$$ packed form
1568.5F33191049r94444r42707j837432l106773k755344k520561l360451l937125l922522
1586.8F09813690l874838m103780m185259l856659l383637l242194l319323l097654
1603.2E80750346k710879k728939k969622k752483k404750k840697l472150k571046
1619.5E58299780k077580k585649k687812k513349k221406j716613j732171j982152
1635.8E40783048r77755j65820j92404l14712j34707N19216O47545L33965J061797
1654.1E41560173J821935J608372J568854K058744K627611K375842K328991L125549
1670.5E59076071L413737L524303L834307L707230L519297L806174N176425N373418
1686.8E91430962M904330N139112M700303M936040N735814N848945O531477N599916
$$ plain form
1703.1 634826899 639698267 644652784 648696005 651773214 654285908 656375647 658308744 660344243
1719.4 660344243 662274122 663918734 665184021 666056514 666841865 667578697 668250740 669334114 670752108
1737.8 670752108 672449946 674424827 676519394 678920269 681819558 685344279 689305544 693128467
1754.1 693128467 697066784 701235831 705117047 709084451 713065147 716516912 719465673 722143948
1770.4 722143948 725161433 728352129 730892479 732912719 734940708 737006843 738793075 740347207
1786.7 740347207 741816878 743197918 744635880 746090531 747481823 748831511 750070095 751225829
1803 751225829 752447844 753722370 754797578 755656958 756594360 757705152 758740962 759542584 760259449
1821.4 760259449 761057675 761881113 762506604 763086677 764030039 765057862 765740037 766284108 766969204
$$ packed form
1703.1F34826899M871368M954517M043221L077209K512694K089739J933097K035499
1719.4F60344243J929879J644612J265287Q72493P85351P36832O72043J083374J417994
1737.8F70752108J697838J974881K094567K400875K899289L524721L961265L822923
1754.1F93128467L938317M169047L881216L967404L980696L451765K948761K678275
1770.4G22143948L017485L190696K540350K020240K027989K066135J786232J554132
1786.7G40347207J469671J381040J437962J454651J391292J349688J238584J155734
1803G51225829J222015J274526J075208Q59380R37402J110792J035810Q01622P16865
1821.4G60259449P98226Q23438O25491N80073R43362J027823O82175N44071O85096
$$ plain form
1839.8 766969204 767586470 767974377 768519342 769385159 770244777 770827889 771221638 771755517 772418678 772926688
1860.2 772926688 773254514 773610771 773956299 774197996 774582684 775244951 775969744 776473463 776725948 777007163
1880.5 777007163 777472913 777892649 778066754 778225601 778689265 779218256 779470503 779676139 780093789 780515313
1900.9 780515313 780708849 780852973 781168818 781545699 781788468 781940162 782153070 782399714 782546043 782604218
1921.3 782604218 782844961 783298969 783572316 783593357 783713043 783999741 784146667 784089983 784072161 784204185
1941.7 784204185 784334421 784375787 784490168 784733891 784868717 784777105 784734011 784930527 785112560 785046399
1962.1 785046399 784949839 785053790 785207629 785194576 785153031 785314798 785508573 785445869 785288692 785378575
1982.5 785378575 785561025 785475194 785243571 785222173 785373807 785357833 785184324 785196543 785367012 785313785
$$ packed form
1839.8G66969204O17266L87907N44965Q65817Q59618N83112L93749N33879O63161N08010
1860.2G72926688L27826L56257L45528K41697L84688O62267P24793N03719K52485K81215
1880.5G77007163M65750M19736J74105J58847M63664N28991K52247K05636M17650M21524
1900.9G80515313J93536J44124L15845L76881K42769J51694K12908K46644J46329N8175
1921.3G82604218K40743M54008K73347K1041J19686K86698J46926n6684j7822J32024
1941.7G84204185J30236M1366J14381K43723J34826r1612m3094J96516J82033o6161
1962.1G85046399r6560J03951J53839j3053m1545J61767J93775o2704j57177Q9883
1982.5G85378575J82450q5831k31623k1398J51634j5974j73509J2219J70469n3227
$$ plain form
2002.9 785313785 785056353 784974098 785089135 785032213 784729958 784518421 784529567 784467101 784185588 783992529
2023.3 783992529 784024894 783968329 783660471 783412933 783413649 783346653 782996356 782697618 782750964 782871783 782720685
2045.8 782720685 782488525 782490432 782557428 782380879 782127261 782141924 782301128 782222509 781961143 781903923 782046258
2068.2 782046258 782028735 781850755 781828940 781971037 781960964 781768799 781727970 781899393 781929612 781691194
2088.6 781691194 781555235 781712770 781817198 781656444 781560898 781733572 781835735 781664848 781543791 781701207
2109 781701207 781833887 781676650 781525254 781689167 781913280 781852007 781676888 781759918 781990767 781988382 781821251
2131.4 781821251 781873107 782129407 782175422 781981051 781983614 782257557 782389402 782295287 782346010 782607913 782722652
2153.9 782722652 782579601 782537818 782786906 783001959 782963872 782980144 783276141 783541083 783532858 783529222 783788025
$$ packed form
2002.9G85313785k57432q2255J15037n6922l02255k11537J1146o2466k81513j93059
2023.3G83992529L2365n6565l07858k47538P16o6996l50297k98738N3346J20819j51098
2045.8G82720685k32160J907O6996j76549k53618J4663J59204p8619k61366n7220J42335
2068.2G82046258j7523j77980k1815J42097j0073j92165m0829J71423L0219k38418
2088.6G81691194j35959J57535J04428j60754r5546J72674J02163j70887j21057J57416
2109G81701207J32680j57237j51396J63913K24113o1273j75119Q3030K30849k385j67131
2131.4G81821251N1856K56300M6015j94371K563K73943J31845r4115N0723K61903J14739
2153.9G82722652j43051m1783K49088K15053l8087J6272K95997K64942q225l636K58803
$$ plain form
2176.3 783788025 784092128 784172297 784196019 784425855 784690619 784715295 784663439 784846425 785124183 785171330
2196.7 785171330 785129189 785323620 785640359 785722673 785610199 785684764 785979867 786114275 786020398 786077797
2217.1 786077797 786355197 786477506 786344409 786299706 786511600 786678612 786589682 786522210 786701560 786859214
2237.5 786859214 786746383 786622345 786776304 786968172 786882818 786742747 786886096 787102044 787028968 786849082
2257.9 786849082 786903262 787055790 787009537 786862910 786899090 787059188 787046731 786860824 786790192 786880851 786878824
2280.3 786878824 786724210 786666512 786766112 786725402 786432743 786189437 786166191 786143601 785958529 785771668
2300.7 785771668 785719752 785587251 785194516 784789860 784626842 784514308 784208119 783846200 783577204 783292472
2321.1 783292472 782896578 782488644 782224357 782059312 781790197 781419158 781125724 780871868 780457318 779951274
$$ packed form
2176.3G83788025L04103Q0169K3722K29836K64764K4676n1856J82986K77758M7147
2196.7G85171330m2141J94431L16739Q2314j12474P4565K95103J34408r3877N7399
2217.1G86077797K77400J22309j33097m4703K11894J67012q8930o7472J79350J57654
2237.5G86859214j12831j24038J53959J91868q5354j40071J43349K15948p3076j79886
2257.9G86849082N4180J52528m6253j46627L6180J60098j2457j85907p0632R0659k027
2280.3G86878824j54614n7698R9600m0710k92659k43306k3246k2590j85072j86861
2300.7G85771668n1916j32501l92735m04656j63018j12534l06189l61919k68996k84732
2321.1G83292472l95894m07934k64287j65045k69115l71039k93434k53856m14550n06044
$$ plain form
2341.5 779951274 779750824 779968739 780068398 779685974 779015601 778357506 777710974 777038217 776565552 776376486
2361.9 776376486 776276588 776213109 776310086 776501238 776567101 776504874 776534021 776738048 776916444 776899517 776811421
2384.3 776811421 776746929 776566446 776206672 775846779 775629878 775432467 775116622 774774253 774509132 774225414
2404.7 774225414 773820817 773405612 773121119 772861600 772454500 771985471 771629393 771276712 770701587 770038724
2425.1 770038724 769630969 769480109 769294500 769007146 768778443 768563986 768188059 767713487 767338812 767064393
2445.5 767064393 766715646 766266465 765881419 765587449 765225828 764749646 764309466 763968647 763597727 763157547
2465.9 763157547 762764633 762429893 762006164 761442244 760894656 760496616 760122955 759626627 759132802 758747101
2486.3 758747101 758327127 757778466 757260382 756888270 756499112 755984843 755501807 755134821 754730463 754190445
$$ packed form
2341.5G79951274k00450K17915R9659l82424o70373o58095o46532o72757m72665j89066
2361.9G76376486r9898o3479R6977J91152O5863o2227K9147K04027J78396j6927q8096
2384.3G76811421o4492j80483l59774l59893k16901j97411l15845l42369k65121k83718
2404.7G74225414m04597m15205k84493k59519m07100m69029l56078l52681n75125o62863
2425.1G70038724m07755j50860j85609k87354k28703k14457l75927m74572l74675k74419
2445.5G67064393l48747m49181l85046k93970l61621m76182m40180l40819l70920m40180
2465.9G63157547l92914l34740m23729n63920n47588l98040l73661m96328m93825l85701
2486.3G58747101m19974n48661n18084l72112l89158n14269m83036l66986m04358n40018
$$ plain form
2506.7 754190445 753649473 753243327 752883434 752432764 751967549 751613855 751278043 750810623 750293493 749874473
2527.1 749874473 749489248 749016285 748503804 748078167 747730374 747304261 746760547 746258199 745873690 745487988
2547.5 745487988 745022714 744572282 744184256 743726730 743164659 742662370 742251039 741774559 741218805 740759671
2567.9 740759671 740431309 740050793 739521980 738964796 738491535 738031387 737491548 736944258 736486852 736009359
2588.3 736009359 735399365 734807909 734347403 733864307 733256936 732666910 732218146 731795430 731214404 730527699
2608.7 730527699 729924738 729409873 728841364 728201807 727633595 727148354 726586759 725921392 725286365 724732041
2629.1 724732041 724139690 723452806 722844481 722384572 721841872 721113920 720397949 719802201 719183087 718458414
2649.5 718458414 717770755 717208385 716643989 715972662 715276957 714661896 714073181 713402390 712708890 712097645
$$ packed form
2506.7G54190445n40972m06146l59893m50670m65215l53694l35812m67420n17130m19020
2527.1G49874473l85225m72963n12481m25637l47793m26113n43714n02348l84509l85702
2547.5G45487988m65274m50432l88026m57526n62071n02289m11331m76480n55754m59134
2567.9G40759671l28362l80516n28813n57184m73261m60148n39839n47290m57406m77493
2588.3G36009359o09994n91456m60506m83096o07371n90026m48764m22716n81026o86705
2608.7G30527699o02961n14865n68509o39557n68212m85241n61595o65367o35027n54324
2629.1G24732041n92351o86884o08325m59909n42700p27952p15971n95748o19114p24673
2649.5G18458414o87659n62370n64396o71327o95705o15061n88715o70791o93500o11245
$$ plain form
2669.9 712097645 711516201 710849822 710127115 709472358 708862782 708188295 707486570 706882060 706338346 705708802
2690.3 705708802 704990268 704307318 703680754 703011870 702308178 701665282 701059401 700372398 699606478 698889017
2710.7 698889017 698239207 697529554 696756542 696083605 695525825 694904923 694147289 693405867 692781150 692160189
2731.1 692160189 691455066 690763891 690207779 689685345 689053059 688410163 687874913 687369287 686751604 686048806
2751.4 686048806 685426593 684896469 684313416 683635950 682994545 682436943 681848466 681228280 680660963 680095375
2771.8 680095375 679430127 678673804 677916110 677207053 676511467 675798774 675096154 674416602 673666835 672794104
2792.2 672794104 671943724 671179891 670354187 669404805 668460429 667586327 666693926 665738940 664744139 663712382
2812.6 663712382 662642419 661544621 660463452 659411132 658302188 657082200 655791998 654471934
$$ packed form
2669.9G12097645n81444o66379p22707o54757o09576o74487p01725o04510n43714o29544
2690.3G05708802p18534o82950o26564o68884p03692o42896o05881o87003p65920p17461
2710.7F98889017o49810p09653p73012o72937n57780o20902p57634p41422o24717o20961
2731.1F92160189p05123o91175n56112n22434o32286o42896n35250n05626o17683p02798
2751.4F86048806o22213n30124n83053o77466o41405n57602n88477o20186n67317n65588
2771.8F80095375o65248p56323p57694p09057o95586p12693p02620o79552p49767q72731
2792.2F72794104q50380p63833q25704r49382r44376q74102q92401r54986r94801j031757
2812.6F63712382j069963j097798j081169j052320j108944j219988j290202j320064
$$ plain form
2828.9 654471934 653092921 651616633 650086343 648505151 646693289 644454479 641788483 638788283
2845.3 638788283 635609627 632634878 630379498 629100323 628525198 628173351 627750874 627146423 626304626
2863.6 626304626 625166953 623808801 622467637 621320724 620317996 619373262 618584692 617958724 617321610
2882 617321610 616583765 615771651 614931464 614037752 613072217 612113297 611116827 609949887 608688712 607476413
2902.4 607476413 606268883 604919195 603327930 601495266 599409938 597038567 594566882 592376351
2918.7 592376351 590713441 589566648 588853240 588581502 588711619 589031935 589432597 590052903 590975583
2937 590975583 592115760 593399644 594736457 595968008 596933782 597580969 598048449 598430991 598706782
2955.4 598706782 598953485 599337995 599970579 600818992 601833105 603001416 604290426 605690837 607131898
$$ packed form
2828.9F54471934j379013j476288j530290j581192j811862k238810k665996l000200
2845.3F38788283l178656k974749k255380j279175n75125l51847m22477o04451q41797
2863.6F26304626j137673j358152j341164j146913j002728r44734p88570o25968o37114
2882F17321610p37845q12114q40187q93712r65535r58920r96470j166940j261175j212299
2902.4F07476413j207530j349688j591265j832664k085328k371371k471685k190531
2918.7E92376351j662910j146793p13408k71738J30117L20316M00662O20306R22680
2937E90975583J140177J283884J336813J231551R65774O47187M67480L82542K75791
2955.4E98706782K46703L84510O32584Q48413J014113J168311J289010J400411J441061
$$ plain form
2973.8 607131898 608475983 609741807 611001134 612132728 613037288 613849282 614684045 615464926 616043389
2992.1 616043389 616356969 616491377 616424918 616095364 615699351 615338802 614888906 614368558 613898873 613426507
3012.5 613426507 612793207 611982644 611114621 610276163 609469354 608601034 607597768 606612265 605773807
3030.9 605773807 604998827 604156077 603206396 602288485 601440907 600525141 599503279 598425806 597389817
3049.2 597389817 596423209 595451057 594486952 593532503 592553854 591598034 590720475 589943707 589159250 588257074
3069.6 588257074 587356687 586581826 585936308 585358262 584687948 583871484 583031654 582210422 581393421 580595434
3090 580595434 579754770 578864992 578041971 577323437 576585352 575705767 574783027 573971033 573186755 572293997
3110.4 572293997 571397305 570611715 569813967 568881273 567804635 566621542 565447092 564366996 563333154
$$ packed form
2973.8F07131898J344085J265824J259327J131594R04560Q11994Q34763P80881N78463
2992.1F16043389L13580J34408o6459l29554l96013l60549m49896n20348m69685m72366
3012.5F13426507o33300q10563q68023q38458q06809q68320j003266r85503q38458
3030.9F05773807p74980q42750r49681r17911q47578r15766j021862j077473j035989
3049.2E97389817r66608r72152r64105r54449r78649r55820q77559p76768p84457r02176
3069.6E88257074r00387p74861o45518n78046o70314q16464q39830q21232q17001p97987
3090E80595434q40664q89778q23021p18534p38085q79585r22740q11994p84278q92758
3110.4E72293997q96692p85590p97748r32694j076638j183093j174450j080096j033842
$$ plain form
3128.8 563333154 562250078 561100423 559969962 558960855 557986259 556831777 555561543 554371297
3145.1 554371297 553226233 552103758 551058710 549954295 548676252 547345102 546065390 544827282
3161.4 544827282 543583572 542308509 541027427 539769948 538561583 537381411 536164641 534921229
3177.7 534921229 533689320 532436013 531159282 529915214 528734028 527591527 526425779 525221348
3194 525221348 524035931 522897601 521762431 520628989 519525707 518440008 517349482 516276479 515258431
3212.4 515258431 514246702 513199091 512181282 511212051 510194480 509106457 508046865 507062316 506150067
3230.7 506150067 505280316 504290700 503141880 502022386 500986993 499985844 499053895 498128086 497051835
3249.1 497051835 495896101 494880766 493998796 493067175 492054194 491039097 490024120 489012837 488081634
$$ packed form
3128.8E63333154j083076j149655j130461j009107r74596j154482j270234j190246
3145.1E54371297j145064j122475j045048j104415j278043j331150j279712j238108
3161.4E44827282j243710j275063j281082j257479j208365j180172j216770j243412
3177.7E34921229j231909j253307j276731j244068j181186j142501j165748j204431
3194E25221348j185417j138330j135170j133442j103282j085699j090526j073003j018048
3212.4E15258431j011729j047611j017809r69231j017571j088023j059592r84549r12249
3230.7E06150067q69751r89616j148820j119494j035393j001149r31949r25809j076251
3249.1D97051835j155734j015335q81970r31621j012981j015097j014977j011283r31203
$$ plain form
3267.5 488081634 487259030 486420482 485476464 484502345 483571112 482687026 481822371 480954945 480112433 479334354
3287.8 479334354 478653520 478042752 477391720 476631820 475783587 474953622 474266171 473714113 473111212 472286135
3308.2 472286135 471327484 470424801 469584346 468699217 467761368 466835469 465948969 465060502 464066893 463004887
3328.6 463004887 461988330 460953116 459886372 458946496 458087653 457120538 456060290 454998344 454006881
3347 454006881 453095645 452102989 450956643 449816912 448820412 447937131 447061509 446191043 445418328 444682360
3367.4 444682360 443803668 442747921 441680402 440735996 439890951 439098418 438297540 437457055 436667860
3385.7 436667860 436051428 435594946 435100973 434410065 433664948 433145761 432806432 432271361 431451172 430706173
3406.1 430706173 430209249 429822773 429444164 429002404 428492099 428063095 427789688 427568257 427379191 427332580
$$ packed form
3267.5D88081634q22604q38548r44018r74119r31233q84086q64655q67426q42512p78079
3287.8D79334354o80834o10768o51032p59900q48233q29965o87451n52058o02901q25077
3308.2D72286135r58651r02683q40455q85129r37849r25899q86500q88467r93609j062006
3328.6D63004887j016557j035214j066744r39876q58843r67115j060248j061946r91463
3347D54006881r11236r92656j146346j139731r96500q83281q75622q70466p72715p35968
3367.4D44682360q78692j055747j067519r44406q45045p92533q00878q40485p89195
3385.7D36667860o16432m56482m93973o90908p45117n19187l39329n35071q20189p44999
3406.1D30706173m96924l86476l78609m41760n10305m29004k73407k21431j89066m6611
$$ plain form
3426.5 427332580 427427590 427519023 427616507 427796334 427872390 427698463 427492917 427473962 427668065 428037584
3446.9 428037584 428404957 428684384 429005951 429470271 430065066 430709839 431260765 431768298 432517797 433468193
3467.3 433468193 434221625 434666246 435115218 435782820 436660856 437615633 438428611 439142764 439988405 440911293
3487.7 440911293 441783577 442674726 443660259 444782823 445914268 446926862 447942734 448958784 449878037
3506.1 449878037 450865567 452064753 453415424 454730392 455869287 456937581 458152264 459625959
3522.4 459625959 461061180 462231576 463483661 464966923 466458768 467995048 469626069 471164942
3538.7 471164942 472675979 474343866 476131320 477808237 479271889 480823249 482627690 484467030
3555 484467030 486281991 488160670 490000218 491576403 493230373 495715648 498492122 500733793 502754688
$$ packed form
3426.5D27332580R5010R1433R7484J79827P6056j73927k05546j8955J94103L69519
3446.9D28037584L67373K79427L21567M64320N94795O44773N50926N07533P49499R50396
3467.3D33468193P53432M44621M48972O67602Q78036R54777Q12978P14153Q45641R22888
3487.7D40911293Q72284Q91149R85533J122564J131445J012594J015872J016050R19253
3506.1D49878037R87530J199186J350671J314968J138895J068294J214683J473695
3522.4D59625959J435221J170396J252085J483262J491845J536280J631021J538873
3538.7D71164942J511037J667887J787454J676917J463652J551360J804441J839340
3555D84467030J814961J878679J839548J576185J653970K485275K776474K241671K020895
$$ plain form
3573.4 502754688 504906237 507194281 509620607 512059152 514271319 516474783 519140959 521904171
3589.7 521904171 524274468 526635885 529264688 532051444 534921825 537727237 540245116 542676032
3606 542676032 545479894 548432648 551323414 554276347 557023346 560044050 563667536 566762269 568909526
3624.4 568909526 570946455 574420333 578657746 581811965 584685028 587632716 590470791 593260407
3640.7 593260407 595731199 597693443 599904537 603699327 607987106 610608220 612812519 615924180
3657 615924180 618862092 621098816 623098731 624761879 626151860 628179073 630465984 632001996 634170771
3675.4 634170771 636751294 638522446 640020490 641201437 642019212 643359244 645504892 647156358
3691.7 647156358 648091137 648864210 649513960 650242746 651401520 652402699 652763367 652916193 653526187
$$ packed form
3573.4E02754688K151549K288044K426326K438545K212167K203464K666176K763212
3589.7E21904171K370297K361417K628803K786756K870381K805412K517879K430916
3606E42676032K803862K952754K890766K952933K746999L020704L623486L094733K147257
3624.4E68909526K036929L473878M237413L154219K873063K947688K838075K789616
3640.7E93260407K470792J962244K211094L794790M287779K621114K204299L111661
3657F15924180K937912K236724J999915J663148J389981K027213K286911J536012K168775
3675.4F34170771K580523J771152J498044J180947Q17775J340032K145648J651466
3691.7F47156358R34779P73073O49750P28786J158774J001179L60668J52826O09994
$$ plain form
3710 653526187 654876471 655932307 656302035 656537592 656834841 657163262 657647252 658246756 658419013 658180416
3730.4 658180416 658217847 659029365 660372436 661022186 660489559 660036325 660849512 661375582 661272526 662222803
3750.8 662222803 663482249 663779974 663830280 664381146 664938807 664975703 664982080 665142596 665590167 666274309
3771.2 666274309 666559219 666459858 666503489 666922748 667190135 667180598 667344689 667615354 667842746 667847216 667548239
3793.7 667548239 667389452 667264342 667213917 667818487 668106854 668215156 668879449 669016302 668377101 667917132
3814.1 667917132 668142200 668178737 668384671 669195473 669296026 669065654 668939531 668771863 668683589 668513238
3834.4 668513238 668492079 668900371 669297159 669608831 669851959 669557273 668474019 667246819 667751551
3852.8 667751551 669622064 669964433 669399261 668886662 668801785 668932557 668542802 668336272 668819785 669253469
$$ packed form
3710F53526187J350284J055836L69728K35557K97249L28421M83990N99504J72257k38597
3730.4F58180416L7431Q11518J343071O49750n32627m53234Q13187N26070j03056R50277
3750.8F62222803J259446K97725N0306N50866N57661L6896O377J60516M47571O84142
3771.2F66274309K84910r9361M3631M19259K67387r537J64091K70665K27392M470k98977
3793.7F67548239j58787j25110n0425O04570K88367J08302O64293J36853o39201m59969
3814.1F67917132K25068L6537K05934Q10802J00553k30372j26123j67668q8274j70351
3834.4F68513238k1159M08292L96788L11672K43128k94686j083254j227200N04732
3852.8F67751551J870513L42369n65172n12599q4877J30772l89755k06530M83513M33684
$$ plain form
3873.2 669253469 669355452 668910682 668602586 668746591 668747604 669005275 669004619 668550730 668722689 668976009
3893.6 668976009 668431878 667720735 667493761 667709887 668225825 668716848 668745220 668488979 668173015 667789698
3914 667789698 667587757 667698145 667730510 667512357 667363584 667285621 667020917 666866064 667097807 667271674
3934.4 667271674 667097032 666777074 666530073 666524649 666517198 666323245 666259766 666267872 666094482 665907025 665847838
3956.8 665847838 665795863 665731072 665701270 665594757 665360272 665126204 665011287 664986551 664969146 664898872 664801538
3979.3 664801538 664735794 664630711 664464235 664351106 664293408 664220214 664166808 664082587 663897455
3997.6 663897455
$$ packed form
3873.2F69253469J01983m44770l08096J44005J013K57671o56m53889J71959K53320
3893.6F68976009n44131p11143k26974K16126N15938M91023K8372k56241l15964l83317
3914F67789698k01941J10388L2365k18153j48773p7963k64704j54853K31743J73867
3934.4F67271674j74642l19958k47001n424p451j93953o3479Q106j73390j87457n9187
3956.8F65847838n1975o4791k9802j06513k34485k34068j14917k4736j7405p0274r7334
3979.3F64801538o5744j05083j66476j13129n7698p3194n3406q4221j85132
3997.6F63897455
##END=$$ End of the data block
