##TITLE=$$ Begin of the data block
##JCAMP-DX=5.00 $$ ACD/SpecManager v 10.08
##SPECTROMETER/DATA SYSTEM=Alpha
##DATE=11 Nov 2014 09:02:30
##DATA TYPE=INFRARED SPECTRUM
##DATA CLASS=XYDATA
##ORIGIN=
##OWNER=
##NPOINTS=1765
##FIRSTX=399.76428223
##LASTX=3997.64306641
##MAXX=3997.64306641
##MINX=399.76428223
##MAXY=0.78994179
##MINY=0.42390281
##XFACTOR=1.0000000000
##YFACTOR=1.000000000000000e-9
##FIRSTY=0.65037316
##DELTAX=2.03961372
##XUNITS=1/CM
##YUNITS=ARBITRARY UNITS
##XYDATA=(X++(Y..Y))
399.8F50373161j335323k95639J311243k3544k089918j024365L48746j477122l538489
418.1F42248750j372338Q37207l98874j198709m9651N31674m99547j005709J9193O18040
438.5F39730036l02434q27491L06010J040757K07841n98251n13673n33164p85470l66211
458.9F37357950K1994l24249q51929j058698p93099m61459l29912l36409n10454m50492
479.3F32263243j72376k50102m48584l64125j65462k85507p08878p07209k09033k84434
499.7F28667533j124084j256823n29528n51641j399934j518190p58231p45475j645207
518.1F19138420j595498n45680l68595j214743j318991l21507j6809q40068q12530
536.4F12103999O50108J304388M17828K26677J325249J322866m04239j206160k5033
$$ plain form
399.8 650373161 649037838 648742199 650053442 650029898 647939980 646915615 647264361 645787239 642248750
418.1 642248750 640876412 641713619 641314745 640116036 640066385 640598059 640098512 639092803 639111996 639730036
438.5 639730036 639427602 638600111 638906121 639946878 640154719 639556468 639042795 638509631 637724161 637357950
458.9 637357950 637379944 637055695 636203766 635145068 634351969 633890510 633560598 633224189 632713735 632263243
479.3 632263243 632090867 631840765 631392181 631028056 630862594 630577087 629868209 629161000 628951967 628667533
499.7 628667533 627543449 626286626 625757098 625205457 623805523 622287333 621529102 620783627 619138420
518.1 619138420 617542922 616997242 616628647 615413904 614094913 613773406 613756597 612916529 612103999
536.4 612103999 612754107 614058495 614476323 614703000 616028249 617351115 616946876 615740716 615715683
554.8F15715683N66005o35981j103938L96788J213014j74701j105249O2764P68840
573.1F15703225m98175j125038N11229J579404K02358r01878K88486J261234n8233
591.5F16962612j262546J5795J278937J6809j275003j74403R12487l06129j508177
609.8F14660382k27868J264095J79529j191318K86937K335370J637578l4333P06077
628.2F19616449K270043J284778o58989R1851K083659J533091l18408L82006K574146
646.6F28858626K203882J52588L82959K110362J554609o57439n76377J447737J518249
664.9F36995196o43909o95765K387524K525747O32286M15921K408087K621651M06683
683.3F47053421k04802J658857K119005r776r56773P50184J547515j05023p09653J383364
$$ plain form
554.8 615715683 616281688 615645707 614541769 614938557 616151571 615976870 614871621 614934385 615703225
573.1 615703225 615205050 614080012 614591241 616170645 616373003 615471125 615759611 617020845 616962612
591.5 616962612 615700066 615715861 616994798 617011607 615736604 615562201 616474688 616168559 614660382
609.8 614660382 614432514 615696609 615876138 614684820 614971757 617307127 618944705 618910372 619616449
628.2 619616449 621886492 623171270 622512281 622604132 624687791 626220882 625902474 626284480 628858626
646.6 628858626 631062508 631215096 631598055 633708417 635263026 634605587 634029210 635476947 636995196
664.9 636995196 636351287 635655522 638043046 640568793 641201079 641617000 644025087 646646738 647053421
683.3 647053421 646848619 648507476 650626481 650616705 649659932 650410116 651957631 651852608 651142955 652526319
703.7F52526319K570689R26554o4015J691341K944648J346410O7412J810670L498614
722F67318642K183974P19666J988769L421843J897693o5267R04321K520740J381159
740.4F82271540n41866K76566K005696J010716j006901l16799J562059Q25048j181722
758.7F84904337n78582J577437J398503l76582O0737K173245K101302J86861K72453
777.1F91719711K308011K573430P97153O27577K553106K887666R25600L89874K164543
795.4G06946671K625704O79016k89083J093746J674115n4478r18925P19726J758754
813.8G14235246L16262r16063O6220O17385j289487k490401l25799K179623J792788
832.2G14185774P02322J911461L620565K805174Q87632Q89778J699388O08802j174152
$$ plain form
703.7 652526319 655097008 656023562 655959547 657650888 660595536 661941946 662009358 663820028 667318642
722 667318642 669502616 670222282 672211051 675632894 677530587 677465320 678369641 680890381 682271540
740.4 682271540 681729674 682006240 684011936 685022652 684015751 683698952 685261011 686086059 684904337
758.7 684904337 684325755 685903192 687301695 686925113 686985850 689159095 691260397 691447258 691719711
777.1 691719711 694027722 696601152 697398305 698025882 700578988 703466654 704392254 704782128 706946671
795.4 706946671 709572375 710251391 709962308 711056054 712730169 712675691 711756766 712476492 714235246
813.8 714235246 714551508 713635445 713701665 714319050 713029563 710539162 710213363 712392986 714185774
832.2 714185774 714888096 716799557 720420122 723225296 724112928 725002706 726702094 727310896 726136744
850.5G26136744p51197J017987J105607n3823K77996J566291J135766n16474o42955
868.9G29275942M24802p808j662850j935661r21190j191199k853691l233493j913130
887.2G15981722j437903k335965k163530l25441O96182m2557m08531N75602Q52287
905.6G11391866o10649j676083j087129o80328j658141k265275j223743k77876q77977
923.9G01034665j569629r58323m17471j463592k804577k794803k510845l533960m840672
942.3F80140793m734456l962279m112720m551470l751874k372206k139508k725244
958.6F51791036k522647j760543j991093l054797l478468l305256l827691n021572
974.9F26828969n604923n360663n390525n951464n873800m769802l867864l777981
$$ plain form
850.5 726136744 725385547 726403534 727509141 727455318 727733314 729299605 730435371 729918897 729275942
868.9 729275942 729700744 729692936 728030086 726094425 725173235 723982036 721128345 717894852 715981722
887.2 715981722 714543819 712207854 710044324 709718883 710415065 710372508 709963977 710539579 711391866
905.6 711391866 710781217 709105134 708018005 707337677 705679536 703414261 702190518 701912642 701034665
923.9 701034665 699465036 698506713 698089242 696625650 693821073 691026270 688515425 684981465 680140793
942.3 680140793 675406337 671444058 667331338 662779868 659027994 656655788 654516280 651791036
958.6 651791036 649268389 647507846 645516753 642461956 638983488 635678232 631850541 626828969
974.9 626828969 621224046 615863383 610472858 604521394 598647594 593877792 590009928 586231947
991.3E86231947l606677k908230k643466l327966l878414l518641l025472l120959
1007.6E60202122l229320k692223k046883k005339k055704j419425n56648l28660m42147
1025.9E45425773o6817N64337O33955L33786M92036R43363P64310l755l33786j1802
1046.3E48741400J48177p4982n8353L71814N75125K96294J77622N14388N94020L2306
1066.7E51317811m61340l92318k11000k01225J60515J118243J934945K014280J768231
1085.1E57048142J688540J503825Q76129J97828n6267p7069j68860j57475K58445R09210
1105.5E62022448J331865J527667J945854K542793K772749K573967K417922K412557
1121.8E79547822K228082J899123J881122K256275K367139J824617J137018O69897
$$ plain form
991.3 586231947 582625270 579717040 577073574 573745608 569867194 566348553 563323081 560202122
1007.6 560202122 556972802 554280579 552233696 550228357 548172653 546753228 546196580 545867920 545425773
1025.9 545425773 545358956 545923293 546557248 546891034 547383070 548326433 549090743 549086988 548753202 548741400
1046.3 548741400 548889577 548814595 548756242 549128056 549703181 549999475 550177097 550691485 551285505 551317811
1066.7 551317811 550856471 550464153 550253153 550051928 550212443 551330686 553265631 555279911 557048142
1085.1 557048142 558736682 560240507 561116636 561314464 561258197 561181128 561012268 560854793 561113238 562022448
1105.5 562022448 563354313 564881980 566827834 569370627 572143376 574717343 577135265 579547822
1121.8 579547822 581775904 583675027 585556149 587812424 590179563 592004180 593141198 593811095
1138.1E93811095J64389m28557o64771l50892J50382N28515R29475J524865K124131
1156.5E97788632K543807L007710L758967M645824N409718O013632O562352O983161
1172.8F36713803P050395O826460O554127O171107N507410M668474L884792L103733
1189.1F80480301K087236R61602J00493m65095r18627j160443j012802o58512m53591
1207.5F78960562m74632o17206q64327j256406j698018j999795k148390k214670k231419
1225.8F65455699k180100k023816j786172j496792j151025q03173n18024k61843R179
1244.2F55243933K62261M27961N31197O14941O24895N55754N59806O81341P97987Q74519
1264.6F61174595R33946R60469R17077Q12232O72579M70638J70470j10567k33412k41518
$$ plain form
1138.1 593811095 593975484 593546927 592882156 592531264 592681646 593210161 594139636 595664501 597788632
1156.5 597788632 600332439 603340149 607099116 611744940 617154658 623168290 629730642 636713803
1172.8 636713803 643764198 650590658 657144785 663315892 668823302 673491776 677376568 680480301
1189.1 680480301 682567537 683529139 683629632 683164537 682245910 681085467 680072665 679414153 678960562
1207.5 678960562 678485930 677868724 677004397 675747991 674049973 672050178 669901788 667687118 665455699
1225.8 665455699 663275599 661251783 659465611 657968819 656817794 656014621 655496597 655234754 655243933
1244.2 655243933 655506194 655934155 656465352 657080293 657705188 658260942 658820748 659502089 660300076 661174595
1264.6 661174595 662108541 663069010 663986087 664798319 665470898 665941536 666112006 666001439 665768027 665526509
1285F65526509l19123n80490q89539j131416j405537j805842k145886k299845k434016
1303.3F52514815k689004k892673k832114k709270k682447k557278k193749j731276
1319.6F32227004j444757j393259j314878j202047j279891j377582j202763r32276
1336F22079551q47041o82354k45631N1439l1054k81334l76821k61426k18153l62932
1356.4F18824244m93110o00516p96676r96769j155793j297653j409948j861274k420664
1374.7F07791841k741337m779339r978175j2222171l882110Q428037J0779977N119205
1391E98515928J317262p1466o21140q33570n87285k95520k67982k16186k7895K19225
1411.4E97131371L03984J30177J19686Q25822J396001J372993J468062J645029J644432
$$ plain form
1285 665526509 665207386 664626896 663737357 662605941 661200404 659394562 657248676 654948831 652514815
1303.3 652514815 649825811 646933138 644101024 641391754 638709307 636152029 633958280 632227004
1319.6 632227004 630782247 629388988 628074110 626872063 625592172 624214590 623011827 622079551
1336 622079551 621232510 620550156 620304525 620355964 620324910 620043576 619666755 619405329 619187176 618824244
1356.4 618824244 618331134 617730618 616933942 615937173 614781380 613483727 612073779 610212505 607791841
1374.7 607791841 605050504 600271165 590292990 578070819 574188709 582616746 593396723 598515928
1391 598515928 599833190 599761724 599140584 598307014 597719729 597424209 597156227 596940041 596912146 597131371
1411.4 597131371 597435355 597565532 597685218 598511040 599907041 601280034 602748096 604393125 606037557
1429.8F06037557J421392J140416J224816J558661J383245J163364J181483J111209
1446.1F16222143Q89003Q36313R32038R28700J113117K147078K706707K478063K451897
1464.5F30705059K712011K993941L561497M803836N391598N064607M602849L836155
1480.8F63671553K988100K214611J581073Q21590L8207m48466j116574k103030k536774
1499.1F65110290k292573k123833l006697m379093k868355j683295j919627k312004
1515.4F44524813k140463j310229q03947p87318j012385j071751q51274j208901j676858
1533.8F33661687j127004r10104j572728j166939J370M77970L98815K03490M38154
1552.2F30404711P97868O20544J90019R43124J266241N10991l06904r34899j036346
$$ plain form
1429.8 606037557 607458949 608599365 609824181 611382842 612766087 613929451 615110934 616222143
1446.1 616222143 617111146 617947459 618879497 619808197 620921314 623068392 625775099 628253162 630705059
1464.5 630705059 633417070 636411011 639972508 644776344 650167942 655232549 659835398 663671553
1480.8 663671553 666659653 668874264 670455337 671276927 671315134 670866668 669750094 667647064 665110290
1499.1 665110290 662817717 660693884 657687187 653308094 650439739 648756444 646836817 644524813
1515.4 644524813 642384350 641074121 640270174 639482856 638470471 637398720 636547446 635338545 633661687
1533.8 633661687 632534683 631624579 630051851 628884912 628886282 629364252 629763067 629966557 630404711
1552.2 630404711 631202579 631823123 632013142 632956266 634222507 634733498 634426594 633491695 632455349
1570.5F32455349r62019j885176l168702k767443k524555l376842l955006l953398
1586.8F09862208l918469m153072m247070l921091l440380l301681l373980l147543
1603.2E80358922k788007k838790l083587k853989k517701k981782l582716k643764
1619.5E57068586k164244k656162k754808k581775k235293j725435j768113j956522
1635.8E39226234r04203j30236j69932k98977j01030O32167P69436M15325J197517
1654.1E40636301J993954J711548J608669K098680K701223K449095K404153L216029
1670.5E58819652L498733L605306L899693L737986L548921L862500N245745N435526
1686.8E91654062M978121N199194M692852M898846N733013N871773O636858N744755
$$ plain form
1570.5 632455349 631493330 629608154 626439452 623672009 621147454 617770612 613815606 609862208
1586.8 609862208 605943739 601790667 597543597 593622506 590182126 586880445 583506465 580358922
1603.2 580358922 577570915 574732125 571648538 568794549 566276848 563295066 559712350 557068586
1619.5 557068586 554904342 552248180 549493372 546911597 544676304 542950869 541182756 539226234
1635.8 539226234 538322031 538191795 538021863 537722886 537621856 538254023 539023459 539438784 540636301
1654.1 540636301 542630255 544341803 545950472 548049152 550750375 553199470 555603623 558819652
1670.5 558819652 562318385 565923691 569823384 573561370 577110291 580972791 586218536 591654062
1686.8 591654062 596632183 601831377 606524229 611423075 617156088 623027861 629664719 635409474
1703.1F35409474M962266N015671M083932L082096K509236K127588K023816K131880
1719.4F61345959J981914J669943J293719Q81612P57158P01845P06315J176476J442611
1737.8F71957552J665056J959980K109825K413750K911091L543198L980041L832817
1754.1F94373310L942906M183829L893078L977775M011870L494441K968013K653301
1770.4G23498523L000915L226459K592624K061247K039850K071679J826882J584053
1786.7G41902232J455128J357437J430630J475036J408816J358747J274348J172184
1803G52834558J185060J253009J098394Q87513R52363J100302J009345P97570P22766
1821.4G61840880P99715Q38876O34849N82218R70304J056612O87122N58198P19607
$$ plain form
1703.1 635409474 640371740 645387411 649471343 652553439 655062675 657190263 659214079 661345959
1719.4 661345959 663327873 664997816 666291535 667173147 667930305 668632150 669338465 670514941 671957552
1737.8 671957552 673622608 675582588 677692413 680106163 683017254 686560452 690540493 694373310
1754.1 694373310 698316216 702500045 706393123 710370898 714382768 717877209 720845222 723498523
1770.4 723498523 726499438 729725897 732318521 734379768 736419618 738491297 740318179 741902232
1786.7 741902232 743357360 744714797 746145427 747620463 749029279 750388026 751662374 752834558
1803 752834558 754019618 755272627 756371021 757258534 758210897 759311199 760320544 761118114 761840880
1821.4 761840880 762640595 763479471 764114320 764696538 765666842 766723454 767410576 767968774 768688381
1839.8G68688381O19948L54766N31018Q75056Q85129O20067M03047N16653O80506N45502
1860.2G74720073L05950L01779L30865K59400M00841O60479P16209N23687K87830K88487
1880.5G78795600M58300M30763J86562J57059M64975N25773K41220K08020M22716M21763
1900.9G82312751K07126J66595L32177L81946K32578J31607J83045K16365J47641Q5711
1921.3G84397542K68102M59850K47478N067J47164L26633J71006n1737m1008J12474
1941.7G86042571J40309M5062J17480K59877J21295j16110k0027K32816J89244o3896
1962.1G86948621q3863J09076J29640m3452m1246J76847K05576l4392j30295P1644
1982.5G87308156J40012j06573k20359J6988J87814r835j95980k2054J65403l3736
$$ plain form
1839.8 768688381 769308329 769663095 770194113 771069169 771954298 772574365 772977412 773494065 774174571 774720073
1860.2 774720073 775026023 775327802 775658667 775918067 776318908 776979387 777695596 778219283 778507113 778795600
1880.5 778795600 779253900 779684663 779871225 780028284 780493259 781019032 781260252 781468272 781890988 782312751
1900.9 782312751 782519877 782686472 783018649 783400595 783633173 783764780 783947825 784164190 784311831 784397542
1921.3 784397542 784665644 785125494 785372972 785378039 785525203 785851836 786022842 785971105 785930097 786042571
1941.7 786042571 786182880 786227942 786345422 786605299 786726594 786610484 786590457 786823273 787012517 786948621
1962.1 786948621 786864758 786973834 787103474 787060022 787018776 787195623 787401199 787366807 787236512 787308156
1982.5 787308156 787448168 787341595 787121236 787138224 787326038 787316203 787120223 787098169 787263572 787229836
2002.9G87229836k53022q5473J15156n7816k94984k02596J9014l5465k66552k16722
2023.3G85951376J8418l9160k86520k35081j609n5015l04163k87830J2099R5427j45316
2045.8G84722626k18212J2517O8724j75715k52545J0133J51038r1076k48134j549J95860
2068.2G84173667j4841k06053k2948J75118L3796j68860m5478J62661K2709k34127
2088.6G83875644j24693J57655J03712j76192j33037J74522J59741j36793j38521J49011
2109G83911049J63973j19508j46269J52111K30729m4644j66237P3612K16782P689j40846
2131.4G84138441Q2493K77877L8683k04861K7120K99096J22726j06036M9173K59579
2151.8G84984291J22904j13129k4081K27154K03848j8001K6465L01957K95162K8670
$$ plain form
2002.9 787229836 786976814 786891341 787006497 786948681 786653697 786451101 786470115 786434650 786168098 785951376
2023.3 785951376 785969794 785930634 785644114 785409033 785407424 785352409 785048246 784760416 784772515 784867942 784722626
2045.8 784722626 784504414 784516931 784585655 784409940 784157395 784167528 784318566 784227490 783979356 783977807 784173667
2068.2 784173667 784158826 783952773 783929825 784104943 784138739 783969879 783924401 784087062 784109771 783875644
2088.6 783875644 783750951 783908606 784012318 783836126 783703089 783877611 784037352 783900559 783762038 783911049
2109 783911049 784075022 783955514 783809245 783961356 784192085 784147441 783981204 784054816 784271598 784279287 784138441
2131.4 784138441 784220934 784498811 784537494 784332633 784359753 784658849 784781575 784675539 784724712 784984291
2151.8 784984291 785107195 784994066 784969985 785197139 785400987 785382986 785409451 785711408 786006570 786035240
2172.2G86035240J6391K79665L21209N5612k7001K23159L10660N6803n1200J90973
2192.6G87411511L00825M4465o7413K12073L71933J03057j40489M5360K84016J28626
2213G88693964p9035R5427L03566J17660j39475j1802K49863J62244j05202m8817K25067
2235.4G89463460J77563j23442j14440J70469J70052j09077j31011J49846K08617o2347
2255.8G89799690j40071J03116J79053o1751j78754L9816J90496k2113k27332q6546
2276.2G89595604R7752J2636j33753l5524J22010k8610k94387k35737K027P272j52767
2298.7G88956523j54495l5584j32680m04120m33385j53124k7836k47955l85463k73466
2319.1G86708415k48075m24743m51982k30729j54496l57151m33802k43426j45018l00109
$$ plain form
2172.2 786035240 786051631 786331296 786652505 786708117 786681116 786904275 787214935 787271738 787220538 787411511
2192.6 787411511 787712336 787756801 787689388 787901461 788273394 788376451 788235962 788281322 788565338 788693964
2213 788693964 788614929 788710356 789013922 789131582 788992107 788980305 789230168 789392412 789287210 789238393 789463460
2235.4 789463460 789641023 789517581 789403141 789573610 789743662 789634585 789503574 789653420 789862037 789799690
2255.8 789799690 789659619 789762735 789941788 789880037 789701283 789741099 789931595 789909482 789682150 789595604
2276.2 789595604 789693356 789705992 789572239 789536715 789658725 789630115 789335728 789099991 789102018 789109290 788956523
2298.7 788956523 788802028 788766444 788633764 788229644 787796259 787643135 787615299 787367344 786981881 786708415
2319.1 786708415 786460340 786035597 785583615 785352886 785198390 784841239 784407437 784164011 784018993 783718884
2339.5G83718884m30346j92880J40905k6822m41074o23882o12795p04229p54834m21106
2359.9G79651821m3869l6478r1196P1884K04801P2778p2539K7239J77741J11580o4313
2382.3G80009449q9229m9471j60814l51071l66509k07544j70171l10778l57628k57731
2402.7G77688503k67982m02630m12225k88248k64645l85404m32729l46303l77059o02722
2423.1G73908556o72162l91305j23679j73569k86162k44617k49148l83734m47214l73244
2443.5G70563722l09229l58165m15086l50178k76148l36409m59849m65215l73303l73424
2463.9G66846716m29630l93808l35097m07577n37395n18739l97504l95119m82142m69506
2484.3G62480199l97920m29571n27620n12123l96729l86774m77791m83692m20988m40716
$$ plain form
2339.5 783718884 783288538 783095658 783236563 783209741 782768667 782144785 781531990 780827761 780072927 779651821
2359.9 779651821 779607952 779571474 779480278 779552162 779756963 779829741 779757202 779784441 779962182 780073762 780009449
2382.3 780009449 779920220 779870749 779709935 779358864 778992355 778784811 778614640 778303862 777946234 777688503
2402.7 777688503 777420521 777017891 776605666 776317418 776052773 775667369 775234640 774888337 774511278 773908556
2423.1 773908556 773236394 772845089 772721410 772547841 772261679 772017062 771767914 771384180 770936966 770563722
2443.5 770563722 770254493 769896328 769481242 769131064 768854916 768518507 768058658 767593443 767220140 766846716
2463.9 766846716 766417086 766023278 765688181 765280604 764743209 764224470 763826966 763431847 762949705 762480199
2484.3 762480199 762082279 761652708 761125088 760612965 760216236 759829462 759351671 758867979 758446991 758006275
2504.7G58006275n28097n14389l83913l48330m60207m90427l67522l24011m30644m82082
2525.1G53676653m22001m02391m73916m81785l69966l23117m33743n30421m87864m28081
2545.5G49323368m55975m90666m38928l70682m33326n54144n18739m04060m34935n24044
2565.8G44697869m53651l25322l94047n68509n72741m63903m51624n16474n18799m56154
2586.2G39976645m83335o00516n98252m60267m41253n76854o10054n07533m72307n69642
2606.6G34656632o27816n43713n04673o10649o55771n21898m36306n60403o79195o25968
2627G28890240n57780o02007o61075o04510n17667n76913o97255o99878o18637o25848
2647.4G22728670p19428o76692n36859n87344p44343p16388n76854n63145o70194o78242
$$ plain form
2504.7 758006275 757478178 756963789 756579876 756231546 755771339 755280912 754913390 754589379 754158735 753676653
2525.1 753676653 753254652 752852261 752378345 751896560 751526594 751203477 750769734 750239313 749751449 749323368
2545.5 749323368 748867393 748376727 747937799 747567117 747133791 746579647 746060908 745656848 745221913 744697869
2565.8 744697869 744244218 743918896 743524849 742956340 742383599 741919696 741468072 740951598 740432799 739976645
2586.2 739976645 739493310 738892794 738294542 737834275 737393022 736816168 736206114 735698581 735226274 734656632
2606.6 734656632 734028816 733485103 732980430 732369781 731714010 731192112 730755806 730195403 729516208 728890240
2627 728890240 728332460 727730453 727069378 726464868 725947201 725370288 724673033 723973155 723354518 722728670
2647.4 722728670 722009242 721332550 720795691 720208347 719464004 718747616 718170762 717607617 716937423 716259181
2667.8G16259181n65469n53190o61195p10606o39618n87046o67810p14779n98610n45203
2688.2G10015655o60658p40350o86586o12974o43670p06017o53744n89132o74308p63893
2708.6G03284323p12633o77645p50423p72893o66022n65648o12796p25567p18773o34789
2729F96447134o28114o73473o37292n42760n66244o54996o19888n21183n11229o06954
2749.4F90485001o54519n67436n39065o47068p06255o35326n64992o04093o38009n66542
2769.8F84361696n30600o21498p50899p98524p41183p19428p40469o79255o33478p35998
2790.2F77410364q53360q36372p80761q25644r50157r70304q59499q43287r62436j030564
2810.6F68497980j011372j046479j103341j074910j045943j107573j229942j320958
$$ plain form
2667.8 716259181 715693712 715140522 714479327 713768721 713129103 712542057 711874247 711159468 710560858 710015655
2688.2 710015655 709354997 708614647 707928061 707315087 706671417 705965400 705311656 704722524 704048216 703284323
2708.6 703284323 702571690 701894045 701143622 700370729 699704707 699139059 698526263 697800696 697081923 696447134
2729 696447134 695819020 695145547 694508255 693965495 693399251 692744255 692124367 691603184 691091955 690485001
2749.4 690485001 689830482 689263046 688723981 688076913 687370658 686735332 686170340 685566247 684928238 684361696
2769.8 684361696 683831096 683209598 682458699 681660175 680918992 680199564 679459095 678779840 678146362 677410364
2790.2 677410364 676557004 675720632 674939871 674114227 673164070 672193766 671334267 670490980 669528544 668497980
2810.6 668497980 667486608 666440129 665336788 664261878 663215935 662108362 660878420 659557462
2826.9F59557462j353622j397133j477182j531064j588464j819670k253056k697885
2843.2F45439386l035307l215134k992987k213955j237273n93961l83079m17232n98669
2861.6F30751789q59857j129389j323044j320422j135170r88841r31681p84516o42240
2879.9F21636629o73234p74145q19922q34405q98064r70363r67622j008391j172185
2898.3F13518298j258493j202047j199722j345217j576662j814664k076387k393901
2914.6F00651205k530814k222001j640797j102269o64174k37703J32799K83897L71098
2933E93041241O29902R24110J136125J315653J385927J248539R62853O72638M87447
2951.3F01804435L71635K77877K83241M36902O62029Q49903R91702J148403J338243
$$ plain form
2826.9 659557462 658203840 656806707 655329525 653798461 652209997 650390327 648137271 645439386
2843.2 645439386 642404079 639188945 636195958 633982003 632744730 632150769 631767690 631350458 630751789
2861.6 630751789 629891932 628762543 627439499 626119077 624983907 623995066 623063385 622278869 621636629
2879.9 621636629 620963395 620189250 619369328 618534923 617636859 616666496 615698874 614690483 613518298
2898.3 613518298 612259805 611057758 609858036 608512819 606936157 605121493 603045106 600651205
2914.6 600651205 598120391 595898390 594257593 593155324 592491150 592253447 592386246 592670143 593041241
2933 593041241 593671143 594595253 595731378 597047031 598432958 599681497 600644350 601316988 601804435
2951.3 601804435 602176070 602453947 602737188 603174090 603836119 604686022 605677724 606826127 608164370
2969.7F08164370J475751J462400J348079J288294J263559J110673R14932Q53777Q46445
2988F18728280P78675O08683L35932J25944m9710k95162m09007l98338m30763m58419
3008.4F18536115m30107m46856o29187q58545r01699q11696p96795q88229r87887r74834
3028.8F10810280q60393p87676q71658j004457r53973q35597q67009r91464j058698
3047.2F02579355j018047r98557j031398r93610r58860r94921r69171q53956p56264
3065.5E94004571p84635q94249q91089p79331o75738o13033o73473q14677q75711q71599
3085.9E86131036q32319p85589q17120q63910q26895p54416p81954q93354r02235q01504
3106.3E77871740p98166r28402r36508q07345q13186r27985j056254j197934j204491
$$ plain form
2969.7 608164370 609640121 611102521 612450600 613738894 615002453 616113126 617028058 617881835 618728280
2988 618728280 619506955 620115638 620451570 620577514 620527804 620232642 619823635 619425297 618994534 618536115
3008.4 618536115 618106008 617659152 617029965 616171420 615269721 614458025 613661230 612773001 611785114 610810280
3028.8 610810280 609949887 609162211 608290553 607286096 606332123 605496526 604629517 603638053 602579355
3047.2 602579355 601561308 600562751 599531353 598537743 597578883 596583962 595614791 594760835 594004571
3065.5 594004571 593219936 592325687 591434598 590655267 589979529 589366496 588693023 587878346 587002635 586131036
3085.9 586131036 585298717 584513128 583696008 582832098 582005203 581250787 580468833 579575479 578673244 577871740
3106.3 577871740 577073574 576145172 575208664 574401319 573588133 572660148 571603894 570405960 569201469
3124.7E69201469j096844j046837j085996j153648j163066j077413j023531j150072
3141E60404062j288831j255095j181006j133085j076579j149058j313090j355947j326203
3159.4E49325168j292050j258790j260162j274228j286149j273989j267374j293242
3175.7E39119184j282573j227915j229167j278698j267851j212835j220942j268089
3192E29131114j260519j227140j205921j186729j163125j148641j145899j133263j124799
3210.3E18535078j102925j057446j054823j087189j086056j065016j073241j103938
3226.7E09904444j070022r44317q94606j034081j145601j098335j070261j068652j003742
3245E00574827r83894j076549j136601j037359r48370j026362j092434j045346r93043
$$ plain form
3124.7 569201469 568104625 567057788 565971792 564818144 563655078 562577665 561554134 560404062
3141 560404062 559115231 557860136 556679130 555546045 554469466 553320408 552007318 550651371 549325168
3159.4 549325168 548033118 546774328 545514166 544239938 542953789 541679800 540412426 539119184
3175.7 539119184 537836611 536608696 535379529 534100831 532832980 531620145 530399203 529131114
3192 529131114 527870595 526643455 525437534 524250805 523087680 521939039 520793140 519659877 518535078
3210.3 518535078 517432153 516374707 515319884 514232695 513146639 512081623 511008382 509904444
3226.7 509904444 508834422 507890105 506995499 505961418 504815817 503717482 502647221 501578569 500574827
3245 500574827 499590933 498514384 497377783 496340424 495392054 494365692 493273258 492227912 491234869
3263.4D91234869r56953r15587q79258r04619r96858j059324j031339r19312q29250
3281.7D82742369q47936r01490q54224p19637o71863p16627p71522q58486q74430p34627
3302.1D74791527n91010o41972q62419j021296j001776r12100r00864r50814r66936
3320.5D66942340r57250r96680j104801j152128j107485j106232j063913r52780j015783
3338.8D57485288j158625j157820j120388j069665r77367j025081j191735j203150
3355.2D48581457j072764r91643r84221r88037r11802q30531r31114j126885j154662
3373.5D39589798j027792r23306q56370q64148r04232q22067o36340m95553n76794
3391.9D32483196q10712q30978n64963l89427n94050q65996p46041n00053m75139m98652
$$ plain form
3263.4 491234869 490277916 489362329 488483071 487578452 486581594 485522270 484490931 483571619 482742369
3281.7 482742369 481894433 480992943 480138719 479419082 478747219 478030592 477259070 476400584 475526154 474791527
3302.1 474791527 474200517 473558545 472696126 471674830 470673054 469760954 468860090 467909276 466942340
3320.5 466942340 465985090 464988410 463883609 462731481 461623996 460517764 459453851 458501071 457485288
3338.8 457485288 456326663 455168843 454048455 452978790 452001423 450976342 449784607 448581457
3355.2 448581457 447508693 446517050 445532829 444544792 443632990 442802459 441871345 440744460 439589798
3373.5 439589798 438562006 437638700 436782330 435918182 435013950 434191883 433555543 433059990 432483196
3391.9 432483196 431672484 430841506 430276543 429887116 429293066 428427070 427681029 427180976 426705837 426207185
3412.3D26207185n01931n11974m16011l11821k86967k09957o5714N6564Q1391R8168
3432.7D24138933J63079P5549j62661k10077k5034J88649L49849L69668L48777M06027
3453.1D25642759M79430N45054N83649N28276N73069Q35240R74387P67976M65631M63694
3473.4D31859165P08849R26941R74417Q50856P98107R20116R82553R51797R75519J038939
3493.8D40987259J145184J145661J056492J130999J137644R70929J025945J271040
3510.2D49871153J443386J403570J197874J107932J262962J555294J575649J334250
3526.5D60752070J338214J542866J630515J666009J697213J627832J615137J736462
3542.8D73606318J884789J829028J634717J719534J938432J954943J917750J962185
$$ plain form
3412.3 426207185 425705254 425193280 424777269 424465448 424178481 423968524 423902810 423959374 424040765 424138933
3432.7 424138933 424302012 424377561 424214900 424004823 423979789 424168438 424518287 424887955 425236732 425642759
3453.1 425642759 426122189 426667243 427250892 427779168 428352237 429187477 430161864 430929840 431395471 431859165
3473.4 431859165 432568014 433494955 434469372 435320228 436118335 437038451 438021004 438972801 439948320 440987259
3493.8 440987259 442132443 443278104 444334596 445465595 446603239 447574168 448600113 449871153
3510.2 449871153 451314539 452718109 453915983 455023915 456286877 457842171 459417820 460752070
3526.5 460752070 462090284 463633150 465263665 466929674 468626887 470254719 471869856 473606318
3542.8 473606318 475491107 477320135 478954852 480674386 482612818 484567761 486485511 488447696
3559.1D88447696J943976J716822J770973K525836K847642K422303K200127K254128
3575.4E06129503K388716K593398K628088K380669K367854K827704K896250K469778
3591.7E26681960K472758K811432L034591L109694K977431K637327K530038K913237
3608.1E49168468L113508L078758L084660K852976L240109L902495L253877K215922
3624.4E73910773K089619L570795M414022L305197K976954L098488L071070L019869
3640.7E99456787K641976K071619K267897L881693M469097K798497K315224L210544
3657F23113334L049493K315521K031029J682996J415253K025187K284348J606226K331376
3675.4F41854763K709627J794040J503885J214743Q77499J372219K150595J749098
$$ plain form
3559.1 488447696 490391672 492108494 493879467 496405303 499252945 501675248 503875375 506129503
3575.4 506129503 508518219 511111617 513739705 516120374 518488228 521315932 524212182 526681960
3591.7 526681960 529154718 531966150 535000741 538110435 541087866 543725193 546255231 549168468
3608.1 549168468 552281976 555360734 558445394 561298370 564538479 568440974 571694851 573910773
3624.4 573910773 576000392 579571187 583985209 587290406 590267360 593365848 596436918 599456787
3640.7 599456787 602098763 604170382 606438279 610319972 614789069 617587566 619902790 623113334
3657 623113334 626162827 628478348 630509377 632192373 633607626 635632813 637917161 639523387 641854763
3675.4 641854763 644564390 646358430 647862315 649077058 649954557 651326776 653477371 655226469
3691.7F55226469J069009Q40247O70910P12454J152277J057089L95596J46985O04093
3710F61875129J355529J122355M63009K66910K96592L88682N66006O07073J12295l38077
3730.4F66715503k9087R00745J477301O53148o18518n32805Q06152N78523m1187J001060
3750.8F70910835J305878L49582N1200M96030N74529J09315L8743J82152M53472O41525
3771.2F75113261K33590j22845O7592N09381L89993O4373J59145K37524K19465J5616
3791.6F76887095l02374k01106j95921j24037N93900L70503J74284O57022J06156o75619
3812F77289903m87208K57373O8664J91450Q27909J69575j96099j72138k38300j29461
3832.4F77581668j59621L1590M48465L95298L36230L27528k34246j065314j222194
$$ plain form
3691.7 655226469 656295478 657135725 657806635 658519089 659671366 660728455 661124051 661271036 661875129
3710 661875129 663230658 664353013 664816022 665082932 665379524 665768206 666334212 666941285 667053580 666715503
3730.4 666715503 666686416 667587161 669064462 669717610 669099092 668566287 669372439 669950962 669909775 670910835
3750.8 670910835 672216713 672566295 672617495 673113525 673688054 673797369 673836112 674018264 674471736 675113261
3771.2 675113261 675346851 675224006 675291598 675800979 676190972 676255345 676414490 676652014 676871479 676887095
3791.6 676887095 676584721 676383615 676187694 676063657 676657557 677028060 677202344 677859366 677965522 677289903
3812 677289903 676802695 677060068 677128732 677320182 678148091 678317666 678121567 677949429 677711129 677581668
3832.4 677581668 677422047 677453637 677902102 678297400 678633630 678961158 678726912 677661598 676439404
3850.8F76439404M58897J851320M03464n36859n24819j18256O7890l88503o4433O16729
3871.2F78204834M03762M8757m35114l43680O1214j8120L28243J01387m17769J58429
3891.6F78091943K48075n36859o80447k33829J93000N65767N04434O56k30014k77460
3912F77645266l76999j99199J05560N1856j59562j10388m4942k59518k40088J61529
3932.3F76573515K19226j05858l04759k68101n6803n4479j93656n8472M7147m5835
3952.7F75751925q1182n4717p2181p1347o6161j18971j52886j27971j12593j12832
3973.1F74781084o5446p6353j29044o6400j2219r8765j29521n8830o7770q0109q7857
3995.6F73908770j37031
$$ plain form
3850.8 676439404 676898301 678749621 679153085 678616226 678091407 677973151 678041041 677652538 677588105 678204834
3871.2 678204834 678608596 678657353 678222239 677878559 677939773 677921653 678249896 678351283 677933514 678091943
3891.6 678091943 678340018 677803159 677122712 676888883 677081883 677647650 678152084 678152740 677922726 677645266
3912 677645266 677268267 677069068 677174628 677226484 677066922 676956534 676911592 676652074 676411986 676573515
3932.3 676573515 676792741 676686883 676382124 676114023 676057220 676002741 675809085 675750613 675797760 675751925
3952.7 675751925 675670743 675616026 675543845 675472498 675406337 675287366 675134480 675006509 674893916 674781084
3973.1 674781084 674715638 674639285 674510241 674443841 674431622 674332857 674203336 674144506 674076736 673996627 673908770
3995.6 673908770 673771739
3997.6F73771739
$$ plain form
3997.6 673771739
##END=$$ End of the data block
