##TITLE=$$ Begin of the data block
##JCAMP-DX=5.00 $$ ACD/SpecManager v 10.08
##SPECTROMETER/DATA SYSTEM=Alpha
##DATE=11 Nov 2014 09:02:30
##DATA TYPE=INFRARED SPECTRUM
##DATA CLASS=XYDATA
##ORIGIN=
##OWNER=
##NPOINTS=1765
##FIRSTX=399.76428223
##LASTX=3997.64306641
##MAXX=3997.64306641
##MINX=399.76428223
##MAXY=0.79771519
##MINY=0.47172198
##XFACTOR=1.0000000000
##YFACTOR=1.000000000000000e-9
##FIRSTY=0.68783623
##DELTAX=2.03961372
##XUNITS=1/CM
##YUNITS=ARBITRARY UNITS
##XYDATA=(X++(Y..Y))
399.8F87836230j06752r36985o50048M6432k37048q82864o54519p5161n17905j465738
420.2F82355642p19070j55747j351237k041221k58029J327873j2696j310647M6790
438.5F77881658Q41498q43763j471102N45621J110196r28342j521051L87489O95825
456.9F76698029j803994k263367K94387J080513j206696j854956N95152J085460j568615
475.2F71055913j776814Q51631J050472j645327j935661Q78573J245260j540899j822174
493.6F66360974J080156J323521j564682k029359N37813O86407k145529k507329M60803
511.9F62202775J060665j880169k669751J46567R01997j573920k197683L56853R51291
530.3F57298625j548648k002120Q23736J737892m46200o95169K056241K698779j55985
$$ y = [687836230, 687729478, 686792493, 686142445, 686188877, 685951829, 685068965, 684414446, 684339285, 683821380, 682355642, 681636572, 681480825, 680129588, 678088367, 677830338, 679158211, 679145515, 677834868, 677881658, 678723156, 677879393, 676408291, 676953912, 678064108, 677135766, 675614715, 676002204, 676698029, 674894035, 672630668, 672925055, 674005568, 672798872, 670943916, 671539068, 672624528, 671055913, 669279099, 670130730, 671181202, 669535875, 667600214, 668478787, 669724047, 668183148, 666360974, 667441130, 668764651, 667199969, 665170610, 665708423, 666394830, 664249301, 661741972, 662202775, 663263440, 661383271, 658713520, 658860087, 659762084, 658188164, 655990481, 656347334, 657298625, 655749977, 653747857, 654571593, 656309485, 655863285, 655168116, 657224357, 659923136, 659767151]
548.7F59767151j349747P64608J276672j214206j753986R71138J929760n25295j497150
567F58368945P38442J406968j022876j715183Q55327J688242p52092j614511P35879
585.4F58689141J671315n46575j462102P41959J672029n42104j569033M95196J331508
603.7F60481334q83818j855373K78413J341403n91159j646698L94523J906574N13375
622.1F59938574m00067J296282K303720M79817q44955O97970J903832L56555p48217
640.4F64983511R39965K309799Q89361k93851J253128K425611Q00789p43389L54588
658.8F72919512J536786J97828j250446N9724K570570J170635k44796J010775K488196
677.2F80458784J473069p3790P64012K047062R89139n50449J55449J447082O92427
$$ y = [659767151, 658417404, 659182012, 660458684, 659244478, 657490492, 658461630, 660391390, 659866095, 658368945, 659107387, 660514355, 659491479, 657776296, 658631623, 660319865, 659567773, 657953262, 658689141, 660360456, 659813881, 658351779, 659093738, 660765767, 660223663, 658654630, 659149826, 660481334, 659597516, 657742143, 658020556, 659361959, 658770800, 657124102, 657518625, 659425199, 659938574, 659538507, 660834789, 663138509, 663618326, 662773371, 663471341, 665375173, 665731728, 664983511, 665923476, 668233275, 669122636, 668828785, 670081913, 672507524, 673308313, 672564924, 672919512, 674456298, 674654126, 673403680, 673463404, 676033974, 677204609, 676959813, 677970588, 680458784, 681931853, 681858063, 682622075, 684669137, 685658276, 685107827, 685263276, 686710358, 687402785]
695.5F87402785o89984j7881J523376J239061Q7440O28352J958847J551390K85327
713.9F93968713O51658J968086J909554Q73088J102686K289653K173186R51051P66874
732.2G06654549J568794J417041L18765J94371J085580J121461J61528l2722P12811
750.6G13202178P70867o1690k67387L94940N97835J20521J12474Q41200J179516P50780
771G17641234N83411J069784J306295J037300J059234J497507J625955J269281J185119
789.3G28275120J504123J436592R66727Q36075J028776Q34226L17455K42948M78030
807.7G35920072L68535J97172M69506P17461K97189l90172p48336r11415j010895n49793
828.1G34359324P52687J849592J839817J662135K253055K770901K160430R87351M64499
$$ y = [687402785, 686712801, 686694920, 688218296, 689457357, 689544797, 690173149, 692131996, 693683386, 693968713, 694620371, 696588457, 698498011, 699371099, 700473785, 702763438, 704936624, 705887675, 706654549, 708223343, 709640384, 709959149, 710153520, 711239100, 712360561, 712522089, 712489367, 713202178, 713973045, 713911355, 713643968, 714038908, 714636743, 714757264, 714869738, 715710938, 716890454, 717641234, 718224645, 719294429, 720600724, 721638024, 722697258, 724194765, 725820720, 727090001, 728275120, 729779243, 731215835, 732182562, 733018637, 734047413, 734881639, 735199094, 735442042, 735920072, 736288607, 736485779, 736955285, 737672746, 737969935, 737579763, 736831427, 735920012, 734909117, 734359324, 735112011, 736961603, 738801420, 740463555, 742716610, 745487511, 747647941, 748635292, 749099791]
846.4G49099791L89278j65880p04765j07288R79662J039207M02748M19855Q41320M43578
866.8G52637506n03958p33137l93152o33299j410246j638770j290679j478196k200663
885.2G42355406k226948j442612j063347j271665r11891J85490P29322K55167n2213
903.5G36556709K77757J62542o97195j149714p53284n31614r54389j114011n72860
921.9G31223941j81317n30839r54152q57234r04321j684010k522767k735197k850533
940.3G18003571l465354m021585l846229l311038l046929k771020k031982j316726
956.6F94192708j223386j380563j254081j178980j600921k198279k503872k737045
972.9F80115581l326774m014373m308581m387200m571021m547834l996372l318906
$$ y = [749099791, 749489069, 749323189, 748618424, 748511136, 749490798, 750530005, 750932753, 751352608, 752193928, 752637506, 752133548, 751400411, 751007259, 750373960, 748963714, 747324944, 746034265, 744556069, 742355406, 740128458, 738685846, 737622499, 736350834, 735438943, 735624433, 736353755, 736608922, 736556709, 736834466, 736997008, 736299813, 735150099, 734396815, 733865201, 732910812, 731796801, 731223941, 731042624, 730511785, 729557633, 728700399, 727796078, 726112068, 723589301, 720854104, 718003571, 714538217, 710516632, 706670403, 703359365, 700312436, 697541416, 695509434, 694192708, 692969322, 691588759, 690334678, 689155698, 687554777, 685356498, 682852626, 680115581, 676788807, 672774434, 668465853, 664078653, 659507632, 654959798, 650963426, 647644520]
989.2F47644520l008545k888977k679348k638877k999365l341496l239453k963185
1005.5F23885274k903104k823591k401412j955390j814961j667202j121938m84466
1021.8F08713210k71500k46822J05977N65469N77390L90589O24121R78946P13051J1265
1042.2F12161696k84314j20223j73628m66824l77357N8174J39118j65582j26004L22282
1062.6F10967338L37780k48135n66840l16262j16110j08599L33905J348197K067089
1081F13698363J904607J483083J399994J180887L67284l99172m22955j96517m05907
1099.4F18609667n86569l2604P92324J055718J023173J519680K313614K450585K013565
1117.7F29159153J957774K317309K195060J587093J496732K043546K095878J257896
$$ y = [647644520, 644635975, 641746998, 639067650, 636428773, 633429408, 630087912, 626848459, 623885274, 620982170, 618158579, 615757167, 613801777, 611986816, 610319614, 609197676, 608713210, 608441710, 608194888, 608300865, 608866334, 609443724, 609834313, 610458434, 611437380, 612150431, 612161696, 611877382, 611757159, 611583531, 611116707, 610739350, 610797524, 610936642, 610771060, 610645056, 610967338, 611305118, 611056983, 610490143, 610173881, 610057771, 609949172, 610283077, 611631274, 613698363, 615602970, 617086053, 618486047, 619666934, 620034218, 619635046, 619212091, 619015574, 618609667, 618023098, 617990494, 618782818, 619838536, 620861709, 622381389, 624695003, 627145588, 629159153, 631116927, 633434236, 635629296, 637216389, 638713121, 640756667, 642852545, 644110441]
1134F44110441N41151M72724K75970m16458o83784k4915O59048O80149P09057J406312
1154.4F47729695K120793K158224K182067K992868M091621M573702M683376N240321
1170.7F75772667N925596N787313N069792M811525M897356M325509L206194K560437
1187.1G12356389K350926J622081L18229n44608o03258o87719j147926j214623n61118
1205.4G11888373q7202l45647o80268o11305p18355j400054j956641j830638j570165
1223.8G02688098j812100k123893j855254j336873j209020j269043r07123l24189j74761
1242.1F91675842l09408o6042M23193M83751J50860J03354M41849N65827L27468K87950
1262.5F94084644O34432P89941N33998L71992N39482N53667J12713l56913l68655j81257
$$ y = [644110441, 644651592, 645124316, 645400286, 644983828, 644300044, 644275129, 644934177, 645614326, 646323383, 647729695, 649850488, 652008712, 654190779, 657183647, 661275268, 665848970, 670532346, 675772667, 681698263, 687485576, 692555368, 697366893, 702264249, 706589758, 709795952, 712356389, 714707315, 716329396, 716647625, 716103017, 715499759, 714812040, 713664114, 712449491, 711888373, 711801171, 711455524, 710775256, 710163951, 709445596, 708045542, 706088901, 704258263, 702688098, 700875998, 698752105, 696896851, 695559978, 694350958, 693081915, 692174792, 691850603, 691675842, 691366434, 691300392, 691723585, 692207336, 692358196, 692461550, 692903399, 693469226, 693796694, 694084644, 694719076, 695509017, 696043015, 696415007, 696954489, 697508156, 697620869, 697263956, 696895301, 696714044]
1282.9F96714044l07501n26368m57049m11212p55072j178264j317680j372397j685441
1301.3F88703060k030730k044439j952351k058029k186656k033829j708568j496911
1317.6F73191547j380443j147986q93533q79466j063764j142443j017272q95262q31187
1336F63940191o88910m54545l47078l77297l72172l26395l76105m58360l97146k79486
1356.4F59862697l01003m92037p27534r55999j134038j378178j616419j900971k547323
1374.7F48809195l584207o528317j2981534j5534759m348576J1969745J4925838P368683
1391F40096068K590835Q54493j3113l68238m47273l15189n9069N8234J28686K38479
1411.4F42763913L37898M98951Q76069J221418J048923J080871J246809J232028J269043
$$ y = [696714044, 696406543, 695880175, 695423126, 695011914, 694256842, 693078578, 691760898, 690388501, 688703060, 686672330, 684627891, 682675540, 680617511, 678430855, 676397026, 674688458, 673191547, 671811104, 670663118, 669769585, 668890119, 667826355, 666683912, 665666640, 664771378, 663940191, 663251281, 662796736, 662449658, 662072361, 661700189, 661373794, 660997689, 660539329, 660142183, 659862697, 659561694, 659069657, 658342123, 657386124, 656252086, 654873908, 653257489, 651356518, 648809195, 645224988, 638696671, 625715137, 610180378, 605831802, 617801547, 632727385, 640096068, 642686903, 643541396, 643528283, 643160045, 642712772, 642397583, 642338514, 642396748, 642525434, 642763913, 643101811, 643600762, 644476831, 645698249, 646747172, 647828043, 649074852, 650306880, 651575923]
1429.8F51575923J156747R96888J220286J196921P59899P65860Q56400R03964J010239
1448.1F60443127R49621Q04484R63450J880526K403379J438796J323879K066970K374172
1466.5F74648404K312362L109515M610658M624188L560602K947569K572537K162099
1482.8G00547934J640200J296222Q39234j09434q23796r80795j338660k028048k252400
1501.2F96790457j914323j685321k459049k872348k412736k154231j890660j434564
1517.5F79967225p57218m07398q29219j075924j004636r46164r10163j018822r52781
1535.8F72064900m29093p7129o45041p49052l71516j15037J21952N05089R20475J073003
1556.2F72298551J421272R11832j92106l05533l88503n08904p17819j204431j643598
$$ y = [651575923, 652732670, 653729558, 654949844, 656146765, 656906664, 657672524, 658528924, 659432888, 660443127, 661392748, 662197232, 663160682, 665041208, 667444587, 668883383, 670207262, 672274232, 674648404, 676960766, 680070281, 684680939, 689305127, 692865729, 695813298, 698385835, 700547934, 702188134, 703484356, 704323590, 704214156, 703390360, 702409565, 701070905, 699042857, 696790457, 694876134, 693190813, 690731764, 687859416, 685446680, 683292449, 681401789, 679967225, 679210007, 678802609, 677973390, 676897466, 675892830, 674946666, 674036503, 673017681, 672064900, 671635807, 671558678, 670913637, 670164585, 669793069, 669678032, 669799984, 670305073, 671225548, 672298551, 673719823, 674631655, 674439549, 674134016, 673745513, 673236609, 672518790, 671314359, 669670761]
1574.6F69670761k321363k645254k658308l047227l353179l354549l422022l764451
1590.9F45104408l893077l630281l361702l339290l307283l017008k726555k808929
1607.2F19020283l106057l048718k693475k719760l263354k931714k372384k558172
1623.5E96326649k753317k568185k271057j769244j159788p49051o48916n15461k23219
1641.9E83668411K20120J014888J192868N76854J248240K269745J178980R23156J684368
1660.3E93977630K636135K859533K428650K981604L738939L271520L492058L917694
1676.6F19303763L444672L317117M240871N765140M713714L793239M146994M035949
1692.9F52761459M870892N548417N153001N502820M247904L538608L498972K691269
$$ y = [669670761, 667349398, 664704144, 662045836, 658998609, 655645430, 652290881, 648868859, 645104408, 641211331, 637581050, 634219348, 630880058, 627572775, 624555767, 621829212, 619020283, 615914226, 612865508, 610172033, 607452273, 604188919, 601257205, 598884821, 596326649, 593573332, 591005147, 588734090, 586964846, 585805058, 585056007, 584407091, 583891630, 583668411, 583888531, 584903419, 586096287, 586673141, 587921381, 590191126, 591370106, 592293262, 593977630, 596613765, 599473298, 601901948, 604883552, 608622491, 611894011, 615386069, 619303763, 622748435, 626065552, 630306423, 636071563, 640785277, 644578516, 648725510, 652761459, 657632351, 663180768, 668333769, 673836589, 678084493, 681623101, 685122073, 687813342]
1709.2F87813342K232134K013445J803517J684070J044094M08113K74182L60250N99981
1727.6F98233128Q17477Q22664J136601J222133J049996J406431J720488K064943K552748
1745.9G11026609K791703L064513L322482L183842L213227L209352L289044L812432
1762.2G36913204L316701K578914K707958L094614L123164K153873J474500J793623
1778.6G57156551J936972J414061J192093J451730J451195J233458J158178J160025
1794.9G68154263J155019R47178P22766Q95798J083970Q62181N92113P92324R97067
1813.2G76202679P17938L93927N85675R71079R10997M82381M55260R43720Q25107K27452
1833.6G82716215K57969P13467P22051L89278M31478O92427N89311K68340J54078M31597
$$ y = [687813342, 690045476, 692058921, 693862438, 695546508, 696590602, 696998715, 697272897, 697633147, 698233128, 699050605, 699873269, 701009870, 702232003, 703281999, 704688430, 706408918, 708473861, 711026609, 713818312, 716882825, 720205307, 723389149, 726602376, 729811728, 733100772, 736913204, 740229905, 742808819, 745516777, 748611391, 751734555, 753888428, 755362928, 757156551, 759093523, 760507584, 761699677, 763151407, 764602602, 765836060, 766994238, 768154263, 769309282, 770256460, 770979226, 771875024, 772958994, 773821175, 774413288, 775205612, 776202679, 776920617, 777314544, 777900219, 778871298, 779782295, 780264676, 780719936, 781663656, 782488763, 782716215, 782974184, 783687651, 784409702, 784798980, 785230458, 785922885, 786512196, 786780536, 786934614, 787366211]
1854G87366211O23405L76404J84655L76761N47230M07040K64883L52085M03225K50221
1874.4G91152120Q7738K08556M21405L73781J70648J67489L66330L46542J44660J48475
1894.8G93587744K60055K59519J90198J45972J79410K35617K26498J50502Q6426J14441
1915.2G95436382K06173K07066J42277J20997P1108O2824Q5473N1498O2108J18435
1935.6G96564341P3015k9564K8730J46866P7903q7380p9096Q5414R7811o5983j10864
1958.1G96701193N4598J11699n1141j23441L5286J26719m8637k00391l5226J72019
1978.5G96742678J0192k34604j08778J34527L5525j93060j17123Q8513J8597k21133
1998.8G96155334j90676O3479M2379k37286k40803L1173L6479k49804l02195o1512
$$ y = [787366211, 787989616, 788366020, 788550675, 788927436, 789474666, 789881706, 790146589, 790498674, 790901899, 791152120, 791239858, 791448414, 791869819, 792243600, 792414248, 792581737, 792948067, 793294609, 793439269, 793587744, 793847799, 794107318, 794297516, 794443488, 794622898, 794858515, 795085013, 795235515, 795321941, 795436382, 795642555, 795849621, 795991898, 796112895, 796184003, 796246827, 796332300, 796383798, 796445906, 796564341, 796637356, 796607792, 796636522, 796783388, 796861291, 796773911, 796694815, 796780229, 796878040, 796812057, 796701193, 796755791, 796867490, 796816349, 796692908, 796728194, 796854913, 796806276, 796605885, 796570659, 796742678, 796752870, 796518266, 796409488, 796544015, 796579540, 796386480, 796269357, 796357870, 796376467, 796155334, 795964658, 796028137, 796070516, 795833230, 795592427, 795623600, 795660079, 795410275, 795108080, 795046568]
2019.2G95046568J967k09212l10362r7871L3439j76430l31521j44363M4048q0228k38001
2041.7G93538034j11461O3718n8353k34604j03772J13905L9637j69516j29342N9903
2062.1G93008149M3213j39713j41204L7372P8559o4909j00851M2140P9513n9903j10566
2084.5G92671800M947L1531p7248q7500K6644N8710j8119l1651L1710M5598K3961M2438
2109G92722821N8115J3113m4406J20Q3029M0710m0353K3127J36495P2658p6831k8491
2133.5G92960107J45078J18315l3498J8657J90973J53542m1843n9068J25289J68621
2153.9G93746173j430k8074J60933K06828J8060l9339J64807K64227Q3149j1683J82390
2176.3G94746041K91109R5606n7459J15216K94030J34230n7817Q9109L12030J77622
$$ y = [795046568, 795048535, 794839323, 794528961, 794431090, 794464529, 794288099, 793956578, 793812215, 793856263, 793776035, 793538034, 793426573, 793490291, 793431938, 793197334, 793093562, 793207467, 793247104, 793077588, 792948246, 793008149, 793051362, 792911649, 792770445, 792807817, 792886376, 792821467, 792720616, 792762756, 792842269, 792782366, 792671800, 792676747, 792708278, 792631030, 792543530, 792570174, 792628884, 792610765, 792579114, 792610824, 792656422, 792680383, 792722821, 792780936, 792794049, 792749643, 792749763, 792832792, 792873502, 792833149, 792856276, 792992771, 793065429, 792988598, 792960107, 793105185, 793223500, 793190002, 793208659, 793399632, 793553174, 793511331, 793452263, 793577552, 793746173, 793744743, 793716669, 793877602, 794084430, 794102490, 794063151, 794227958, 794492185, 794575334, 794563651, 794746041, 795037150, 795132756, 795075297, 795190513, 795484543, 795618773, 795560956, 795650065, 795962095, 796139717]
2196.7G96139717q9407r060K45631J94311o4552n8770K02835K42233j0669r1672R7036
2219.1G96797633J78278K0027n7221J24276K05636j6570j49488N0723J95861K861j43468
2241.6G97208548M8697K19523R0182p9810l3319R2506K5451j07944J729J52647M1604
2264G97659814j11699l9696J17242Q9526q9407j35064J2577O0677q7380j33157k6524
2286.4G97316909j2517j24395j82807j09554n8770j24574j96516j82331j43289j99676
2306.8G95982480k99036k76149j85251k02060k92063l38554l34263k98202k42054k62678
2327.2G93252170l33428k94864k72632l70503l79562k24709m1187J27792J94728j25110
2347.6G91532695n98848p99298p02619n97060n50270l54052j07169J3530J33455J90675
$$ y = [796139717, 796050310, 796041250, 796286881, 796481192, 796416640, 796357870, 796560705, 796802938, 796792269, 796700597, 796797633, 796975911, 796995938, 796938717, 797062993, 797268629, 797252059, 797102571, 797153294, 797349155, 797352016, 797208548, 797257245, 797476768, 797566950, 797487140, 797453821, 797546327, 797571778, 797463834, 797465563, 797618210, 797659814, 797548115, 797508419, 797625661, 797715187, 797625780, 797490716, 797503293, 797563970, 797476590, 797343433, 797316909, 797304392, 797179997, 796997190, 796887636, 796828866, 796704292, 796507776, 796325445, 796182156, 795982480, 795683444, 795407295, 795222044, 795019984, 794727921, 794389367, 794055104, 793756902, 793514848, 793252170, 792918742, 792623878, 792351246, 791980743, 791601181, 791376472, 791335285, 791463077, 791657805, 791532695, 790933847, 790134549, 789431930, 788834870, 788284600, 787930548, 787823379, 787836909, 787970364, 788161039]
2368G88161039Q7381K9027J12355K00391J48475Q225m3392k4378j11401k64585k82109
2390.4G88021028j82509j71602k66433k74241j96636k31325l35157l46959k77996k33054
2410.8G85505116l03030l75330l13223k87533m40538o04331n48601k91705j09196j08183
2431.2G82123446j44422j78635k38895k89619k80023k39670k59578l25203l24309k66433
2451.6G79576659k75194l26217l35574l19063l28303l43084l28481l33429l81171m10557
2472G76195586l79026l58582m00722m14908l66509l55720m02630m17888l74436l38376
2492.4G72386789l64601m06385m02808l58164l39031l72112l60787l13461l51965m13061
2512.8G68704414l67343k96056l37601m13656l74377k86937l06606m03106m09723l22818
$$ y = [788161039, 788248420, 788277447, 788389802, 788590193, 788738668, 788746893, 788703501, 788679123, 788567722, 788303137, 788021028, 787838519, 787666917, 787400484, 787126243, 786929607, 786698282, 786363125, 786016166, 785738170, 785505116, 785202086, 784826756, 784513533, 784226000, 783785462, 783181131, 782632530, 782340825, 782231629, 782123446, 781979024, 781800389, 781561494, 781271875, 780991852, 780752182, 780492604, 780167401, 779843092, 779576659, 779301465, 778975248, 778639674, 778320611, 777992308, 777649224, 777320743, 776987314, 776606143, 776195586, 775816560, 775457978, 775057256, 774642348, 774275839, 773920119, 773517489, 773099601, 772725165, 772386789, 772022188, 771615803, 771212995, 770854831, 770515800, 770143688, 769782901, 769469440, 769117475, 768704414, 768337071, 768041015, 767703414, 767289758, 766915381, 766628444, 766321838, 765918732, 765509009, 765186191]
2533.2G65186191l25680m00603l74258k83122l00586m23908m45366l33786l09765m16220
2553.6G61572897m44173l39806l06726m14848m50492l14117k29120l62217n10872m41670
2574G57758856l12209l52741m48644l94821l08216l97920n12421m27842l00587l69608
2594.4G53933847n13256m90605l60013l54051m86374n06043l47496l11136m92692n80787
2614.8G49491394m45605l38614m35054n30481m22061l23534m54306n85258m94779l79979
2635.2G45081723m18127n07653n10931m30643m02272m78029n11706m34697m13656n01513
2655.6G40472496n19157m22180m01616n00500n39124m59433m01258m60505n18501m66883
2676G35783339m08769m58717n32985m92335m22418m66525n54621n48959m64738m44829
$$ y = [765186191, 764860511, 764459908, 764085650, 763802528, 763501942, 763078034, 762632668, 762298882, 761989117, 761572897, 761128724, 760788918, 760482192, 760067344, 759616852, 759302735, 759073615, 758711398, 758200526, 757758856, 757446647, 757093906, 756645262, 756250441, 755942225, 755544305, 755031884, 754604042, 754303455, 753933847, 753420591, 752929986, 752569973, 752215922, 751729548, 751223505, 750876009, 750564873, 750072181, 749491394, 749045789, 748707175, 748272121, 747741640, 747319579, 746996045, 746541739, 745956481, 745461702, 745081723, 744663596, 744155943, 743645012, 743214369, 742812097, 742334068, 741822362, 741387665, 740974009, 740472496, 739953339, 739531159, 739129543, 738629043, 738089919, 737630486, 737229228, 736768723, 736250222, 735783339, 735374570, 734915853, 734382868, 733890533, 733468115, 733001590, 732446969, 731898010, 731433272, 730988443]
2696.4G30988443n14090n40793m85540m70042n48661n99086n39362m60923m66526n25593
2716.8G25837827n47409n24104n19335n38111n29706m96269m76420m86970m87208m50432
2737.2G20781863m24564m44889m51029l96192l78430m30405m56571m48346m36664m42326
2757.6G16472447m77493m74870l97384l42071l93689m64141m48525m30703n19038o08206
2778G11916327n85615n45681n64217n49376m73261m72367n78999o72639o62684o18697
2798.4G06192791o63995p28071p14660o90758p15852p80523q44061q46028q27611q56161
2818.8F98525071q78274q90792r62019j060366j086235j054585j102925j266300j474858
2837.1F88748717j735747k088666k536177l007710l231645k859354j930415r52959
$$ y = [730988443, 730474353, 729933560, 729448020, 728977978, 728429317, 727830231, 727290869, 726829946, 726363420, 725837827, 725290418, 724766314, 724246979, 723708868, 723179162, 722682893, 722206473, 721719503, 721232295, 720781863, 720357299, 719912410, 719461381, 719065189, 718686759, 718256354, 717799783, 717351437, 716914773, 716472447, 715994954, 715520084, 715122700, 714780629, 714386940, 713922799, 713474274, 713043571, 712524533, 711916327, 711330712, 710785031, 710220814, 709671438, 709198177, 708725810, 708146811, 707474172, 706811488, 706192791, 705528796, 704800725, 704086065, 703395307, 702679455, 701898932, 701054871, 700208843, 699381232, 698525071, 697646797, 696756005, 695793986, 694733620, 693647385, 692592800, 691489875, 690223575, 688748717, 687012970, 684924304, 682388127, 679380417, 676148772, 673289418, 671359003, 670406044]
2853.4F70406044l17991k7001m471k30968n64694q35717j018941j071095r51112p69973
2873.8F64614081o48856n57661m62472m40538n27501o70255q03172q78453r25720r99928
2894.2F57699525j072704j140297j196563j217783j246452j319110j495719j800359
2910.5F47210538k205669k598346k662718k238095j575351r86039n31554r5726L00289
2928.9F34617329N09560O21319Q12828J086652J329244J401901J260757R86457O37174
2947.2F43263221K84254M6492j28448k26557q5116K62857O76632J019358J227141J367926
2967.6F47707760J527310J693845J700639J523972J399517J320183J098097Q27789
2984F58799112P16686P51734P60674N77748K45333O1333K98j76072l43204l85582l64840
$$ y = [670406044, 670088053, 670061052, 670056581, 669825613, 669260919, 668425202, 667406261, 666335166, 665384054, 664614081, 663965225, 663407564, 662945092, 662504554, 661977053, 661306798, 660503626, 659625173, 658699453, 657699525, 656626821, 655486524, 654289961, 653072178, 651825726, 650506616, 649010897, 647210538, 645004869, 642406523, 639743805, 637505710, 635930359, 634944320, 634412766, 634317040, 634617329, 635126889, 635748208, 636561036, 637647688, 638976932, 640378833, 641639590, 642626047, 643263221, 643547475, 643593967, 643465519, 643238962, 643153846, 643416703, 644093335, 645112693, 646339834, 647707760, 649235070, 650928915, 652629554, 654153526, 655553043, 656873226, 657971323, 658799112, 659515798, 660267532, 661028206, 661605954, 661851287, 661912620, 661912918, 661736846, 661393642, 661008060, 660643220]
3006.4F60643220l13699k98858l50356m30644n63204p10845p50899o84619o85752p93695
3026.8F55060649p67648o06120n68211p32780q82923p54714n78940o92010r04202r39250
3047.2F47633851q24273p74324q36551q33631q04901q32021q03888o88314n73218o23346
3067.6F40039384p99477q27908o58095m78089m72844o16967o87540o74724p48635p93934
3088F33281171p01606p08222q01385p50184o26147o38783q06152q64268p03573o16550
3108.4F26064301p57277q42929p45833o96242p89285r86099j127541j069069r47535
3126.7F18102491r05335r46403r97543r83715r30548r46879j054585j118362j116216
3145.1F09102905j092851r79424q99672j053155j273274j303554j214146j169742j161992
$$ y = [660643220, 660329521, 660030663, 659680307, 659249663, 658686459, 657975614, 657224715, 656540096, 655854344, 655060649, 654293001, 653686881, 653118670, 652385890, 651502967, 650748253, 650169313, 649477303, 648573101, 647633851, 646809578, 646035254, 645198703, 644365072, 643560171, 642728150, 641924262, 641235948, 640662730, 640039384, 639239907, 638411999, 637753904, 637275815, 636802971, 636186004, 635498464, 634823740, 634075105, 633281171, 632579565, 631871343, 631069958, 630319774, 629693627, 629054844, 628248692, 627384424, 626680851, 626064301, 625307024, 624464095, 623718262, 623022020, 622232735, 621246636, 620119095, 619050026, 618102491, 617197156, 616250753, 615253210, 614269495, 613338947, 612392068, 611337483, 610219121, 609102905, 608010054, 607030630, 606130958, 605077803, 603804529, 602500975, 601286829, 600117087, 598955095]
3163.4E98955095j154781j140952j110136j135111j204133j178801j098216j109659
3179.8E89823306j195848j233399j204014j158357j130163j152754j186431j194954
3196.1E80367386j187503j140237j072287j047075j067996j098573j088739j031279
3212.4E71633697r99093j011134j036048j053869j043201j031637j020014r72987r41515
3230.7E62524199r68456j040637j110196j112402j080096j033067r48251r34958j045764
3249.1E53250372j121163j069486j025796j074493j085520j027822j004696r93133
3265.4E44848263r29057q66175r18388j037062j074910j025498r49561r12607r21249
3283.8E36213756q92282q03530p09474p07388q11517q98958r19640q68022p46787o57081
$$ y = [598955095, 597800314, 596659362, 595549226, 594414115, 593209982, 592031181, 590932965, 589823306, 588627458, 587394059, 586190045, 585031688, 583901525, 582748771, 581562340, 580367386, 579179883, 578039646, 576967359, 575920284, 574852288, 573753715, 572664976, 571633697, 570634604, 569623470, 568587422, 567533553, 566490352, 565458715, 564438701, 563465714, 562524199, 561555743, 560515106, 559404910, 558292508, 557212412, 556179345, 555231094, 554296136, 553250372, 552129209, 551059723, 550033927, 548959434, 547873914, 546846092, 545841396, 544848263, 543919206, 543053031, 542134643, 541097581, 540022671, 538997173, 538047612, 537135005, 536213756, 535321474, 534517944, 533808470, 533101082, 532289565, 531390607, 530470967, 529602945, 528856158, 528199077]
3304.2E28199077p24733r35495j105011j100063j021862j027763j060128j054108j064956
3322.5E19104958j094461j168966j254320j253844j203656j135588j072764j132727
3338.8E09788632j256287j283884j262903j201212j123548j215219j380206j366734
3355.2D99698639j225531j125723j098007j075268r99153r68694j118869j342028j357705
3373.5D89387661j163482j022578r71585r80586j010537r09776o96450n69970o94215
3391.9D81368482r05007q56221o16699n33134p30574r39459q19474n91397n39601n56499
3412.3D74280417n91517n81651m32879l14355l09885k24948p2032q583k2590L8683
3432.7D71760660J65433R9987j16736j44064M9680K94537M08530L10659K69324M00215
$$ y = [528199077, 527474344, 526538849, 525433838, 524333775, 523311913, 522284150, 521224022, 520169914, 519104958, 518010497, 516841531, 515587211, 514333367, 513129711, 511994123, 510921359, 509788632, 508532345, 507248461, 505985558, 504784346, 503660798, 502445579, 501065373, 499698639, 498473108, 497347385, 496249378, 495174110, 494174957, 493206263, 492087394, 490745366, 489387661, 488224179, 487201601, 486230016, 485249430, 484238893, 483329117, 482632667, 482062697, 481368482, 480463475, 479607254, 478990555, 478457421, 477726847, 476787388, 475967914, 475376517, 474836916, 474280417, 473688900, 473107249, 472674370, 472360015, 472050130, 471825182, 471753150, 471744567, 471721977, 471760660, 471926093, 472026080, 471909344, 471765280, 471814960, 472109497, 472518027, 472828686, 473098010, 473498225]
3453.1D73498225N62400O61671O67572O12885O69628R22948J073450Q69066N48511
3471.4D80086356N17607P63506J051277J145184R43750P81596Q87274R74745R69261
3489.8D88120556J050383J143425J187861J163513J153916J231879J151770R67265
3506.1D97170568J050293J315445J471012J373530J182198J214862J433432J619757
3522.4E07831097J542031J361132J390040J450658J499772J693070J754165J561403
3538.7E20083368J596570J903474K019882J709640J451433J676381J940965J866341
3555E34248054J789093J942575J984954J807153K037525K660334K501607J956165J989007
3573.4E52916467K245784K357960K475023K467990K305686K508581K867580K588331
$$ y = [473498225, 474060625, 474722296, 475389868, 476002753, 476672381, 477595329, 478668779, 479537845, 480086356, 480603963, 481367469, 482418746, 483563930, 484507680, 485289276, 486176550, 487151295, 488120556, 489170939, 490314364, 491502225, 492665738, 493819654, 495051533, 496203303, 497170568, 498220861, 499536306, 501007318, 502380848, 503563046, 504777908, 506211340, 507831097, 509373128, 510734260, 512124300, 513574958, 515074730, 516767800, 518521965, 520083368, 521679938, 523583412, 525603294, 527312934, 528764367, 530440748, 532381713, 534248054, 536037147, 537979722, 539964676, 541771829, 543809354, 546469688, 548971295, 550927460, 552916467, 555162251, 557520211, 559995234, 562463224, 564768910, 567277491, 570145071, 572733402]
3589.7E72733402K248109K488434K793252K801776K779067K694964K466500K526879
3606E93532383K890647K946556K896964K847672K692937L120304L456294K712607K025962
3624.4F19122326K318323L608227L767907K656997K520263K699077K704799K661348
3640.7F42059267K412617K218127K757609L957689L563046J953960J953780K771974
3657F63648069K581417K030254J772284J588703J683116K234339K110005J569330K093137
3675.4F81310654K018094J196027J005172J022697J177549J771212J933694J002431
3691.7F92437530N18024O76512P55787P99179R34422P49469M69983N31554Q77321J034021
3712.1F99783802N60522J59562K05099M03464M57525M02630K74718O6995J37806N94616
$$ y = [572733402, 574981511, 577469945, 580263197, 583064973, 585844040, 588539004, 591005504, 593532383, 596423030, 599369586, 602266550, 605114222, 607807159, 610927463, 614383757, 617096364, 619122326, 621440649, 625048876, 628816783, 631473780, 633994043, 636693120, 639397919, 642059267, 644471884, 646690011, 649447620, 653405309, 656968355, 658922315, 660876095, 663648069, 666229486, 668259740, 670032024, 671620727, 673303843, 675538182, 677648187, 679217517, 681310654, 683328748, 684524775, 685529947, 686552644, 687730193, 689501405, 691435099, 692437530, 692955554, 693632066, 694387853, 695187032, 696121454, 696870923, 697340906, 697872460, 698749781, 699783802, 700344324, 700503886, 700708985, 701112449, 701569974, 701972604, 702247322, 702314317, 702452123, 703046739]
3732.5G03046739R85623Q14795J04368l74258K9981P30932M02570J93000O67333M60744
3752.9G07061827j3590R6917L64006K38836L5763Q1360J48535L44991L78192O4015
3773.3G08800852j0192K81453M31120J04905n1916J07288J04428K1279k9743K8312
3793.7G09787786K12014J21236J44600L83079Q1361J9550J42574j63912k80559M1067
3814.1G10488796L21865J47999K24828K60651j13487j33157p3671q7082k8968Q7976
3834.4G11095750L02732K92063O56r9600j33752l36349n25535k78234O35862P26640
3854.8G11680233k59995m52697j32501J60694O2942j52230O4969J74403j4901j55568
3875.2G10975349k72512o4850J14917R3103J11997k44737l09884P7903m6372l30866
$$ y = [703046739, 704032362, 704847157, 704951525, 704577267, 704607248, 705338180, 705740750, 705933750, 706601083, 707061827, 707048237, 707145154, 707509160, 707747996, 707783759, 707865119, 708013654, 708358645, 708736837, 708800852, 708790660, 709072113, 709503233, 709608138, 709556222, 709663510, 709767938, 709789217, 709759474, 709787786, 709999800, 710121036, 710265636, 710648715, 710730076, 710749626, 710892200, 710728288, 710447729, 710488796, 710810661, 710958660, 711183488, 711444139, 711330652, 711197495, 711123824, 711036742, 711007774, 711095750, 711398482, 711690545, 711691201, 711591601, 711457849, 711121500, 710595965, 710317731, 710953593, 711680233, 711420238, 710967541, 710835040, 710995734, 711058676, 710906446, 710971415, 711145818, 711130917, 710975349, 710702837, 710637987, 710752904, 710846007, 710958004, 710713267, 710403383, 710481286, 710434914, 710104048]
3895.6G10104048k17855n7697N6207K03729N1141k67804l40223k38419j13666j967
3916G09177494m172j11640j23560k2173p5281j86384l6835J18792l6061k31862k51532
3938.5G08216786j49369n3108r0181p8381R239n0247j35660j35362j42395j55568j41979
3960.9G07093775j05440m8340l0458q5830j17422p5280n2989p7426o4612P868L0875
3983.3G06474721j12891k39014j42098q702n7161j64926j28031
3997.6G05621898
$$ y = [710104048, 709886193, 709828496, 709884703, 710088432, 710139573, 709871769, 709531546, 709293127, 709179461, 709177494, 709173322, 709061682, 708938122, 708915949, 708840668, 708654284, 708617449, 708736241, 708700180, 708468318, 708216786, 708067417, 708014309, 707924128, 707845747, 707854986, 707804739, 707669079, 707533717, 707391322, 707235754, 707093775, 706988335, 706939995, 706909537, 706823707, 706706285, 706631005, 706578016, 706500590, 706435978, 706443846, 706474721, 706361830, 706122816, 705980718, 705972016, 705914855, 705749929, 705621898]
##END=$$ End of the data block
