##TITLE=$$ Begin of the data block
##JCAMP-DX=5.00 $$ ACD/SpecManager v 10.08
##SPECTROMETER/DATA SYSTEM=Alpha
##DATE=11 Nov 2014 09:02:30
##DATA TYPE=INFRARED SPECTRUM
##DATA CLASS=XYDATA
##ORIGIN=
##OWNER=
##NPOINTS=1765
##FIRSTX=399.76428223
##LASTX=3997.64306641
##MAXX=3997.64306641
##MINX=399.76428223
##MAXY=0.80051720
##MINY=0.46861252
##XFACTOR=1.0000000000
##YFACTOR=1.000000000000000e-9
##FIRSTY=0.68525398
##DELTAX=2.03961372
##XUNITS=1/CM
##YUNITS=ARBITRARY UNITS
##XYDATA=(X++(Y..Y))
399.8F85253978l13342p12216l26395J63555m98354j381219p56442K96473r0599j265585
420.2F80369854r12845m98891j587510j992405j17480J364946K03729j178325k02596
438.5F75448477N56886r39667j392305O68347J135469j091779j789867K92658R17554
456.9F73805773j442432j919866N01514R42409j455903j960278N08428J073360j513421
475.2F68539584j829386P77662J069426j526117j752019R98318J346648j404584j822114
493.6F64397418R95279J276255j752019k331019N04136R41456j862348k293944M82857
511.9F60358071Q92580k101839k953231k8014J006245j449048k140820N16534J049816
530.3F55150294j638889k026677R82761J835466m96984p52449J980901K530634l06189
$$ plain form
399.8 685253978 684940636 684228420 683902025 684065580 683567226 682186007 681429565 681726038 681635439 680369854
420.2 680369854 679457009 678958118 677370608 675378203 675260723 676625669 676829398 675651073 675448477
438.5 675448477 676005363 675065696 673673391 674341738 675477207 674385428 672595561 672888219 673805773
456.9 673805773 672363341 670443475 670944989 671887398 670431495 668471217 668979645 670053005 668539584
475.2 668539584 666710198 667487860 668557286 667031169 665279150 666277468 667624116 666219532 664397418
493.6 664397418 665392697 666668952 664916933 662585914 663090050 664031506 662169158 659875214 660358071
511.9 660358071 661250651 659148812 656195581 656167567 657173812 655724764 653583944 654100478 655150294
530.3 655150294 653511405 651484728 652467489 654302955 653805971 653053522 655034423 657565057 657258868
548.7F57258868j380086P80702J346648j137257j779258R39846J942873n68450j625955
567F55777931O99401J584947q22603j799107O25729J769424l77417j299739Q00610
585.4F56959176J585364o18338j561940N96166J612305m65273j439035N83291J348853
603.7F58600569r10640j888394L15487J440406n55873j689255L10778J792968M42385
622.1F57858431l31163J491904K464950N15223q68559O63757J890183M00960p19607
640.4F63366079R08912K323865J004100k35796J124919K286196Q23080n67615N40674
658.8F71574414J569867J68264j257777l9399K431571J171172j93536J124024K633453
677.2F79182053J533508o1750P48753K014220J015603m97281K07066J478792O03616
$$ plain form
548.7 657258868 655878782 656659484 658006132 656868875 655089617 656029463 657972336 657403886 655777931
567 655777931 656477332 658062279 657239676 655440569 656066298 657835722 657458305 656158566 656959176
585.4 656959176 658544540 657926202 656364262 656960428 658572733 658107460 656668425 657251716 658600569
603.7 658600569 657689929 655801535 656117022 657557428 657001555 655312300 655623078 657416046 657858431
622.1 657858431 657527268 659019172 661484122 661999345 661130786 661794543 663684726 664085686 663366079
640.4 663366079 664274991 666598856 667602956 667367160 668492079 670778275 671601355 671033740 671574414
658.8 671574414 673144281 673312545 672054768 672015369 674446940 675618112 675424576 676548600 679182053
677.2 679182053 680715561 680653811 681402564 683416784 684432387 683935106 684142172 685620964 686224580
695.5F86224580q46446q5830J591265J379549J45138N45919J890182J667380M92275
713.9F93004012P43091J950979J858891P95066J026451K302409K248108R65715P62104
732.2G05656826J601935J446366L41833K00033J060546J134097K31683J5438P23243
750.6G12412000P96258o5148l42369L51012O19471J27077Q6129Q15689J196862Q30829
771G16827810O67274J107335J326322J054883J054705J441657J535654J251221J238465
789.3G27505326J506627J389146R76979R25124J072467P70509K84374L52680O28472
807.7G35411704M12702J46330M33802P55966L32951m43518q04245q90196r73105m86076
828.1G33896315Q28564J854837J858831J733899K295494K757788K090573R15527M60565
$$ plain form
695.5 686224580 685378134 685292304 686883569 688263118 688408256 688954175 690844357 692511737 693004012
713.9 693004012 693747103 695698082 697556973 698352039 699378490 701680899 703929007 704894722 705656826
732.2 705656826 707258761 708705127 709046960 709246993 710307539 711441636 711673319 711688757 712412000
750.6 712412000 713208258 713143110 712800741 713151753 713771224 713898301 713984430 714800119 715996981 716827810
771 716827810 717495084 718602419 719928741 720983624 722038329 723479986 725015640 726266861 727505326
789.3 727505326 729011953 730401099 731378078 732303202 733375669 734146178 734430552 734783232 735411704
807.7 735411704 735824406 735970736 736404538 737160504 737493455 737049937 736245692 735355496 734382391 733896315
828.1 733896315 734724879 736579716 738438547 740172446 742467940 745225728 747316301 748231828 748692393
846.4G48692393M16577j63913p01487j08421R71973J073063M40955M07636P64251L35336
866.8G52128363n56171p12753l33666n66185j365364j621961j295507j468778k177477
885.2G42030501k220571j438021j058042j297653r50337J83344P52390K98917J9372
903.5G36319900L25799J42812p44164j198828p97868n29110r18687j068890n34713
921.9G30996251k09808o08325r90451q59618r28879j719772k536774k704740k811193
940.3G17626691l473044m021108l803253l290474l024102k709209j986862j311481
956.6F94007158j251459j422644j256287j132190j571834k207458k495408k720833
972.9F79949045l366887m100979m378795m380465m499316m491508l973305l318131
$$ plain form
846.4 748692393 749108970 748945057 748243570 748135149 749107122 750180185 750621140 751028776 751793027 752128363
866.8 752128363 751572192 750859439 750525773 749959588 748594224 746972263 745676756 744207978 742030501
885.2 742030501 739809930 738371909 737313867 736016214 735065877 735249221 736001611 736300528 736319900
903.5 736319900 736645699 736788511 736044347 734845519 734047651 733518541 732599854 731530964 730996251
921.9 730996251 730786443 730178118 729187667 728328049 727399170 725679398 723142624 720437884 717626691
940.3 717626691 714153647 710132539 706329286 703038812 700014710 697305501 695318639 694007158
956.6 694007158 692755699 691333055 690076768 688944578 687372744 685165286 682669878 679949045
972.9 679949045 676582158 672481179 668102384 663721919 659222603 654731095 650757790 647439659
989.2F47439659l014923k855658k621532k596437k954722l300488l221989k953291
1005.5F23920619k929031k905429k448201j914203j760900j626372j092434m79937
1021.8F08764112k47478k32041M6372M80354N60641M36962O40154R35137O70135J7762
1042.2F12072110k72155j54078j99198m43817l48627O5088J28567j67548j11878L14057
1062.6F10882521L24368k19345n21541k83718r7096j12176L54052J401365K065360
1081F13793790J855135J446128J377762J167595L64780l66091l63529j55270l82126
1099.4F18738174n79357l9994P87675J042962J025796J568496K365887K458394J996338
1117.7F29364371J956046K319336K178073J560330J484394K049506K102673J282036
$$ plain form
989.2 647439659 644424736 641569078 638947546 636351109 633396387 630095899 626873910 623920619
1005.5 623920619 620991588 618086159 615637958 613723755 611962855 610336483 609244049 608764112
1021.8 608764112 608516634 608284593 608330965 608811319 609371960 609808922 610449076 611384213 612054348 612072110
1042.2 612072110 611799955 611645877 611446679 611002862 610654235 610719323 610847890 610680342 610568464 610882521
1062.6 610882521 611206889 610987544 610466003 610182285 610085189 609973013 610327065 611728430 613793790
1081 613793790 615648925 617095053 618472815 619640410 620005190 619639099 619275570 619120300 618738174
1099.4 618738174 618158817 618118823 618906498 619949460 620975256 622543752 624909639 627368033 629364371
1117.7 629364371 631320417 633639753 635817826 637378156 638862550 640912056 643014729 644296765
1134F44296765N91994N03003K75731m00006o60479k2114O46472O56903P03871J415968
1154.4F48008108K121031K140999K138913K972841M127443M627049M719198N221605
1170.7F76077187N859375N737126N054593M803658M875779M319310L227949K561688
1187.1G12516665K324045J590431L22282m80175n60045p05004j137078j154720n29707
1205.4G12186694j04308l85642p29263o55591p35641j380324j942635j839638j562297
1223.8G02851355j790583k112389j828670j308143j229763j297057q81612k77400j44899
1242.1F91980839k97785r1910L79443M73678J57952J06394M60685N75185K99215K84791
1262.5F94328487O78599Q14438N13315L29614N11407N53430J09493l64482l64006j88172
$$ plain form
1134 644296765 644888759 645391762 645667493 645267487 644607008 644584894 645231366 645888269 646592140 648008108
1154.4 648008108 650129139 652270138 654409051 657381892 661509335 666136384 670855582 676077187
1170.7 676077187 681936562 687673688 692728281 697531939 702407718 706727028 709954977 712516665
1187.1 712516665 714840710 716431141 716753423 716273248 715713203 715008199 713871121 712716401 712186694
1205.4 712186694 712082386 711696744 710967481 710311890 709576249 708195925 706253290 704413652 702851355
1223.8 702851355 701060772 698948383 697119713 695811570 694581807 693284750 692403138 692125738 691980839
1242.1 691980839 691683054 691591144 691970587 692444265 692602217 692708611 693169296 693744481 694043696 694328487
1262.5 694328487 695007086 695821524 696334839 696664453 697175860 697729290 697838783 697474301 697110295 696922123
1282.9F96922123l22997n34535m87983m35412p27832j152098j343072j419544j708090
1301.3F88790560k040446k076924j991629k057076k169371k057612j738369j489818
1317.6F73169315j362503j132726q77202q75771j067460j139640j020015r04381q41319
1336F63948298p04349m51862l08633l41833l70979l22163l21985l88443l58760k71857
1356.4F60107434l26693n17011o90699q83221j087070j297831j469434j757204k374232
1374.7F49704039l282905n910217j1723221j4048516m013956J0663748J3366520O593585
1391F41349077K257645O60360r9659l96907m84705l79860r2149Q4758J41024K12372
1411.4F43251956L07023M71294Q40664J205921J074612J115024J257062J218021J268327
$$ plain form
1282.9 696922123 696599126 696064591 695576608 695141196 694413364 693261266 691918194 690498650 688790560
1301.3 688790560 686750114 684673190 682681561 680624485 678455114 676397502 674659133 673169315
1317.6 673169315 671806812 670674086 669796884 668921113 667853653 666714013 665693998 664789617 663948298
1336 663948298 663243949 662792087 662483454 662141621 661770642 661448479 661126494 660738051 660379291 660107434
1356.4 660107434 659780741 659263730 658573031 657689810 656602740 655304909 653835475 652078271 649704039
1374.7 649704039 646421134 640510917 628787696 614739180 610725224 621388972 634755492 641349077
1391 641349077 643606722 644267082 644167423 643770516 643285811 642905951 642813802 642898560 643039584 643251956
1411.4 643251956 643558979 644030273 644870937 646076858 647151470 648266494 649523556 650741577 652009904
1429.8F52009904J157761R56655J147270J188457Q17597P93636Q54253Q96097J004219
1448.1F60825849R55820Q06927R27985J799882K411007J546979J375139K061486K401471
1466.5F75112545K335132L042996M500269M627109L654361L013491K575040K129019
1482.8G00989962J599133J241862Q09431n8531p71106j004159j385868k020597k248168
1501.2F97151959j987815j847088k542556k746522k289355k112925j917064j473904
1517.5F80234730p89284l97325p36475r92060r63390r30428r09448j015007r71973
1535.8F72529340n05030j40071n96881o74844k95699p3135J14501M89175Q72851R60827
1556.2F72681034J286149R65535l8564k44558m17828n78881p62581j209438j658023
$$ plain form
1429.8 652009904 653167665 654124320 655271590 656460047 657277644 658071280 658925533 659821630 660825849
1448.1 660825849 661781669 662588596 663516581 665316463 667727470 669274449 670649588 672711074 675112545
1466.5 675112545 677447677 680490673 684990942 689618051 693272412 696285903 698860943 700989962
1482.8 700989962 702589095 703830957 704640388 704581857 703810751 702806592 701420724 699400127 697151959
1501.2 697151959 695164144 693317056 690774500 688027978 685738623 683625698 681708634 680234730
1517.5 680234730 679445446 679048121 678311646 677319586 676356196 675425768 674516320 673501313 672529340
1535.8 672529340 672024310 671884239 671287358 670612514 670316815 670243680 670358181 670847356 671720207 672681034
1556.2 672681034 673967183 674932718 674894154 674649596 674231768 673652887 672890306 671680868 670022845
1574.6F70022845k321720k621055k685606l120303l399909l376424l469586l822029
1590.9F45206213l946900l706873l423989l361582l344477l103792k852559k939225
1607.2F18526816l214240l147840k812684k848744l352404k983391k428115k619802
1623.5E95119596k801359k608478k310753j811981j206100p16687n20706m20987j80602
1641.9E82541943K31206J058519J330912O64890J256704K434313J441658J085818J755535
1660.3E93801498K682746K932131K494037L036440L827750L351808L522992L949881
1676.6F19599283L485977L331602M230559N822658M828513L854990M189193M059136
1692.9F53401911M817248N478084N192756N603910M302263L572464L547192K755224
$$ plain form
1574.6 670022845 667701125 665080070 662394464 659274161 655874252 652497828 649028242 645206213
1590.9 645206213 641259313 637552440 634128451 630766869 627422392 624318600 621466041 618526816
1607.2 618526816 615312576 612164736 609352052 606503308 603150904 600167513 597739398 595119596
1623.5 595119596 592318237 589709759 587399006 585587025 584380925 583664238 583143532 582722545 582541943
1641.9 582541943 582773149 583831668 585162580 585827470 587084174 589518487 590960145 592045963 593801498
1660.3 593801498 596484244 599416375 601910412 604946852 608774602 612126410 615649402 619599283
1676.6 619599283 623085260 626416862 630647421 636470079 641298592 645153582 649342775 653401911
1692.9 653401911 658219159 663697243 668889999 674493909 678796172 682368636 685915828 688671052
1709.2F88671052K281487K001763J763224J705647J145959N12719L38435L78132N77033
1727.6F99375451P84933Q09372J170575J302898J096726J396894J691997K063632K578914
1745.9G12271392K809048L045738L304541L174603L205597L230036L323257L871083
1762.2G38235295L381193K578496K658785L069758L160715K213300J502573J811981
1778.6G58612096J981736J444280J177489J450301J472592J232803J155734J181483
1794.9G69708514J173079R44734P17103R26316J131773Q72493N49674P66337J048863
1813.2G77838886P90298M28378N77152R15945Q52585M94360M96984R44197Q16107K44319
1833.6G84399211K80679P35342P52092L88205L96192P07030O26266K65539J59502M69267
$$ plain form
1709.2 688671052 690952539 692954302 694717526 696423173 697569132 698081851 698420286 698798418 699375451
1727.6 699375451 700160384 700969756 702140331 703443229 704539955 705936849 707628846 709692478 712271392
1745.9 712271392 715080440 718126178 721430719 724605322 727810919 731040955 734364212 738235295
1762.2 738235295 741616488 744194984 746853769 749923527 753084242 755297542 756800115 758612096
1778.6 758612096 760593832 762038112 763215601 764665902 766138494 767371297 768527031 769708514
1794.9 769708514 770881593 771826327 772543430 773469746 774601519 775474012 776023686 776790023 777838886
1813.2 777838886 778629184 779057562 779634714 780550659 781403244 781897604 782394588 783338785 784154892 784399211
1833.6 784399211 784679890 785415232 786167324 786555529 786951721 787658751 788285017 788550556 788710058 789179325
1854G89179325O54936L70741J42097L54708N50925L78430K36929L83019M59910K95579
1874.4G93006599J02460J93298L91722L45051J84000K01523L66569L39567J37031J42455
1894.8G95410275K90096K85208J87338J60098J99556K29299K08378J37270R3996J33872
1915.2G97335386K13862K04444J29819J26123J09315R2328R0122M1961M3929J13130
1935.6G98500419Q0585m0352J5437J63496R9301q6128q9050P9513R3221q2671j22607
1958.1G98611164P2956J33872n3882j23144M4287J20580n7340j93953j6749J82569
1978.5G98720360J4007k23816j06751J26242K1637k08497r9063J27077K6583k32040
1998.8G98165739j94550N7280L6180k24531k27809J8657K5272k44617k85626l7491
$$ plain form
1854 789179325 789834261 790205002 790347099 790701807 791252732 791631162 791868091 792251110 792711020 793006599
1874.4 793006599 793109059 793302357 793694079 794039130 794223130 794424653 794791222 795130789 795267820 795410275
1894.8 795410275 795700371 795985579 796172917 796333015 796532571 796761870 796970248 797107518 797201514 797335386
1915.2 797335386 797549248 797753692 797883511 798009634 798118949 798211277 798301399 798343360 798387289 798500419
1935.6 798500419 798581004 798540652 798556089 798719585 798818886 798732758 798643708 798723221 798816442 798733771 798611164
1958.1 798611164 798684120 798817992 798764110 798640966 798685253 798805833 798748493 798554540 798537791 798720360
1978.5 798720360 798734367 798510551 798403800 798530042 798551679 798343182 798244119 798371196 798397779 798165739
1998.8 798165739 797971189 798028469 798064649 797840118 797612309 797630966 797656238 797411621 797125995 797088504
2019.2G97088504J2338k10226l03208r4414J6749j93835l27110j31368M4822r3758
2039.6G95808494k47955r8765Q5354l9101k14159r1315J15097L3498j89782j46687
2060G95014679P4149O0021j36792j19031O6281O5148r4474r6023N7399Q4639o6042
2082.5G94909954j14202K3186N5790o1095p1824M6432O6460j5200q523P4685P6413
2104.9G94982076K682M291O0142M1127k6167p689P7427P4327o676K3186J30773P8440
2129.4G95433939o2407j9192J38104J14083k0921K6464J86384J45018n4419m8041J61528
2151.8G96000540J91272J5437j728J79946K10762R894o1869J32918K60055J18971K3246
2174.3G97079444J96814L09051R7870r7572J00910L46124J93060m7922N9724K93016
$$ plain form
2019.2 797088504 797100842 796890616 796587408 796492994 796509743 796315908 795988798 795857430 795902252 795808494
2039.6 795808494 795560539 795461774 795547128 795508027 795293868 795202553 795317650 795351148 795161366 795014679
2060 795014679 795088828 795148849 795012057 794893026 794959307 795024455 794929981 794833958 794891357 794975996 794909954
2082.5 794909954 794795752 794818938 794874728 794813633 794741809 794788241 794854701 794839501 794830978 794905663 794982076
2104.9 794982076 794984758 794989049 795049191 795090318 795064151 795056462 795133889 795208216 795201540 795224726 795355499 795433939
2129.4 795433939 795371532 795352340 795490444 795604527 795583606 795610070 795796454 795941472 795887053 795839012 796000540
2151.8 796000540 796191812 796207249 796205521 796385467 796596229 796606123 796544254 796677172 796937227 797056198 797079444
2174.3 797079444 797276258 797585309 797683179 797585607 797686517 798032641 798225701 798177779 798237503 798530519
2194.6G98530519J93477n5433K4140K64526J82390q6546o0022K03729K22385j4127
2215G99405038k6285J84893J76430n5730q8573J47581K24591o020j40310N4121K12252
2237.5H00087988M2677j21176M2796K00272L4272j47223l3677J60635J01626o9022
2257.9H00299168n663J47760P5936p9274o0200O7651O3002p5817p9274N7459N0961
2280.3H00461709j10566j45793l6240j1205j14680j76012j02639m2260r2924j67310
2300.7G99462080j88529j76609j93775k23875k04742j62661j92582k91706l57091l58582
2321.1G97111928l15964k25484k17796k94148k71440k31326k79367k79784j99020j00314
2341.5G94697285N7518J30892j54138n49495p00295o00159n23329n13315l58283j45913
$$ plain form
2194.6 798530519 798723996 798668563 798692703 798957229 799139619 799053073 798993051 799196780 799419165 799405038
2215 799405038 799378753 799563646 799740076 799684346 799595773 799743354 799967945 799961925 799821615 799875736 800087988
2237.5 800087988 800130665 800009489 800052285 800252557 800286829 800139606 800105929 800266564 800368190 800299168
2257.9 800299168 800293505 800441265 800517201 800437927 800377727 800445378 800508380 800432563 800353289 800410748 800461709
2280.3 800461709 800351143 800205350 800169110 800157905 800043225 799867213 799764574 799722314 799629390 799462080
2300.7 799462080 799273551 799096942 798903167 798679292 798474550 798311889 798119307 797827601 797470510 797111928
2321.1 797111928 796795964 796570480 796352684 796058536 795787096 795555770 795276403 794996619 794797599 794697285
2341.5 794697285 794754803 794885695 794731557 794182062 793481767 792881608 792358279 791844964 791486681 791340768
2361.9G91340768k2351P9572J41144J07705J0252p15J47581J76311o855j13606p6473
2384.3G91783333j09792k44439k83777j98901j80721k74182l08513k30670k11537k82169
2404.7G89458632k98261k49148k58743l51668l72648k80797k67566m35292o13928n51224
2425.1G85779357k77162j08540j39475j75952j87636k46048l09110k86400k16067k26795
2445.5G83606172k99514l30925k95758k88308l29077l15785k78473l11434l56019l37660
2465.9G80463219l15011l52740m13656m10080l64185l77238m04119l65436l25501l57568
2486.3G76777685m19379m18901l62933l59535m00960l94226l58700l60847l81291l53276
2506.7G72967637l23713l67046l99947l44872k81036l04401l71873l68476l19899l50296
$$ plain form
2361.9 791340768 791318417 791397989 791539133 791646838 791657090 791656375 791803956 791980267 791973412 791859806 791783333
2384.3 791783333 791673541 791429102 791145325 790946424 790765703 790491521 790183008 789952338 789740801 789458632
2404.7 789458632 789160371 788911223 788652480 788300812 787928164 787647367 787379801 786944509 786330581 785779357
2425.1 785779357 785502195 785393655 785254180 785078228 784890592 784644544 784335434 784049034 783832967 783606172
2445.5 783606172 783306658 782975733 782679975 782391667 782062590 781746805 781468332 781156898 780800879 780463219
2465.9 780463219 780148208 779795468 779381812 778971732 778607547 778230309 777826190 777460754 777135253 776777685
2486.3 776777685 776358306 775939405 775576472 775216937 774815977 774421751 774063051 773702204 773320913 772967637
2506.7 772967637 772643924 772276878 771876931 771532059 771251023 770946622 770574749 770206273 769886374 769536078
2527.1G69536078m28677m00662k95818l18289m32074m00901k65717k66850m02212m46379
2547.5G65878499l48151l08395m02569m38631l33428k88308m05490m61877l27885k28167
2567.9G62335598l51846m96387m18604l04639l84390m91619m02689k55704l23892n04136
2588.3G58401692m86910l24786l27945m94897n24283l74555l26872m58002n08309l90291
2608.7G54184842l59297m83334n29945m19855l44455m40717n22017m26889l52442m67956
2629.1G49837935n77033m74810l37124l95119n26250m96149l85821m08411n18977n36382
2649.5G45181859m47095m12047m94003n36680m33445l54708m41789n24938m69983m25100
2669.9G40642071m87268n27263m49836l84271m64142n50031m93646m17113m66705n40971
$$ plain form
2527.1 769536078 769107401 768706739 768410921 768092632 767660558 767259657 766993940 766727090 766324878 765878499
2547.5 765878499 765530348 765221953 764819384 764380753 764047325 763759017 763353527 762891650 762563765 762335598
2567.9 762335598 761983752 761487365 761068761 760764122 760379732 759888113 759485424 759229720 758905828 758401692
2588.3 758401692 757914782 757589996 757262051 756767154 756242871 755868316 755541444 755083442 754575133 754184842
2608.7 754184842 753825545 753342211 752812266 752392411 752047956 751607239 751085222 750658333 750305891 749837935
2629.1 749837935 749260902 748786092 748448968 748053849 747527599 747031450 746645629 746237218 745718241 745181859
2649.5 745181859 744734764 744322717 743828714 743292034 742858589 742503881 742062092 741537154 741067171 740642071
2669.9 740642071 740154803 739627540 739177704 738793433 738329291 737779260 737285614 736868501 736401796 735860825
2690.3G35860825m91262m20630m68373n49972n49078n06759n13077n50806n46813n01573
2710.7G30762482m57764m82261n53608n50807n09739n06877n01812n06878n24402n02049
2731.1G25666285m85480m81785m45723m25816m31359m17530l73364l59833m16934m75765
2751.4G21352696m83691m39287m18186m74333m95673m21464l54290l91245m63069m38332
2771.8G16973126l99590m90784n87523n61297n35667n75602n59449m84348m93407n69165
2792.2G11716294o34134o84142o82950o74963p07864p13647o89208p28369q16882q42035
2812.6G04542100q16106q25227q57055q81731r05395r38475j024664j102328j085222
2831F96105897j113355j278102j483858j729011k072394k517402k995015l230273k873719
$$ plain form
2690.3 735860825 735369563 734948933 734480560 733930588 733381510 732874751 732361674 731810868 731264055 730762482
2710.7 730762482 730304718 729822457 729268849 728718042 728208303 727701426 727199614 726692736 726168334 725666285
2731.1 725666285 725180805 724699020 724253297 723827481 723396122 722978592 722605228 722245395 721828461 721352696
2751.4 721352696 720869005 720429718 720011532 719537199 719041526 718620062 718265772 717874527 717411458 716973126
2771.8 716973126 716573536 716082752 715495229 714933932 714398265 713822663 713263214 712778866 712285459 711716294
2792.2 711716294 711082160 710398018 709715068 709040105 708332241 707618594 706929386 706201017 705384135 704542100
2812.6 704542100 703725994 702900767 702043712 701161981 700256586 699318111 698293447 697191119 696105897
2831 696105897 694992542 693714440 692230582 690501571 688429177 685911775 682916760 679686487 676812768
2849.3F76812768j959622r78470l14891M17j0371k70307n69940q05735j016081j104116
2869.7F69783652r62794p61449o59824n67019m48286m30227n50925o98924p78914q28683
2890.1F63096607r05276j002788j092673j156568j173794j162291j212120j336574
2906.5F54054523j549244j873315k241432k551079k596438k239585j629651j027405
2922.8F38346374n41866q6486L22521N38706O58811Q54849J098395J288771J370252
2941.1F43850327J309037J061082O62267K72989L0816j18971k02835p6890K64049O68406
2961.5F47720277J013995J242876J397490J561165J709282J722634J568616J414239
2977.8F59350574J316667J111567Q50260P43270P77423P81298N82099K43485N3823
$$ plain form
2849.3 676812768 674853146 673874676 673559785 673560202 673549831 673279524 672709584 671903849 670887768 669783652
2869.7 669783652 668820858 668059409 667399585 666832566 666384280 665954053 665403128 664704204 663925290 663096607
2890.1 663096607 662191331 661188543 660095870 658939302 657765508 656603217 655391097 654054523
2906.5 654054523 652505279 650631964 648390532 645839453 643243015 641003430 639373779 638346374
2922.8 638346374 637804508 637718022 638040543 638579249 639238060 640092909 641191304 642480075 643850327
2941.1 643850327 645159364 646220446 646882713 647155702 647186518 647067547 646864712 646787822 647051871 647720277
2961.5 647720277 648734272 649977148 651374638 652935803 654645085 656367719 657936335 659350574
2977.8 659350574 660667241 661778808 662629068 663372338 664149761 664931059 665513158 665756643 665810466
2996.2F65810466m0949k06649l17275l29853l13758l04222l25442l69549m25160n48303
3016.6F62629306p05242p36117o41108o27577p64191q14796o74724n68211p20144r24587
3037F55452609q02457n77331o63996r03546r42707q19982p87794q54492q39711p87794
3057.4F47472799p97153p95006p26998o21021o51896q20339q46565o50584m47452m50611
3077.8F40665174o04153o83785o96659p70986p77244o90937p13826q00490p81775o75022
3098.2F33470297o60420p97212q57472p18892o36935p70092q45492p19607o76811q31007
3118.6F25956357j011193j119733j098216r76383r12428r71079j029670r76324r03249
3136.9F16958082r55761j099288j179993j168728j110375r79364r22680j096666j280904
$$ plain form
2996.2 665810466 665769517 665562868 665245593 664915740 664601982 664297760 663972318 663602769 663177609 662629306
3016.6 662629306 661924064 661187947 660546839 659919262 659155071 658340275 657665551 657097340 656377196 655452609
3037 655452609 654650152 654072821 653408825 652505279 651562572 650742590 649954796 649100304 648260593 647472799
3057.4 647472799 646675646 645880640 645153642 644532621 643880725 643060386 642213821 641563237 641115785 640665174
3077.8 640665174 640061021 639377236 638680577 637909591 637132347 636441410 635727584 634927094 634145319 633470297
3098.2 633470297 632809877 632012665 631155193 630436301 629799366 629029274 628183782 627464175 626787364 625956357
3118.6 625956357 624945164 623825431 622727215 621750832 620838404 619867325 618837655 617861331 616958082
3136.9 616958082 616002321 614903033 613723040 612554312 611443937 610464573 609541893 608445227 607164323
3155.3F07164323j282870j224399j197875j185655j169205j155317j163602j185238
3171.6E97600162j207530j219213j209200j190662j195729j217187j227915j203656
3187.9E87929070j162767j175404j213968j212895j188934j162111j137615j121044
3204.2E78554332j122951j159787j146079j052141j039803j092732j081049j063049
3220.5E69796741j088619j109004j068294r74655r07243r50396j109540j194895j138746
3238.9E60255349j089692j067341j036584j041055j108646j147867j069307r95099
3255.2E51699758j045764j109481j090646j038491j003444r65536r18090r47178j027048
3273.6E42554080j078963j079678j011312r56357r36985r04441q73208q10027p44522
$$ plain form
3155.3 607164323 605881453 604657054 603459179 602273524 601104319 599949002 598785400 597600162
3171.6 597600162 596392632 595173419 593964219 592773557 591577828 590360641 589132726 587929070
3187.9 587929070 586766303 585590899 584376931 583164036 581975102 580812991 579675376 578554332
3204.2 578554332 577431381 576271594 575125515 574073374 573033571 571940839 570859790 569796741
3220.5 569796741 568708122 567599118 566530824 565556169 564648926 563698530 562588990 561394095 560255349
3238.9 560255349 559165657 558098316 557061732 556020677 554912031 553764164 552694857 551699758
3255.2 551699758 550653994 549544513 548453867 547415376 546411932 545446396 544528306 543581128 542554080
3273.6 542554080 541475117 540395439 539384127 538427770 537490785 536586344 535713136 534903109 534158587
3291.9E34158587p97808r17673r87112r39727p80940o73235p68423j002610j159191
3310.3E26131868j173615j111806j055598j069009j115263j136124j145065j268863
3326.6E17056525j408994j338959j201093j148582j139581j225531j357973j402795
3342.9E06833017j409114j328706j176238j217664j407921j475125j380563j243025
3359.2D96194661j189679j179993j087696j057535j204819j381814j409739j268536
3375.5D86414850j141787j102388j107722j078606r27627p17998n97894p00950r43750
3393.9D78096128r73255o87569n21481p70212j011550q48085n94258n20021n28395
3412.3D71641302o25163p05451n52058l67701l38942k55883p1078M5001J520k6405
$$ plain form
3291.9 534158587 533360779 532443106 531455994 530516267 529735327 529062092 528293669 527291059 526131868
3310.3 526131868 524958253 523846447 522790849 521721840 520606577 519470453 518325388 517056525
3326.6 517056525 515647531 514308572 513107479 511958897 510819316 509593785 508235812 506833017
3342.9 506833017 505423903 504095197 502918959 501701295 500293374 498818249 497437686 496194661
3359.2 496194661 495004982 493824989 492737293 491679758 490474939 489093125 487683386 486414850
3375.5 486414850 485273063 484170675 483062953 481984347 481056720 480338722 479740828 479039878 478096128
3393.9 478096128 477122873 476435304 475913823 475143611 474132061 473283976 472689718 472169697 471641302
3412.3 471641302 471016139 470310688 469758630 469390929 469051987 468796104 468725026 468770027 468771547 468745142
3432.7D68745142P6562O2615j24514j47283Q5384L60697M77314L61115K72065L52621
3453.1D70521718M97788O57589P62641P04348O79344R33379J109839Q56459N41359
3471.4D77264464O03169Q69572J069188J060933Q70705Q38935J026482J091510J031518
3489.8D85726476J076638J178056J258165J249194J234919J304835J216740J042246
3506.1D95287269J146287J412690J550525J447350J253307J247167J476467J767516
3522.4E06588578J712322J434982J405955J518607J626670J784682J803458J648665
3538.7E19523919J735210K011716K084315J807273J586497J812338K063930J974225
3555E34599423J915336K086580K088368J856804K073705K748489K667547K115011K095222
$$ plain form
3432.7 468745142 468821704 468884319 468759805 468612522 468697906 469058603 469535917 469897032 470169097 470521718
3453.1 470521718 471019506 471677095 472439736 473144084 473823428 474756807 475866646 476723105 477264464
3471.4 477264464 477867633 478737205 479806393 480867326 481738031 482576966 483603448 484694958 485726476
3489.8 485726476 486803114 487981170 489239335 490488529 491723448 493028283 494245023 495287269
3506.1 495287269 496433556 497846246 499396771 500844121 502097428 503344595 504821062 506588578
3522.4 506588578 508300900 509735882 511141837 512660444 514287114 516071796 517875254 519523919
3538.7 519523919 521259129 523270845 525355160 527162433 528748930 530561268 532625198 534599423
3555 534599423 536514759 538601339 540689707 542546511 544620216 547368705 550036252 552151263 554246485
3573.4E54246485K384722K537013K567946K534211K468050K679705K963126K669752
3589.7E75051010K389609K707065L013551K961039K879858K787769K623201K690673
3606E97103775K999842L037691L033280L043473K845585L216088L614426K882659K113402
3624.4F23890221K391577L774702L995061K804041K599895K812028K857506K801002
3640.7F47926033K529561K288044K796828M048527L704726K073407K083064K941727
3657F70391917K667547K015590J794934J678586J762331K251744K100349J603305K153635
3675.4F88419938K056480J275718J122832J071334J155734J759291J987517J102805
3691.7F99951649N64158O61492P66575Q30889R63032P79033M40002M90307R54450J165449
$$ plain form
3573.4 554246485 556631207 559168220 561736166 564270377 566738427 569418132 572381258 575051010
3589.7 575051010 577440619 580147684 583161235 586122274 589002132 591789901 594413102 597103775
3606 597103775 600103617 603141308 606174588 609218061 612063646 615279734 618894160 621776819 623890221
3624.4 623890221 626281798 630056500 634051561 636855602 639455497 642267525 645125031 647926033
3640.7 647926033 650455594 652743638 655540466 659588993 663293719 665367126 667450190 670391917
3657 670391917 673059464 675075054 676869988 678548574 680310905 682562649 684662998 686266303 688419938
3675.4 688419938 690476418 691752136 692874968 693946302 695102036 696861327 698848844 699951649
3691.7 699951649 700515807 701177299 701943874 702774763 703737795 704516828 704956830 705447137 706401587 707567036
3712.1G07567036O33240K15351J95981L19659M21882M49181L46005J12771J30415N51105
3732.5G10942626R93371Q82268J00195m85122q6784P59542N24103K45333O96302N16414
3752.9G15088248j5318Q4281M22895K91943L4094J13607K27093L37780L02672L9757
3773.3G16927052j6451K58147M31419J48952r120J15514J13070O9738J0550o56J50561
3795.7G18198776J02043J46270L22104J2815K5570J98662q5353k25127L6657K93672
3816.1G19026089J45733K48969K97606j06633j76072j03295n9843K4974J41144K99633
3836.5G19738305K17855k8909j0430r001k87354n38051l18169O01768Q03173j62840
3856.9G20006347m66705k22683J22607Q0347j83046N9724K45273j1682k12312k81632
$$ plain form
3712.1 707567036 708200276 708415627 708611608 708931267 709353149 709802330 710148335 710261106 710391521 710942626
3732.5 710942626 711935997 712818265 712918460 712433338 712346554 713106096 713630199 713875532 714571834 715088248
3752.9 715088248 715072930 715157211 715580106 715872049 715906143 716019750 716246843 716584623 716887295 716927052
3773.3 716927052 716910601 717168748 717600167 717749119 717739999 717855513 717968583 718038321 718048871 718048215 718198776
3795.7 718198776 718300819 718447089 718769193 718782008 718807578 719006240 718920887 718695760 718732417 719026089
3816.1 719026089 719171822 719420791 719718397 719611764 719435692 719332397 719272554 719297528 719438672 719738305
3836.5 719738305 719956160 719927251 719916821 719907820 719620466 719082415 718764246 719366014 720169187 720006347
3856.9 720006347 719539642 719316959 719439566 719519913 719336867 719396591 719641864 719630182 719417870 719136238
3877.3G19136238l5226J56879J63436K11895j98007l84986l2783q0466l20912j99794
3897.7G18416274m0055J0968J63793J35601j42932k70784k39372j38343J5915L4928
3918.1G17945993r1374j28448n4836r5904j89066o2227Q9466j2159j83225k34246j35124
3940.5G16848850j7404p5519j00732k4438q7321j36614n7280o1393j46627j66476q1956
3962.9G15893090J8477k3603j25468j22070p1943n4777p2837r5188j7226P2658k6166
3985.4G15374947j67013j57475n2929l8028j31309j30176
3997.6G14698017
$$ plain form
3877.3 719136238 719101012 719257891 719421327 719633222 719435215 719050229 719017446 718936980 718616068 718416274
3897.7 718416274 718376219 718387187 718550980 718686581 718543649 718272865 718033493 717895150 717911065 717945993
3918.1 717945993 717854619 717726171 717671335 717575431 717386365 717324138 717413604 717401445 717218220 716983974 716848850
3940.5 716848850 716831446 716755927 716655195 716630757 716543436 716406822 716349542 716288149 716141522 715975046 715893090
3962.9 715893090 715911567 715887964 715762496 715640426 715568483 715513706 715440869 715345681 715328455 715401113 715374947
3985.4 715374947 715207934 715050459 714997530 714959502 714828193 714698017
3997.6 714698017
##END=$$ End of the data block
