##TITLE=$$ Begin of the data block
##JCAMP-DX=5.00 $$ ACD/SpecManager v 10.08
##SPECTROMETER/DATA SYSTEM=Alpha
##DATE=10 Nov 2014 10:35:34
##DATA TYPE=INFRARED SPECTRUM
##DATA CLASS=XYDATA
##ORIGIN=
##OWNER=
##NPOINTS=1765
##FIRSTX=399.76428223
##LASTX=3997.64306641
##MAXX=3997.64306641
##MINX=399.76428223
##MAXY=0.79709309
##MINY=0.46495876
##XFACTOR=1.0000000000
##YFACTOR=1.000000000000000e-9
##FIRSTY=0.67491019
##DELTAX=2.03961372
##XUNITS=1/CM
##YUNITS=ARBITRARY UNITS
##XYDATA=(X++(Y..Y))
399.8F74910188L2842N64515M27127q68976k133846j550198j62303l98696k236127
418.1F68584526k293945j70409M39822m38809j320064o47426Q06809O46293o89745
436.5F64917052r74834k07365K50101k50101r52363m56571O24835K76387j371145j973391
456.9F59882605m64201O23047l71277j537621j147687j01447k21909j125276r65595
475.2F54570639K86877P96736m70877j648605p35939O11067K07424j135528j327932
493.6F51153862o3836L88980j053035k169610j093506L56316k21908j962006k224266
511.9F43110991j143933q14199j401782j639724j012385l11255m72248j234531j284719
530.3F33796215k43187M15444k73108p34866N23866K022147J746535L96252j02103
$$ y = [674910188, 674943030, 675507545, 675934672, 675065696, 672931850, 671381652, 671219349, 670820653, 668584526, 666290581, 666120172, 666559994, 666121185, 664801121, 664153695, 664960504, 665606797, 664917052, 663942218, 663734853, 663984954, 663734853, 662782490, 662325919, 662950754, 663227141, 661855996, 659882605, 659418404, 660041451, 659670174, 658132553, 656984866, 656883419, 656661510, 655536234, 654570639, 654857516, 655654252, 655183375, 653534770, 652798831, 653409898, 653617322, 652481794, 651153862, 651090026, 651479006, 650425971, 648256361, 647162855, 647519171, 647297263, 645335257, 643110991, 641967058, 641152859, 639751077, 638111353, 637098968, 636787713, 636315465, 635080934, 633796215, 633553028, 633968472, 633695364, 632960498, 633484364, 635506511, 637253046, 637649298, 637547195]
548.7F37547195M11093O25551M9293p21037o44267K65896N13316j89484o16789k39551
569.1F37001216K30730l8028n99205k61605O01351O41883M5299j80006K42651O79373
589.4F38363659K83122n21600m63664J70588K00153l25621o39617n35548l05772m45842
609.8F35779858j247764j892745j318515J62363J252473J513123J708686K193034K371192
628.2F40521705J747251Q50081N31972Q45491R94802O65605N71728J040041J493275
646.6F49261951J425565R09805O19173R26495R43601K28584k51532N2512K20298l58045
667F53978407R239J453340J907289K128780J811922J020968Q94725J525879J714229
685.3F66444778R08733K17795N86748J119137O91354k17199k00212R48906J738787
$$ y = [637547195, 637958288, 638583839, 638633132, 637912095, 637267828, 637533724, 638047040, 637857556, 637240767, 637001216, 637231946, 637193918, 636594713, 636333108, 636934459, 637576342, 637621641, 637441635, 637684286, 638363659, 638646781, 638125181, 637661517, 637832105, 638032258, 637706637, 637067020, 636531472, 636225700, 635779858, 634532094, 632639349, 631320834, 631483197, 632735670, 634248793, 635957479, 638150513, 640521705, 642268956, 643119037, 643651009, 644496500, 645491302, 646156907, 646728635, 647768676, 649261951, 650687516, 651597321, 652216494, 653142989, 654086590, 654315174, 654063642, 654116154, 654336452, 653978407, 653987646, 655440986, 657348275, 659477055, 661288977, 662309945, 663204670, 664730549, 666444778, 667353511, 667571306, 668158054, 669277191, 669968545, 669751346, 669551134, 670500040, 672238827]
703.7F72238827J228153N36859J005471J978636J875401Q38220O19292J864374K910792
722F85096025K321125J289963J429796K340973K329707J082718L27528R87291J710654
740.4F98915780J138329M7863M9591J013636J170218J0610p77185n9545R06169N44310
760.8G02959776m63486l15308R99987J628756Q33929J20580P72357J882970J866281
779.1G10285842R32932Q03948J928508K573073J716196O48380Q48889J760662J678586
797.5G23177016M65691j74880N07474J114845N04851l79860P808J218796J314938j4245
817.9G27742434j194537j369357j027882p42495m14670L90351J587510K352297K036512
836.2G29360163J415730J596033J988113J340628n3108p08461j94490L70980K36034
$$ y = [672238827, 673466980, 674003839, 675009310, 676987946, 678863347, 679701567, 680320859, 682185233, 685096025, 687417150, 688707113, 690136909, 692477882, 694807589, 695890307, 696217835, 697205126, 698915780, 700054109, 700101972, 700151563, 701165199, 702335417, 702346027, 701568842, 701509297, 702415466, 702959776, 702496290, 702180982, 703180969, 704809725, 705643654, 705764234, 706536591, 708419561, 710285842, 711218774, 712022722, 713951230, 716524303, 718240499, 718888879, 719737768, 721498430, 723177016, 723642707, 723467827, 723975301, 725090146, 725594997, 725215137, 725222945, 726441741, 727756679, 727742434, 726547897, 725178540, 724150658, 723408163, 722993493, 723383844, 724971354, 727323651, 729360163, 730775893, 732371926, 734360039, 735700667, 735647559, 734939098, 734744608, 735115588, 735351622]
854.6G35351622m2677L43442J075208J026452J69337l44515j4305K88784k54810j119732
875G36478806j357079j027882j107574j936316k582014k259433j492083j288474j551568
893.4G21876383j310229l72887M11987L66092k15709n35786m85421p19011j373410
911.7G17642009j784086j579463j173497j063466j164734j053214o84023n08130q54075
930.1G07777321j527071k032458k215207k498627l221392l979624m125654l782452
946.4F84394836l591597l629624l413737k775312k168894k103507k439082k594173
962.7F61678910k405822k443969l119707l951788m350603m497826n023956n949974
979F29935265o448865o022752n264818m907847m753530m158020l217637k738238l036856
$$ y = [735351622, 735308945, 735652387, 736727595, 737754047, 737923384, 737578869, 737564564, 737853348, 737598538, 736478806, 735121727, 734093845, 732986271, 731049955, 728467941, 726208508, 724716425, 723427951, 721876383, 720566154, 720193267, 720605254, 720971346, 720755637, 720219851, 719734430, 719015419, 717642009, 715857923, 714278460, 713104963, 712041497, 710876763, 709823549, 709139526, 708631396, 707777321, 706250250, 704217792, 702002585, 699503958, 696282566, 692302942, 688177288, 684394836, 680803239, 677173615, 673759878, 670984566, 668815672, 666712165, 664273083, 661678910, 659273088, 656829119, 653709412, 649757624, 645407021, 640909195, 635885239, 629935265, 623486400, 617463648, 612198830, 607290983, 602537453, 598379433, 595161796, 592423558, 589386702]
997.4E89386702l531993l567576l269077l276229l613770l578901k931237k278328
1013.7E63339591k099693k061486j620770q64923l73601l60966l57866O7949O10709
1032E56278944O84798L83615K57194L91782K85565k94566p75873n59032P0214L29852
1052.4E57052493J06931J1265L99411Q75413Q04007K46406j22190j14202k26140n73933
1072.8E58459461n35429L02971J500487K214551K161264J952529K025545J862228J014352
1091.2E70957959J8596m10199l30031l20375n79834n65350J63615J176715J685381
1109.6E71796477J687407J942993K600729K883852K429783J866221J883567K304732
1125.9E89395761K485157K350807K200424K160490J993179J278043K92778j72913M4286
$$ y = [589386702, 585854709, 582287133, 579018056, 575741827, 572128057, 568549156, 565617919, 563339591, 561239898, 559178412, 557557642, 556692719, 556319118, 555958152, 555600286, 555668235, 556278944, 556963742, 557347357, 557604551, 557996333, 558281898, 557987332, 557211459, 556652427, 556722641, 557052493, 557159424, 557170689, 557570100, 558445513, 559249520, 559495926, 559373736, 559259534, 559033394, 558459461, 557924032, 558227003, 559727490, 561942041, 564103305, 566055834, 568081379, 569943607, 570957959, 570976555, 570566356, 570236325, 569915950, 569336116, 568770766, 568934381, 570111096, 571796477, 573483884, 575426877, 578027606, 580911458, 583341241, 585207462, 587091029, 589395761, 591880918, 594231725, 596432149, 598592639, 600585818, 601863861, 602156639, 601983726, 602028012]
1144.2F02028012L76165M52221O44087J312435K099633K500534K575815K933204L895462
1162.6F18817568M945099N560696N932987O476998P103563P241785O668628N978286
1178.9F68725610N645931N289375M401684L204942K337873J805484J008809j78635
1195.2F92241073j153887j377284j134932j108706j313448j246214q59141p71583j293599
1213.6F81982279j919508k113819k016366k106547k413035k502501k157747j730323
1229.9F65022433j592159j564265j251876p03991l45230l21209k65122J28925N54025
1248.2F59661531N98193L92615L56675N40793O61969O19948O18636Q25465J053810
1266.6F65329635J054883Q99136Q30114Q32915P15614M18365J02818J8060J28508J28865
$$ y = [602028012, 602404177, 602856398, 603500485, 604812920, 606912553, 609413087, 611988902, 614922106, 618817568, 623762667, 629323363, 635256350, 641733348, 648836911, 656078696, 662747324, 668725610, 674371541, 679660916, 684062600, 687267542, 689605415, 691410899, 692419708, 692241073, 691087186, 689709902, 688574970, 687466264, 686152816, 684906602, 684047461, 683275878, 681982279, 680062771, 677948952, 675932586, 673826039, 671413004, 668910503, 666752756, 665022433, 663430274, 661866009, 660614133, 659910142, 659564912, 659243703, 658978581, 659107506, 659661531, 660259724, 660652339, 661009014, 661549807, 662211776, 662831724, 663450360, 664275825, 665329635, 666384518, 667283654, 668113768, 668946683, 669662297, 670080662, 670183480, 670201540, 670330048, 670458913]
1287F70458913j57595n54025q25703j041234j403510j848817k190530k344609k423107
1305.4F57669783k595842k761901k755463k536595k238750j997292j701534j352906
1321.7F39729500j179576j217425j350403j413762j338959j237989j219868j179755
1338F29591763p87973k99931k28643l98517m95911m95076m79340m87686n59151q00609
1358.4F24558926j134754j191794j083017j337349j752258j972496k282798k574206
1374.7F11230254k847791m767954r315848j1257291l858864P371962R844064M723668
1391F01122200J049340k70247n41747m18484k47538l17693k13981J18196K46168L14772
1411.4F00840986L35395J74701L76225J474976J999081J933217K086341K023876J978278
$$ y = [670458913, 670301318, 669747293, 668921590, 667880356, 666476846, 664628029, 662437499, 660092890, 657669783, 655073941, 652312040, 649556577, 647019982, 644781232, 642783940, 641082406, 639729500, 638549924, 637332499, 635982096, 634568334, 633229375, 631991386, 630771518, 629591763, 628803790, 628503859, 628275216, 627876699, 627380788, 626885712, 626406372, 625918686, 625359535, 624558926, 623424172, 622232378, 621149361, 619812012, 618059754, 616087258, 613804460, 611230254, 608382463, 603614509, 594298661, 583041370, 579182506, 586554468, 596398532, 601122200, 602171540, 601901293, 601359546, 600941062, 600693524, 600375831, 600161850, 600280046, 600526214, 600840986, 601176381, 601351082, 601727307, 603202283, 605201364, 607134581, 609220922, 611244798, 613223076]
1429.8F13223076J782358J196324J288236K032041J774013J207709Q81732P24673Q67307
1448.1F24977469R33707N65589J70529Q42094K921164L021836K133906K458990L269911
1466.5F41295195L098070L122568M824698O195009N570412M408359L416419K649606
1482.8F74580336J542449L09467m13120n04434j009047k245963l253579l113091k858221
1501.2F63034797l253222m421711m798174k309501j503587k141952k490342k000093
1517.5F40116215j160205n72443l51190o46830q65340j007676j415730j518428j338303
1535.8F31240070j780212k014816o37710L66747M29929K40802K67566M13060K32458
1554.2F28757894k35796L37541K400339J573682L00109k54273o46830p01487r79185
$$ y = [613223076, 615005434, 616201758, 617489994, 619522035, 621296048, 622503757, 623385489, 624110162, 624977469, 625911176, 626476765, 626647294, 627489388, 630410552, 633432388, 635566294, 638025284, 641295195, 644393265, 647515833, 652340531, 658535540, 664105952, 668514311, 671930730, 674580336, 676122785, 676432252, 676019132, 675514698, 674505651, 672259688, 669006109, 665893018, 663034797, 659781575, 655359864, 650561690, 648252189, 646748602, 644606650, 642116308, 640116215, 638956010, 638383567, 638032377, 637385547, 636520207, 635512531, 634096801, 632578373, 631240070, 629459858, 627445042, 626807332, 627174079, 627604008, 627844810, 628112376, 628525436, 628757894, 628522098, 628859639, 631259978, 632833660, 633133769, 632879496, 632232666, 631531179, 630551994]
1572.6F30551994j762092k197206j982212k341807l025472l352404l549814l786028
1588.9F08554959l922403l779530l463745l106773k928019k885461k756774k629757
1605.2E83082497k644658k688229k620816k689362l022909l027260k400339k487898
1621.5E61501026k843380k650380k527952k402902k193212k269328j981676p45713
1637.8E43886483k89202m84407p88212o81579J56641J35899j02163J360298J885473
1656.2E45079231J270473J259983J922726K531291K119064K340913L581702L624678
1672.5E63730061L861249M624545M067302L221929L722310O483734O614625N248666
1688.8F01574421N319178M696429M940212N803406O055474P428467O060899M803538
$$ y = [630551994, 628789902, 626592696, 624610484, 622268677, 619243205, 615890801, 612340987, 608554959, 604632556, 600853026, 597389281, 594282508, 591354489, 588469028, 585712254, 583082497, 580437839, 577749610, 575128794, 572439432, 569416523, 566389263, 563988924, 561501026, 558657646, 556007266, 553479314, 551076412, 548883200, 546613872, 544632196, 543886483, 543597281, 543112874, 542324662, 541643083, 541799724, 541935623, 541833460, 543193758, 545079231, 546349704, 547609687, 549532413, 552063704, 554182768, 556523681, 560105383, 563730061, 567591310, 572215855, 576283157, 579505086, 583227396, 589711130, 596325755, 601574421, 606893599, 611590028, 616530240, 622333646, 628389120, 635817587, 641878486, 646682024]
1705.1F46682024N078971M157842K877593J934290J569807K369702K813935J904965
1721.5F69389129J324057J163066P35759K38300p689Q16524J833379J344204J345277
1739.8F78182006K008259K294362K294600K493024L589391M650176M152358L744840
1756.1G03409016L839433L655017L983795L877998L137350K790928K793371L435791
1772.4G30922699L551483K598643K048672K085089K044261J821697J613199J206100
1788.8G47891843J030326J578570J737833J334130J202345J389563J469314J251340
1805.1G58885264J041890R66906J031876J053631J011312J061559J016497O36995L81410
1823.4G67087340O26862P47502Q17359J101970J006544Q07107P88211N00620O1452
$$ y = [646682024, 651760995, 655918837, 658796430, 660730720, 662300527, 664670229, 667484164, 669389129, 670713186, 671876252, 672612011, 672850311, 672842622, 673659146, 675492525, 676836729, 678182006, 680190265, 682484627, 684779227, 687272251, 690861642, 695511818, 699664176, 703409016, 707248449, 710903466, 714887261, 718765259, 721902609, 724693537, 727486908, 730922699, 734474182, 737072825, 739121497, 741206586, 743250847, 745072544, 746685743, 747891843, 748922169, 750500739, 752238572, 753572702, 754775047, 756164610, 757633924, 758885264, 759927154, 760894060, 761925936, 762979567, 763990879, 765052438, 766068935, 766705930, 767087340, 767714202, 768461704, 769279063, 770381033, 771387577, 772194684, 772982895, 773483515, 773544967]
1841.8G73544967L35634J086950J070261P06733N57959O05642O46890N13315L96073
1860.2G79464424M00483L04818L4452J55747P42674R12428O95943M64619L12864L04401
1880.5G83792853M01557M09484J99854J17004M06861N55575M10617K92599K75791L68475
1900.9G87230670L97921K28465O9677K00272M55022L71814J7881l5405K71141L61681
1921.3G89569139L14892K82526K08139K34604K57075J49965N0545P2181N1081J967
1941.7G91192114Q8990J92642K66671K82407J23680m9889J192J58489J66177K6823
1962.1G92449296p6235O199K20656K36869M6969k5332P5877J32143R894q7559j9610
1984.6G92969167P4029J5557j12176k8312J75238J96278N8591o8843r3580k503M5299
$$ y = [773544967, 773880601, 774967551, 776037812, 776744545, 777302504, 777908146, 778555036, 779068351, 779464424, 779864907, 780169725, 780204177, 780359924, 781102598, 782015026, 782710969, 783175588, 783488452, 783792853, 784194410, 784603894, 784803748, 784920752, 785327613, 785883188, 786293805, 786586404, 786862195, 787230670, 787628591, 787857056, 787926733, 788127005, 788582027, 788953841, 788971722, 788936317, 789207458, 789569139, 789884031, 790166557, 790374696, 790609300, 790866375, 791016340, 791066885, 791139066, 791190147, 791192114, 791281104, 791473746, 791740417, 792022824, 792146504, 792096615, 792097807, 792256296, 792422473, 792449296, 792373061, 792379260, 792599916, 792836785, 792883754, 792858422, 792934299, 793066442, 793076336, 792988777, 792969167, 793043196, 793058753, 792946577, 792918265, 793093503, 793289781, 793348372, 793279529, 793185949, 793183446, 793228745]
2007G93228745n9664j71363j52886q8036n6148o5326j04905q2552l3796o1810j36733
2029.4G92215526j40190p0512m9711j34587k10166r8169R3699R0241r1433j85430q7500
2051.9G91331768M8995K4974j08301j30654m0471J6570j5557p7307m1604P2479N0306
2074.3G91131198q2552r1732J9670P8738J1265j01209q9764N7876J10268J7405k9326
2096.8G91031837O3360J58608R7692n4776q7679N7280J55151N5254o5983q106J36554
2119.2G91539192J45555P927m8101P0632J59979O8783o2763k4379J24455J70946N6148
2141.6G92208374l7909O0499J98781J44959L993K1458J67549K24530J11580r54P1764
2164.1G93174624K32757K33411Q4997J6570J18315K59876K17736N2869M0055J85549
$$ y = [793228745, 793169081, 792997718, 792844832, 792756796, 792700648, 792635322, 792530417, 792447865, 792414069, 792352259, 792215526, 792075336, 792004824, 791955113, 791820526, 791610360, 791512191, 791605890, 791696131, 791604698, 791419268, 791331768, 791380763, 791405737, 791297436, 791166782, 791126311, 791142881, 791127324, 791050017, 791008413, 791080892, 791131198, 791048646, 790956914, 790976584, 791055322, 791066587, 790965378, 790875614, 790933490, 791043758, 791061163, 791031837, 791095197, 791253805, 791351497, 791296721, 791209042, 791266322, 791421473, 791476727, 791410744, 791402638, 791539192, 791684747, 791692674, 791644573, 791715205, 791875184, 791943967, 791881204, 791856825, 791981280, 792152226, 792208374, 792170465, 792230964, 792429745, 792574704, 792578697, 792600155, 792767704, 792992234, 793103814, 793102860, 793174624, 793407381, 793640792, 793725789, 793742359, 793860674, 794120550, 794338286, 794391155, 794431210, 794616759]
2184.5G94616759K51293J22607j6093N6922K42352K47658P1108l159J27554K28703
2204.8G95945704J12534m6373k861J67012K02239O2644m3630L5286J61946J18255k3961
2227.3G96688795l0637R2924J46449O5624l8087k7537N7280N2869k4021m2259J9788
2249.7G96961188Q8930M2975j04010j06752L8863P1227l6537q6070J550R5964M7326
2272.2G97014654q4937r5725K2233P4923l9936j85966j86384j31368j93417k97428
2292.5G95896649k89619k08199j94430l07858m64499n29587m96507n01513n53012n19753
2312.9G91831672m90486o60003q77499q21710n73039m72188n59866n90086m67122l91841
2333.3G85927832m15444m00841l56198k19047L18945R62734M58598q43048j692832
$$ y = [794616759, 794868052, 794990659, 794974566, 795031488, 795273840, 795521498, 795592606, 795589447, 795717001, 795945704, 796058238, 796011865, 796009004, 796176016, 796378255, 796440899, 796397269, 796432555, 796594501, 796712756, 796688795, 796658158, 796751082, 796897531, 796963155, 796925068, 796897531, 796954811, 797007680, 796983659, 796941400, 796961188, 797050118, 797093093, 796989083, 796882331, 796921194, 796992421, 796955884, 796869814, 796871364, 796967328, 797014654, 796929717, 796833992, 796856225, 796931148, 796891212, 796705246, 796518862, 796387494, 796194077, 795896649, 795607030, 795398831, 795204401, 794896543, 794432044, 793902457, 793405950, 792904437, 792351425, 791831672, 791341186, 790681183, 789803684, 788981974, 788408935, 787936747, 787376881, 786786795, 786319673, 785927832, 785512388, 785111547, 784755349, 784536302, 784855247, 785817981, 786276579, 785433531, 783740699]
2351.7G83740699j775503j506269j159429n96166L4690N27084Q75294J004159R88484
2370.1G82133043J002252J011610R05693P89344P20978N27501K35676k5093k26379
2388.4G87074625l43143l98577m18484l78370l08693k61664k32875k16425k32100k76685
2408.8G84007609l10302l27289l64721m00781m09186m23551m41909m73201m49657k70606
2429.2G80136406j21295j64807k73883l35336l47257l24964l19600l52204l74138l66807
2449.6G77156115l78430m11570m09782l91543l85225l90768m01974l98695m11392m33921
2470G73142815m46499m80890m89175m46976m27186m38213m56155m57883m38273m39286
2490.4G68622279m36902m05609l91901m09782m44710m60267m23849l97205m13060m14968
$$ y = [783740699, 781965196, 780458927, 779299498, 778703332, 778738022, 779265106, 780140400, 781144559, 782133043, 783135295, 784146905, 785052598, 785841942, 786562920, 787090421, 787326097, 787301004, 787074625, 786731482, 786332905, 785914421, 785536051, 785227358, 784965694, 784732819, 784516394, 784284294, 784007609, 783697307, 783370018, 783005297, 782604516, 782195330, 781771779, 781329870, 780856669, 780407012, 780136406, 780015111, 779850304, 779576421, 779241085, 778893828, 778568864, 778249264, 777897060, 777522922, 777156115, 776777685, 776366115, 775956333, 775564790, 775179565, 774788797, 774386823, 773988128, 773576736, 773142815, 772696316, 772215426, 771726251, 771279275, 770852089, 770413876, 769957721, 769499838, 769061565, 768622279, 768185377, 767779768, 767387867, 766978085, 766533375, 766073108, 765649259, 765252054, 764838994, 764424026]
2510.8G64424026l85523l82364m01616l68178l42965l78668m18603m58360m63486l92020
2531.2G60432243l39567l63171m07577m45247m26352l84688m01616m04060l90112m15028
2551.6G56454825m41432m45842m31955m21882m36127m44770m20332m02868m20868m52876
2572G52135873m65512m44770m30882m61519m95434m90606m87387n09500n23806n07832
2592.4G47318625m68254m64022n03659n17905m94122m70579m85539n45383n62906m94600
2612.8G42311656m53948n04971n59747n47111n04256m96625n35846n68450n53787n38229
2633.2G37048686n50211n58495n39780n12123n27919n81383o05524n68032n16951n35786
2653.5G31552482o03378n93841n25534n34058n81026n69761n30958n19991n66244o25849
$$ y = [764424026, 764038503, 763656139, 763254523, 762886345, 762543380, 762164712, 761746109, 761287749, 760824263, 760432243, 760092676, 759729505, 759321928, 758876681, 758450329, 758065641, 757664025, 757259965, 756869853, 756454825, 756013393, 755567551, 755135596, 754713714, 754277587, 753832817, 753412485, 753009617, 752588749, 752135873, 751670361, 751225591, 750794709, 750333190, 749837756, 749347150, 748859763, 748350263, 747826457, 747318625, 746850371, 746386349, 745882690, 745364785, 744870663, 744400084, 743914545, 743369162, 742806256, 742311656, 741857708, 741352737, 740792990, 740245879, 739741623, 739244998, 738709152, 738140702, 737586915, 737048686, 736498475, 735939980, 735400200, 734888077, 734360158, 733778775, 733173251, 732605219, 732088268, 731552482, 730949104, 730355263, 729829729, 729295671, 728714645, 728144884, 727613926, 727093935, 726527691, 725901842]
2673.9G25901842o08265n35906n00500n63621o44446o09398n37634n42402o04808o50823
2694.3G20104039o28889n80192o00814o84798o88136n92828n43177o16908p14600o96778
2714.7G13756919o18875o08623o50346o66380o41227o35684o71208o54757n54502m83155
2735.1G07572162n21540o03557o19352n27620m17710m54068n65767n47469m74095m95136
2755.5G02345848n73277o17683n73695n03242n18739n86868n90443n24700n18978o12020
2775.9F96726203o87122o80268o56426o73771p06852p19845p14660p10070p39574p89702
2796.3F89647913p94947p86722q28862q99077r40561r25124r31203r95278j042485
2814.7F81503654j048208j035154j075863j193345j273453j274884j271427j345575
$$ y = [725901842, 725293577, 724757671, 724257171, 723693550, 723049104, 722439706, 721902072, 721359670, 720754862, 720104039, 719475150, 718894958, 718294144, 717609346, 716921210, 716328382, 715785205, 715168297, 714453697, 713756919, 713138044, 712529421, 711879075, 711212695, 710571468, 709935784, 709264576, 708609819, 708055317, 707572162, 707050622, 706447065, 705827713, 705300093, 704882383, 704428315, 703862548, 703315079, 702840984, 702345848, 701772571, 701154888, 700581193, 700077951, 699559212, 698972344, 698381901, 697857201, 697338223, 696726203, 696039081, 695358813, 694702387, 694028616, 693321764, 692601919, 691887259, 691177189, 690437615, 689647913, 688852966, 688066244, 687237382, 686338305, 685397744, 684472620, 683541417, 682546139, 681503654, 680455446, 679420292, 678344429, 677151084, 675877631, 674602747, 673331320, 671985745]
2831F71985745j516699j654387j737475j959086k365291k842843l289283l495156l141702
2849.3F49983823k218008j189112m85063j81317k19763m75585p62701j016498j245141
2867.7F42190635j341581j203060r67205q07643p12931o52194o16729o31690p38204
2886.1F34519398q92520j016915j040458r99391j063288j227378j300991j282156j325964
2904.4F24370337j514197j789451k101421k483606k824724k856314k417147j706481
2920.7F06676996j069367n98848j85728J87337M23312N96583Q35777J132130J401127
2939.1F09399319J552760J524210J307667J020371P81954N68509L08335J40130K49982
2957.4F16853237N43833Q16345J009345J236797J471519J572013J631975J699865J664221
$$ y = [671985745, 670469046, 668814659, 667077184, 665118098, 662752807, 659909964, 656620681, 653125525, 649983823, 647765815, 646576703, 646091640, 645910323, 645690560, 645214975, 644452274, 643435776, 642190635, 640849054, 639645994, 638678789, 637871146, 637158215, 636506021, 635889292, 635257602, 634519398, 633626878, 632609963, 631569505, 630570114, 629506826, 628279448, 626978457, 625696301, 624370337, 622856140, 621066689, 618965268, 616481662, 613656938, 610800624, 608383477, 606676996, 605607629, 605008781, 604823053, 605010390, 605433702, 606030285, 606866062, 607998192, 609399319, 610952079, 612476289, 613783956, 614804327, 615586281, 616154790, 616463125, 616603255, 616853237, 617397070, 618213415, 619222760, 620459557, 621931076, 623503089, 625135064, 626834929, 628499150]
2975.8F28499150J574874J477003J299978J112282J022160R76860R03607P33495M56512
2994.2F38055921K55704R1075j67131l24070l41654l94225m44472m14551m21524n28812
3014.5F35366261o22451o75619p66396q54075q86620q96990q82566q26895p45893p63356
3034.9F27445400q82447q76009q10981r02117j049041j067221r62854r23693r80973
3053.3F18990064r71914r21607r01103q71122q17716p29501o90162p84159q38995p48575
3073.7F10715210o35981n63979n83530o78420p41005p65800p37131o94752p27415p64191
3094.1F03823006p38978o72996o62208p84576q77321p90298o90162p70509q61943q08179
3114.5E96165836p69317q51453j019060j170755j158535j005173r29773j005053j098097
$$ y = [628499150, 630074024, 631551027, 632851005, 633963287, 634985447, 635962307, 636865914, 637599409, 638055921, 638311625, 638402700, 638235569, 637911499, 637569845, 637175620, 636731148, 636316597, 635895073, 635366261, 634743810, 634068191, 633301795, 632447720, 631561100, 630664110, 629781544, 628954649, 628208756, 627445400, 626562953, 625686944, 624875963, 623973846, 622924805, 621857584, 620894730, 619971037, 618990064, 618018150, 617096543, 616195440, 615324318, 614506602, 613777101, 613086939, 612302780, 611463785, 610715210, 610079229, 609515250, 608931720, 608253300, 607512295, 606746495, 606009364, 605314612, 604587197, 603823006, 603084028, 602411032, 601748824, 600964248, 600086927, 599296629, 598606467, 597835958, 596974015, 596165836, 595396519, 594545066, 593526006, 592355251, 591196716, 590191543, 589261770, 588256717, 587158620]
3132.8E87158620j100421r99212r77814j144886j262844j219570j152873j093686j050293
3151.2E77157021j120091j271009j331032j299262j266956j210272j171112j223982
3167.5E67263305j289248j258672j185894j179814j221955j254737j251936j187265
3183.8E57433784j143455j175762j198649j206696j204789j153469j108766j099050
3200.1E48143148j060068j019418j043678j039922r84132r75788r89318j016140j040101
3218.5E38974583r90987r44972r85682j019120r50813q58069q73804j016915j093924
3236.9E30240297j016915r81211r89974r18030r24707j082778j161098j079023j005173
3255.2E21081388j026571j037419j020491j037538j040578r70840q82209r14812j024723
$$ y = [587158620, 586058199, 585058987, 584081173, 582936287, 581673443, 580453873, 579301000, 578207314, 577157021, 576036930, 574765921, 573434889, 572135627, 570868671, 569658399, 568487287, 567263305, 565974057, 564715385, 563529491, 562349677, 561127722, 559872985, 558621049, 557433784, 556290329, 555114567, 553915918, 552709222, 551504433, 550350964, 549242198, 548143148, 547083080, 546063662, 545019984, 543980062, 542995930, 542020142, 541030824, 540014684, 538974583, 537983596, 537038624, 536052942, 535033822, 534083009, 533224940, 532351136, 531334221, 530240297, 529223382, 528242171, 527252197, 526334167, 525409460, 524326682, 523165584, 522086561, 521081388, 520054817, 519017398, 517996907, 516959369, 515918791, 514947951, 514065742, 513150930, 512126207]
3273.6E12126207j037359r59456q95858q53955q05736p66158p37608o67035n93245
3291.9E04809797o42657p30813p11739o14643n09024m66049n52654o99550p81774p70241
3312.3D98330653p25150p38383p71433p61360p33226p36446q13692q92699r20445r04858
3332.7D90332961p89165o80834p65145r11951r04829q06123p47591p46608q35299r38386
3353.1D82207030r03040p91341p42585p74890p44223n62787m70490o48856q80629q75890
3373.5D74812299p11828o36131o56873o60867o00159n15788m14432l19510l87401n85913
3393.9D69323397n62668k87980k04355m40180o47724n50329l10689j81377k01077l19957
3414.3D65617061l48449k04742p7963k7150L1054J27912K07603K11209K68072L12924
$$ y = [512126207, 511088848, 510129392, 509233534, 508379579, 507573843, 506807685, 506070077, 505403042, 504809797, 504167140, 503436327, 502724588, 502109945, 501600921, 501134872, 500582218, 499882668, 499100894, 498330653, 497605503, 496867120, 496095687, 495334327, 494601101, 493864655, 493050963, 492158264, 491237819, 490332961, 489543796, 488862962, 488097817, 487185866, 486281037, 485474914, 484727323, 483980715, 483145416, 482207030, 481303990, 480512649, 479770064, 478995174, 478250951, 477688164, 477217674, 476568818, 475688189, 474812299, 474100471, 473464340, 472807467, 472146600, 471546441, 471030653, 470616221, 470296711, 469909310, 469323397, 468760729, 468472749, 468268394, 467828214, 467180490, 466630161, 466319472, 466138095, 465937018, 465617061, 465268612, 465063870, 464985907, 464958757, 464989811, 465117723, 465325326, 465536535, 465804607, 466117531]
3434.7D66117531J58161j4365N6893K44498L78102N30303N77181N12034N26428N90265
3455.1D69677031O79880P41870O97493P51645R81956J078517Q58664O18517P05481
3473.4D76791054R27269J014114R72539Q84861Q97676J031220J098215J082748J086295
3491.8D85785991J125067J217634J186132J055688J134813J214981J072764J100451
3508.1D94893521J339585J480639J407653J225561J150787J253068J494467J524925
3524.4E05770206J351178J444340J632273J620412J632154J693010J628042J605570
3540.8E18377185J689553J823068J845300J665711J708329J935899J912833J868844
3557.1E32826722J997053J879096J367331J528203K870202L236115K305568J954198
$$ y = [466117531, 466275692, 466261327, 466318220, 466562718, 466940820, 467471123, 468048304, 468560338, 469086766, 469677031, 470356911, 471098781, 471796274, 472547919, 473529875, 474608392, 475467056, 476085573, 476791054, 477718323, 478732437, 479704976, 480589837, 481487513, 482518733, 483616948, 484699696, 485785991, 486911058, 488128692, 489314824, 490370512, 491505325, 492720306, 493793070, 494893521, 496233106, 497713745, 499121398, 500346959, 501497746, 502750814, 504245281, 505770206, 507121384, 508565724, 510197997, 511818409, 513450563, 515143573, 516771615, 518377185, 520066738, 521889806, 523735106, 525400817, 527109146, 529045045, 530957878, 532826722, 534823775, 536702871, 538070202, 539598405, 542468607, 545704722, 548010290, 549964488]
3573.4E49964488K193272K408862K537548K362371J873016K036274L071665L095627
3589.7E69543123K243579K325117K821327K849519K865731K862454K311945K021909
3606E89844704K712488L104746K864957K661586K384484L154337M100025K931773J317621
3624.4F15076721J329183L784478M952550L207445K723813K767444K569139K521813
3640.7F38932586K017975J142382J524747M186749N072832K499521J906037L193498
3657F60476327K878487J962781J663089J033187O72221J858890K186835J115203K626836
3675.4F76473856L435492J812399J119733N85913J30654J023054K527773K180636J101852
3693.7F90391362O35326L43859N35071J354932J154960k5809l93033P37607K267897
$$ y = [549964488, 552157760, 554566622, 557104170, 559466541, 561339557, 563375831, 566447496, 569543123, 571786702, 574111819, 576933146, 579782665, 582648396, 585510850, 587822795, 589844704, 592557192, 595661938, 598526895, 601188481, 603572965, 606727302, 610827327, 613759100, 615076721, 616405904, 620190382, 625142932, 628350377, 631074190, 633841634, 636410773, 638932586, 640950561, 642092943, 643617690, 647804439, 652877271, 655376792, 657282829, 660476327, 663354814, 665317595, 666980684, 668013871, 668686092, 670544982, 672731817, 673847020, 676473856, 679909348, 681721747, 682841480, 683427393, 683558047, 684581101, 687108874, 689289510, 690391362, 691026688, 691370547, 691905618, 693260550, 694415510, 694389701, 693996668, 694734275, 697002172]
3712.1F97002172J532555Q4102k48253k2352K51115N25295O34134o7770p51853k70009
3732.5F98669136J214385K132296O73056j324713p66874J553059P27832k38597J797259
3750.8G04436839K080202J93894j93715P35580P78497o0082r6857K49088Q41617J112759
3771.2G10077822K33174m59731j09375O95706N39839O0499L30090M49121J85848k02358
3791.6G11800635m82679k70485l80755j47581J015127N00917L17931J155913Q1301
3810G13590324j217485p88271L62277j6034L10719J414895L73602k26736k21193l87549
3830.4G13194549k89142l32654J20998R24468P36356N29885M27604n84126j870632
3848.7G12857306j792252J390874L404498M08292j197815r34124m8577K82406l98576
$$ y = [697002172, 698534727, 698618829, 698370576, 698348224, 698599339, 699124634, 699758768, 699690998, 698939145, 698669136, 699883521, 702015817, 702688873, 701364160, 700597286, 702150345, 702878177, 702639580, 704436839, 706517041, 706710935, 706517220, 707252800, 708031297, 707971215, 707874358, 708123446, 708965063, 710077822, 710310996, 709851265, 709741890, 710437596, 710977435, 711037934, 711368024, 711817145, 712002993, 711800635, 711317956, 711047471, 710666716, 710519135, 711534262, 712035179, 712353110, 713509023, 713590324, 712372839, 711584568, 711946845, 711930811, 712241530, 713656425, 714030027, 713803291, 713582098, 713194549, 712905407, 712572753, 712693751, 713618219, 714354575, 714884460, 715312064, 714727938, 712857306, 711065054, 712455928, 715860426, 716268718, 715070903, 714136779, 714088202, 714370608, 713972032]
3867.1G13972032P3791Q99613N17189J3232o66320l25680L54409J04309N06103J51991
3887.5G15600669m68731M12703L40879r09746j077354l15427N01036J178205J019657
3905.8G16281891J64807k57969m37617o23644k25782L86178K02835j93656q94M0531
3926.2G15336680l44276j50383M89533M07398j46329l96610k50458J19149O3599j82450
3946.6G14945853L2603J84358N0306m9114j23978j29223k4676J6510m3034q1480o9141
3969.1G14708984n9903n960R4831O8307l3617j9431L6358k8729j29879j13070l5166
3991.5G14482725o56M649n603
3997.6G14481115
$$ y = [713972032, 714045823, 714945436, 715462625, 715475857, 714809537, 714483857, 714838266, 714942575, 715448678, 715600669, 715131938, 715544641, 715885520, 714975774, 713898420, 713582993, 714084029, 715262234, 716281891, 716446698, 716188729, 715751112, 715127468, 714901686, 715287864, 715490699, 715297043, 715296149, 715336680, 714992404, 714842021, 715331554, 715738952, 715592623, 715196013, 714945555, 715064704, 715128303, 714945853, 714978456, 715162814, 715213120, 715164006, 715040028, 714910805, 714886129, 714902639, 714859605, 714778125, 714708984, 714649081, 714643121, 714737952, 714806259, 714772642, 714753211, 714789569, 714760840, 714630961, 714517891, 714482725, 714482069, 714486718, 714481115]
##END=$$ End of the data block
