##TITLE=$$ Begin of the data block
##JCAMP-DX=5.00 $$ ACD/SpecManager v 10.08
##SPECTROMETER/DATA SYSTEM=Alpha
##DATE=10 Nov 2014 10:35:34
##DATA TYPE=INFRARED SPECTRUM
##DATA CLASS=XYDATA
##ORIGIN=
##OWNER=
##NPOINTS=1765
##FIRSTX=399.76428223
##LASTX=3997.64306641
##MAXX=3997.64306641
##MINX=399.76428223
##MAXY=0.79839033
##MINY=0.46206310
##XFACTOR=1.0000000000
##YFACTOR=1.000000000000000e-9
##FIRSTY=0.67618203
##DELTAX=2.03961372
##XUNITS=1/CM
##YUNITS=ARBITRARY UNITS
##XYDATA=(X++(Y..Y))
399.8F76182032l14296J80722J11520r93133j915693j301408J77145n7041k160669
$$ 676182032 675867736 676048458 676159978 675166845 673251152 671949744 672126889 672069848 669909179
418.1F69909179k205968j54078Q1003r56833j704395q61466P91669J061022j68562
$$ 669909179 667703211 667549133 667630136 666673303 664968908 664107442 664899111 665960133 665791571
436.5F65791571j070380m44532O28770K90811q87811p35402K05338k86162j821518
$$ 665791571 664721191 664276659 664905429 665196240 664308429 663573027 663778365 663492203 661670685
454.8F61670685k023101l74019N10037m10259j327217r42051n2631k41160j154662
$$ 661670685 659647584 659273565 659783602 659373343 658046126 657104075 657051444 656810284 655655622
473.2F55655622j040995J23501M93288o31988j366079l64482P43806R9838j384318
$$ 655655622 654614627 654738128 655231416 654599428 653233349 652868867 653612673 653712511 652328193
491.5F52328193j467466j21951L39389j028538k117217j125991J57714l04997j699686
$$ 652328193 650860727 650738776 651078165 650049627 647932410 646806419 646964133 646659136 644959450
509.9F44959450j985193j136004q21710j457632j843452j077652j25051l89218j415193
$$ 644959450 642974257 641838253 641016543 639558911 637715459 636637807 636512756 636123538 634708345
528.3F34708345j525104l83020M69745p332m12523M45544J529575J497447N03957m5359
$$ 634708345 633183241 632800221 633269966 633262634 632850111 633295655 634825230 636322677 636826634 636781275
548.7F36781275L91245O43671m828p53761n19573M19557O11126j17838n18143k15113
$$ 636781275 637172520 637816191 637811363 637057602 636538029 636957586 637568712 637450874 636932731 636717618
569.1F36717618R8824j05679m65333j85788M96864N97179J68145j14203J2517L85523
$$ 636717618 636816442 636710763 636245430 636059642 636556506 637153685 637321830 637207627 637220144 637605667
589.4F37605667K73287l94761m81248J11580L04758j32203n77092n78642l28362m99546
$$ 637605667 637878954 637484193 637002945 637114525 637419283 637287080 636709988 636131346 635802984 635303438
609.8F35303438j253963j787841j207769J48535J134276J530051J791239K155364K339899
$$ 635303438 634049475 632261634 631053865 631202400 632336676 633866727 635657966 637813330 640153229
628.2F40153229J772046Q24452M71055Q26597J090527Q50260O63340J025320J468718
$$ 640153229 641925275 642749727 643220782 644047379 645137906 645988166 646651506 647676826 649145544
646.6F49145544J316249P26283N69582R99271J062572M23670j75714l5465K19107j93119
$$ 649145544 650461793 651188076 651757658 652756929 653819501 654243171 654067457 654031992 654251099 654057980
667F54057980J10566J332283J744271K010941J770794J088977J062453J645327J677990
$$ 654057980 654168546 655500829 657245100 659256041 661026835 662115812 663178265 664823592 666501582
685.3F66501582P81417R8049N51164J213014Q38161j44899j91033R48370J677036J160562
$$ 666501582 667282999 667381048 667932212 669145226 669983387 669838488 669647455 670595825 672272861 673433423
705.7F73433423N85079J061917J965940J888930Q69632N97000J816511K931238K410113
$$ 673433423 674018502 675080419 677046359 678935289 679804921 680401921 682218432 685149670 687559783
724.1F87559783J330257J437724K404213K361655J002431K12848R84609J843810J203299
$$ 687559783 688890040 690327764 692731977 695093632 696096063 696308911 697293520 699137330 700340629
742.4G00340629p1764n9247J064539J250386K9743p66635o8784Q54790N10037m55141
$$ 700340629 700268865 700209618 701274157 702524543 702554286 701787651 701718867 702573657 703083694 702628553
762.8G02628553k99573J003563J618088P97450P2241Q00788J983226J887321Q79050
$$ 702628553 702328980 703332543 704950631 705748081 705820322 706621110 708604336 710491657 711370707
781.2G11370707P98642J929820K522766J656235O17742Q97885J864492J733125M41014
$$ 711370707 712169349 714099169 716621935 718278170 718895912 719793797 721658289 723391414 723832428
799.5G23832428j89364N60821J169681N02825m20153j6213J227439J343548J2577j171291
$$ 723832428 723643064 724203885 725373566 725876391 725456238 725440025 726667464 728011012 728023589 726852298
819.9G26852298j332998j029969p72834m13656L38555J421511K200424K039910J540482
$$ 726852298 725519300 724489331 723716497 723302841 723641396 725062907 727263331 729303241 730843723
838.3G30843723J725435K052546J333594m0293o61731k04980L12388J49846j01268
$$ 730843723 732569158 734621704 735955298 735915005 735253274 735048294 735360682 735510528 735409260
856.6G35409260L48866J062989R99391J56403l31998M3034L32475k58148j147091j395047
$$ 735409260 735758126 736821115 737820506 737976909 737644911 737687945 738020420 737762272 736615181 735220134
877G35220134j076579j157999j932859k494514k207101j564443j369893j588047j349628
$$ 735220134 734143555 732985556 731052697 728558183 726351082 724786639 723416746 721828699 720479071
895.4G20479071l76284M52042L98755j78337n05567n28693p84040j376211j784683
$$ 720479071 720102787 720554829 720953584 720775247 720269680 719740987 718956947 717580736 715796053
913.7G15796053j629173j196802j019597j124919j081287p43449n33700q58724j529575
$$ 715796053 714166880 712970078 711950481 710825562 709744275 709000826 708467126 707608402 706078827
932.1G06078827k035975k226532k501368l220499l967881m093706l745854l534794
$$ 706078827 704042852 701816320 699314952 696094453 692126572 688032866 684287012 680752218
948.4F80752218l585935l452539k839446k173782k098560k479613k618551k399683
$$ 680752218 677166283 673713744 670874298 668700516 666601956 664122343 661503792 659104109
964.7F59104109k430618l069222l913820m388213m561901n038738n906463o403089
$$ 659104109 656673491 653604269 649690449 645302236 640740335 635701597 629795134 623392045
981.1F23392045o034135n306423m912317m714250m090310l150880k726376l081739
$$ 623392045 617357910 612051487 607139170 602424920 598334610 595183730 592457354 589375615
997.4E89375615l559649l537714l226757l256321l573299l522098k929449k304912
$$ 589375615 585815966 582278252 579051495 575795174 572221875 568699777 565770328 563465416
1013.7E63465416k112627k067864j594424q04603l48091m21286m22835R0241O74069
$$ 563465416 561352789 559284925 557690501 556885898 556537807 556116521 555693686 555783927 556457996
1032E56457996P15137L66866K07782L32892K28167l37720p56741m73439J29521L02374
$$ 556457996 557173133 557539999 557747781 558080673 558308840 557971120 557214379 556740940 556870461 557172835
1052.4E57172835N4002K6583M55320Q70526P62940K53021q0049q7380k02596n47588
$$ 557172835 557226837 557253420 557708740 558579266 559342206 559595227 559515178 559427798 559225202 558677614
1072.8E58677614n49615K87414J513183K184391K110422J955092K031326J856029J051664
$$ 558677614 558127999 558415413 559928596 562112987 564223409 566178501 568209827 570065856 571117520
1091.2E71117520M7803m06682k82109k51234n60700n78583J68264J173794J661539
$$ 571117520 571165323 570758641 570476532 570225298 569664598 569086015 569254279 570428073 572089612
1109.6E72089612J687527J960397K602816K862513K412200J891732J904070K298892
$$ 572089612 573777139 575737536 578340352 581202865 583615065 585506797 587410867 589709759
1125.9E89709759K490222K326608K173662K205789K058149J309096K83778k08735L6239
$$ 589709759 592199981 594526589 596700251 598906040 600964189 602273285 602557063 602348328 602384567
1144.2F02384567M01855M76360O54280J309514K074242K429783K511800K930104L912092
$$ 602384567 602786422 603262782 603917062 605226576 607300818 609730601 612242401 615172505 619084597
1162.6F19084597M970669N594552N929410O448210P091224P225692O629765N943001
$$ 619084597 624055266 629649818 635579228 642027438 649118662 656344354 662974119 668917120
1178.9F68917120N649149N327225M432201L224850K322077J734615R46164k03729j152694
$$ 668917120 674566269 679893494 684325695 687550545 689872622 691607237 692553401 692349672 691196978
1197.3F91196978j348078j094520j092494j331150j276732q79049p57158j256704j917720
$$ 691196978 689848900 688754380 687661886 686330736 685054004 684174955 683417797 682161093 680243373
1215.6F80243373k161503k048612k095162k398730k501130k152622j708984j565218
$$ 680243373 678081870 676033258 673938096 671539366 669038236 666885614 665176630 663611412
1231.9F63611412j551866j236320o89209l65734l34382k34365J53959N47230N83351
$$ 663611412 662059546 660823226 660134017 659768283 659433901 659199536 659353495 659900725 660484076
1250.3F60484076L85165L52561N40376O63102O19113O20008Q15391J051068J088620
$$ 660484076 660869241 661221802 661762178 662425280 663044393 663664401 664479792 665530860 666619480
1268.6F66619480R29832Q29756Q29041P05779L84450P1943M232J25229J16229j87218
$$ 666619480 667549312 668379068 669208109 669913888 670298338 670370281 670374513 670499742 670615971 670428753
1289F70428753n62728q25285j059115j404405j825392k176762k354383k440870k605140
$$ 670428753 669866025 669040740 667981625 666577220 664751828 662575066 660220683 657779813 655174673
1307.4F55174673k767206k753973k524614k242804k026379j713931j326561j156867
$$ 655174673 652407467 649653494 647128880 644886076 642859697 641145766 639819205 638662338
1323.7F38662338j226246j367211j427710j360894j264572j217663j123309p46191
$$ 638662338 637436092 636068881 634641171 633280277 632015705 630798042 629674733 628928542
1340F28928542l38077k75553l92913m77553m85897m50432m54247n42701p71701j095354
$$ 628928542 628590465 628314912 627921999 627444446 626958549 626508117 626053870 625511169 624739468 623644114
1360.4F23644114j170397j053214j292229j707673j910210k183854k450824k709091
$$ 623644114 622473717 621420503 620128274 618420601 616510391 614326537 611875713 609166622
1376.7F09166622m505038q768678j0623574l728092O801367R149194M383147R57846
$$ 609166622 604661584 595892906 585269332 581541240 588342607 597491801 601874948 602832794
1393.1F02832794k92718n53906m48108l15905l64244k17735J25527K43366K74420K79545
$$ 602832794 602540076 601986170 601538062 601222157 600857913 600640178 600765705 601009071 601283491 601563036
1413.5F01563036J86801M66943J520038J943290J881659K090693K041518J943946J714349
$$ 601563036 601749837 602216780 603736818 605680108 607561767 609652460 611693978 613637924 615352273
1431.8F15352273J166999J308978K053559J767874J194775Q80241P25150Q46028R19641
$$ 615352273 616519272 617828250 619881809 621649683 622844458 623724699 624449849 625295877 626215518
1450.2F26215518N78522K08914R16303K967179L006875K098441K417803L244698L095269
$$ 626215518 626794040 627002954 627919257 630886436 633893311 635991752 638409555 641654253 644749522
1468.5F44749522L148496M878939O207943N521178M365027L395319K632856J549840
$$ 644749522 647898018 652776957 658984900 664506078 668871105 672266424 674899280 676449120
1484.9F76449120L53575l96013n62072j046241k221167l251910l183246k909898l220558
$$ 676449120 676802695 676406682 675844610 674798369 672577202 669325292 666142046 663232148 660011590
1503.2F60011590m292191m710376k411544j598001k145886k446354j956999j126706
$$ 660011590 655719399 651009023 648597479 646999478 644853592 642407238 640450239 639323533
1519.5F39323533n50628l55840o65903q59916r74119j399815j538396j334190j695454
$$ 639323533 638772905 638417065 637751162 636891246 635917127 634517312 632978916 631644726 629949272
1537.9F29949272j888454o09994L14951L84927K43902L01122M36128K47538k01464
$$ 629949272 628060818 627450824 627765775 628150702 628394604 628695726 629131854 629379392 629177928
1556.2F29177928L52800K297103J486123K70128k55048o40571p24018j007676j789987
$$ 629177928 629530728 631827831 633313954 633584082 633329034 632688463 631964445 630956769 629166782
1574.6F29166782k274811k046585k344907l037691l395975l589928l813445l953517
$$ 629166782 626891971 624845386 622500479 619462788 616066813 612476885 608663440 604709923
1590.9F04709923l821492l506422l166437k999067k931178k786160k670586k707362
$$ 604709923 600888431 597382009 594215572 591216505 588285327 585499167 582828581 580121219
1607.2E80121219k753556k666473k729952l058732l065705k451182k514004k832890
$$ 580121219 577367663 574701190 571971238 568912506 565846801 563395619 560881615 558048725
1623.5E58048725k653420k581775k474070k212524k214670j904726p20680k68400m08172
$$ 558048725 555395305 552813530 550339460 548126936 545912266 544007540 543286860 543018460 542610288
1641.9E42610288o65784n53251K50638K03311J789J467943J895964J253128J274288
$$ 542610288 541944504 541391253 541641891 541845202 541846991 543314934 545210898 546464026 547738314
1660.3E47738314J975059K572656K156019K399385L624678L626108L860235M647911
$$ 547738314 549713373 552286029 554442048 556841433 560466111 564092219 567952454 572600365
1676.6E72600365M114031L304184L808856O477058O568253N246162N310953M685402
$$ 572600365 576714396 580018580 583827436 590304494 596872747 602118909 607429862 612115264
1692.9F12115264M968107N865693O140649P472098O041110M800200N085170M167736
$$ 612115264 617083371 622949064 629089713 636561811 642602921 647403121 652488291 656656027
1709.2F56656027K914131J967847J577020K358734K781630J873433J315415J165927
$$ 656656027 659570158 661538005 663115025 665473759 668255389 670128822 671444237 672610164
1725.5F72610164P41005K80082P4208Q71479J800299J306891J370013K037525K286792
$$ 672610164 673351169 673631251 673705459 674576938 676377237 677684128 679054141 681091666 683378458
1743.9F83378458K288818K501309L607393M637599M097581L718972L854632L666878
$$ 683378458 685667276 688168585 691775978 696413577 700511158 704230130 708084762 711751640
1760.2G11751640L985464L877998L153205K833605K850353L449977L500461K580107
$$ 711751640 715737104 719615102 722768307 725601912 728452265 731902242 735402703 737982810
1776.5G37982810K088010K109885K031148J819372J625836J212239J037896J585662
$$ 737982810 740070820 742180705 744211853 746031225 747657061 748869300 749907196 751492858
1792.8G51492858J734078J311242J167417J368463J457632J250684J067996J019597
$$ 751492858 753226936 754538178 755705595 757074058 758531690 759782374 760850370 761869967
1809.2G61869967J080871J050770R78708J031995R91166O46114M32909O59167P46548
$$ 761869967 762950838 764001608 764980316 766012311 767003477 767649591 768082500 768741667 769488215
1827.5G69488215Q23319J093805R91047Q15272P96139M95553P9453L72291J075864
$$ 769488215 770311534 771405339 772396386 773211658 774007797 774503350 774582803 774955094 776030958
1845.9G76030958J030683O93143N67913O16073O33776M80593L88205M26829L34262
$$ 776030958 777061641 777754784 778322697 778938770 779572546 780053139 780441344 780868173 781202435
1864.2G81202435N2512J72854P62581R12786O82354M55439L06606K95282L86953M01735
$$ 781202435 781254947 781427801 782190382 783103168 783785522 784240961 784547567 784842849 785229802 785631537
1884.6G85631537K04266J16705L92557N47766M20392K97367K53797L37780M14252K83062
$$ 785631537 785835803 785952508 786345065 786892831 787313223 787610590 787864387 788202167 788616419 788899481
1905G88899481Q9288J75893M43220L93928L3557m6551K53796L56257L14951K72274
$$ 788899481 788988769 789164662 789607882 790001810 790035367 789988816 790242612 790598869 790913820 791186094
1925.4G91186094K02418K50756K70069J29819K4259P3969O9142L0637J06632J73867
$$ 791186094 791388512 791639268 791909337 792039156 792063415 792137384 792206526 792237163 792343795 792517662
1945.8G92517662K31028K56598J18434l7789K4914J82868J81138K3067r5904o974K13325
$$ 792517662 792748690 793005288 793123722 793085933 793110847 793293715 793474853 793497920 793402016 793395042 793608367
1968.3G93608367K27333M0531k4557Q6844J42335J0252q5055p987Q1479N722j25289
$$ 793608367 793835700 793876231 793851674 793938518 794080853 794091105 794006050 793998063 794079542 794085264 793959975
1990.7G93959975l7431J58250J87397O1691o5983q7619q583J5676q4936j58131j14620
$$ 793959975 793922544 794080794 794268191 794329882 794263899 794176280 794167697 794183373 794098437 793940306 793825686
2013.1G93825686n5313l6240o9260j24634j00195n0187o5029j23620j31130o6042k8133
$$ 793825686 793770373 793734133 793664873 793540239 793440044 793389857 793324828 793201208 793070078 793004036 792975903
2035.6G92975903j10805k14398j20998N5909M5061q7678j12832k9265L4451n066j03712
$$ 792975903 792865098 792650700 792529702 792585611 792630672 792542994 792430162 792400897 792435348 792430282 792326570
2058G92326570j27137o8963m589m769n2035k0027Q8990N9187j06394j17838M9174J28030
$$ 792326570 792199433 792130470 792125881 792121112 792069077 792049050 792138040 792197227 792090833 791972995 792022169 792150199
2082.5G92150199K2054j05917q6129N0962J00374R775m1246O6757J82033J12533n6803
$$ 792150199 792172253 792066336 791980207 792031169 792131543 792141318 792100072 792166829 792348862 792461395 792404592
2104.9G92404592p1585Q6844J46985J6451q2314J8179J77205J68741R119o5446N3823
$$ 792404592 792333007 792419851 792566836 792583287 792500973 792519152 792696357 792865098 792874217 792808771 792862594
2127.3G92862594J59800P2241o4611j3173J56283J90497N3048l4332P4446K09033J43648
$$ 792862594 793022394 793094635 793030024 793016851 793173134 793363631 793416679 793382347 793456793 793665826 793809474
2149.8G93809474l3379l6299J57177K68936J70887M8697P2360J79171J83583P6115
$$ 793809474 793776095 793739796 793896973 794165909 794336796 794385493 794457853 794637024 794820607 794896722
2170.2G94896722N5313J84953K82526J86801L0041L1531J77681K51055J39654K2232
$$ 794896722 794952035 795136988 795419514 795606315 795636356 795667887 795845568 796096623 796236277 796258509
2190.6G96258509P2360K04742K25485R3519Q524J28209K34902J15991l6001P15J28627
$$ 796258509 796330869 796535611 796761096 796854615 796863139 796991348 797226250 797342241 797306240 797306955 797435582
2213G97435582J50025O4909J2398Q0406J65642J18911j0014l7312Q0466J46330M8399
$$ 797435582 797585607 797650516 797662914 797743320 797908962 798027873 798017859 797980547 798061013 798207343 798255742
2235.4G98255742o9321m0292P7307R3877p987n7459K6584R4354J7524r5666p0571L2186
$$ 798255742 798186421 798146129 798223436 798317313 798309326 798251867 798278451 798372805 798390329 798294663 798224092 798256278
2259.9G98256278L6240m5777p2360M173Q0883M4465n1558o6042J1623N2333m1366j63376
$$ 798256278 798292518 798246741 798174381 798178554 798259437 798303902 798252344 798186302 798197925 798250258 798208892 798045516
2284.4G98045516j71781j32739j78039k77877k92122k20836k16961l17931m27246m93109
$$ 798045516 797873735 797740996 797562957 797285080 796992958 796772122 796555161 796237230 795809984 795316875
2304.8G95316875n16355n22196n09620m46260m33147o28889q76724q34465n66900m44055
$$ 795316875 794800520 794278324 793768704 793322444 792889297 792260408 791383684 790549219 789982319 789538264
2325.2G89538264n45621n87523m26590l38554m20571m48823l88920j99378L84748R71437
$$ 789538264 788992643 788405120 787978530 787639976 787219405 786770582 786381662 786182284 786567032 787538469
2345.6G87538469L97265q58844j640856j704573j383007r56059n07712o5088M52041
$$ 787538469 787935734 787076890 785436034 783731461 782348454 781392395 780884683 780819595 781271636
2363.9G81271636Q72612R32396Q51572Q92281R10401Q23200P43985O62268M64916J87218
$$ 781271636 782144248 783076644 783928216 784820497 785730898 786554098 787298083 787960351 788425267 788612485
2384.3G88612485n9486k33232l26694l62515m05014m16517l46839k60055k03133k02179
$$ 788612485 788552999 788319767 787993073 787630558 787225544 786809027 786462188 786202133 785999000 785796821
2404.7G85796821k37286k64287k90394l20077l44217l58998l84987m35829m88937n03421
$$ 785796821 785559535 785295248 785004854 784684777 784340560 783981562 783596575 783160746 782671809 782168388
2425.1G82168388m21524k70784j81496j90794k44737l10600l50415l40224l32892l73602
$$ 782168388 781746864 781476080 781294584 781103790 780859053 780548453 780198038 779857814 779524922 779151320
2445.5G79151320m00483l76940l73125l98219l85403l51668l51548l93629m30942m27186
$$ 779151320 778750837 778373897 778000772 777602553 777217150 776865482 776513934 776120305 775689363 775262177
2465.9G75262177m12464m04596m26174m87625n11229m52459m11391m45605m59909m26412
$$ 775262177 774849713 774445117 774018943 773531318 773020089 772567630 772156239 771710634 771250725 770824313
2486.3G70824313m38630n05209m99666l97384l44098l84450m36902m59433m45902m10616
$$ 770824313 770385683 769880474 769380808 768983424 768639326 768254876 767817974 767358541 766912639 766502023
2506.7G66502023l86715l93212m15683m19557l92258l74436l86775l79324l78489m32432
$$ 766502023 766115308 765722096 765306413 764886856 764494598 764120162 763733387 763354063 762975574 762543142
2527.1G62543142m46797l72946l37958l87490m14312m11451m06444l92794l95596l93928
$$ 762543142 762096345 761723399 761385441 760997951 760583639 760172188 759765744 759372950 758977354 758583426
2547.5G58583426m00185m35412m50492m33922m36783m57048m61698m38928l91662l99053
$$ 758583426 758183241 757747829 757297337 756863415 756426632 755969584 755507886 755068958 754677296 754278243
2567.9G54278243m62652m71532m37498m33326m38630m45009m66466m78327m96745n32150
$$ 754278243 753815591 753344059 752906561 752473235 752034605 751589596 751123130 750644803 750148058 749615908
2588.3G49615908n33998m90606m49181m55320n13732n52774n09440m52757m65095n31614
$$ 749615908 749081910 748591304 748142123 747686803 747173071 746620297 746110857 745658100 745193005 744661391
2608.7G44661391n58436n10097m82201n26488n67854n31971m64380m66287n27918n65529
$$ 744661391 744102955 743592858 743110657 742584169 742016315 741484344 741019964 740553677 740025759 739460230
2629.1G39460230n47230n18918n47052o03735o01650n43654n18083n63264n99504n52237
$$ 739460230 738913000 738394082 737847030 737243295 736641645 736097991 735579908 735016644 734417140 733864903
2649.5G33864903n04612n54622o19292n82695n01692n02825n76615o11484n63026n03838
$$ 733864903 733360291 732805669 732186377 731603682 731101990 730599165 730022550 729411066 728848040 728344202
2669.9G28344202n14805n91398o33180n83172n24938n56647o37413o16788n16236n02229
$$ 728344202 727829397 727237999 726604819 726021647 725496709 724940062 724302649 723685861 723169625 722667396
2690.3G22667396o03080o83129o25193n36322n65410o52492o71089o16789n95212o67870
$$ 722667396 722064316 721381187 720755994 720219672 719654262 719001770 718330681 717713892 717118680 716450810
2710.7G16450810p44104p21395o35266n96047o43313o63697o00338n78225o33597o63996
$$ 716450810 715706706 714985311 714350045 713753998 713110685 712446988 711846650 711268425 710634828 709970832
2731.1G09970832o03855n01394m86851n65469o05226n48184m51624m67420n81264n86391
$$ 709970832 709366977 708865583 708378732 707813263 707208037 706659853 706208229 705740809 705159545 704573154
2751.4G04573154m98950m87149n61178n99324n50151m92036n09441n77927n84781n23925
$$ 704573154 704074204 703587055 703025877 702426553 701876402 701384366 700874925 700296998 699712217 699188292
2771.8F99188292n23806o51061p39813o67155o03735o57737p15137o92904o73532p19369
$$ 699188292 698664486 698013425 697273612 696606457 696002722 695344985 694629848 693936944 693263412 692544043
2792.2F92544043p82609q17060q12769q09610q33512q87095r19760r02235r24766r84431
$$ 692544043 691761434 690944374 690131605 689321995 688488483 687601388 686681628 685779393 684854627 683870196
2812.6F83870196j030624j066029j044154j046300j173317j294017j296043j287878
$$ 683870196 682839572 681773543 680729389 679683089 678509772 677215755 675919712 674631834
2828.9F74631834j386642j544178j667261j752079j947999k348125k825737l259241
$$ 674631834 673245192 671701014 670033753 668281674 666333675 663985550 661159813 657900572
2845.3F57900572l472448l163218k261996j188934m50671j59919k19047m79818p67171
$$ 657900572 654428124 651264906 649002910 647813976 647363305 647203386 646984339 646504521 645737350
2863.6F45737350j032114j272380j370669j205087r34422p74145o77287o16968o36160
$$ 645737350 644705236 643432856 642062187 640857100 639922678 639148533 638471246 637854278 637218118
2882F37218118p01368p89166q88347r76444j001656r91106j086592j253486j295090
$$ 637218118 636516750 635727584 634839237 633862793 632861137 631870031 630783439 629529953 628234863
2900.3F28234863j244068j309156j531184j805305k106369k462626k788841k853334
$$ 628234863 626990795 625681639 624150455 622345150 620238781 617776155 614987314 612133980
2916.6F12133980k456308j743555j074314o05106k04086J88529M39942O31213Q74341
$$ 612133980 609677672 607934117 606859803 606254697 606050611 606239140 606679082 607310295 608184636
2935F08184636J108884J335443J542806J580119J352012J017213P66754N69344L30448
$$ 608184636 609293520 610628963 612171769 613751888 615103900 616121113 616887867 617457211 617787659
2953.4F17787659J72913K56300N18024Q04305J031816J241803J443506J572430J672745
$$ 617787659 617960572 618216872 618734896 619539201 620571017 621812820 623256326 624828756 626501501
2971.7F26501501J746475J697839J585841J462281J281917J119971J043439R99451
$$ 626501501 628247976 629945815 631531656 632993937 634275854 635395825 636439264 637438715
2988F37438715R18388P24733M46915K31743N2989j42038k64287l18289l70979m10915
$$ 637438715 638357103 639081836 639528751 639760494 639813483 639671445 639407158 639088869 638717890 638306975
3008.4F38306975m05907m37737n54621o57082p10308p63953p96437q22902q66532q38340
$$ 638306975 637901068 637463331 636908710 636251628 635541320 634777367 633980930 633158028 632291496 631453156
3028.8F31453156p77125p71165q34167r31263r04798p96914q49784j022815j058937
$$ 631453156 630676031 629904866 629070699 628139436 627234638 626437724 625587940 624565125 623506188
3047.2F23506188r52899r25601r85741r78530r40382r22382q69036q03947p33078p05540
$$ 623506188 622553289 621627688 620641947 619663417 618723035 617800653 616931617 616127670 615394592 614689052
3067.6F14689052p93576q45015p59244o31273n62787o03735o73831p15733p67052p43746
$$ 614689052 613895476 613050461 612291217 611659944 611097157 610493422 609819591 609103858 608336806 607593060
3088F07593060o80686p46428q13961p37787o46949o73949p92265q47221p86602p59423
$$ 607593060 606912374 606165946 605351985 604614198 603967249 603293300 602501035 601653814 600867212 600107789
3108.4F00107789q39353q64028p76053p49052q67426j046836j149774j109838r84908
$$ 600107789 599268436 598404408 597628355 596879303 596011877 594965041 593815267 592705429 591720521
3126.7E91720521r27269j032829j161039j127780r98795j004576j161516j248300j195073
$$ 591720521 590793252 589760423 588599384 587471604 586472809 585468233 584306717 583058417 581863344
3145.1E81863344j117051j078367j088619j178146j299023j327336j302660j296818
$$ 581863344 580746293 579667926 578579307 577401161 576102138 574774802 573472142 572175324
3161.4E72175324j247287j202762j243055j284957j262069j217901j202286j204729
$$ 572175324 570928037 569725275 568482220 567197263 565935194 564717293 563515007 562310278
3177.7E62310278j225590j286388j292407j196027j129985j152515j200497j228214
$$ 562310278 561084688 559798300 558505893 557309866 556179881 555027366 553826869 552598655
3194E52598655j196563j123548j092493j082778j049638j084328j144111j074075r57191
$$ 552598655 551402092 550278544 549186051 548103273 547053635 545969307 544825196 543751121 542793930
3212.4E42793930r51767j044751j088798j020014r66370j015425j051247r68754q55744
$$ 542793930 541842163 540797412 539708614 538688600 537722230 536706805 535655558 534686804 533831060
3230.7E33831060q56102j019597j155555j111090j028895r89438r46342r54330j048089
$$ 533831060 532974958 531955361 530799806 529688716 528659821 527670383 526724041 525769711 524721622
3249.1E24721622j122236j120329j071632j029312j032412j067221j075745j040518
$$ 524721622 523599386 522479057 521407425 520378113 519345701 518278480 517202735 516162217
3265.4E16162217r79185r07720r32097j027226j046420r74059q83460q57293q61526
$$ 516162217 515183032 514275312 513343215 512315989 511269569 510295510 509412050 508554757 507693231
3283.8E07693231p95305o91354o29187o23703o72340p19190p31110o95288o00875n37455
$$ 507693231 506897926 506206572 505577385 504953682 504281342 503562152 502831042 502135754 501534879 500997424
3304.2E00997424n60462o78659q26686q41737p48039p18772p83831q34644q22425q16643
$$ 500997424 500436962 499758303 498931617 498089880 497341841 496623069 495839238 495004594 494182169 493365526
3324.6D93365526q83490r49800r43720r09656q47936q00461q50945q98749q74370q93623
$$ 493365526 492482036 491532236 490588516 489678860 488830924 488030463 487179518 486280769 485406399 484512776
3345D84512776q91685p90358q08060r56506j001447r14782q41588q29399p58081o02991
$$ 484512776 483621091 482830733 482022673 481066167 480064720 479149938 478308350 477478951 476720870 476117879
3365.4D76117879n67317p43538r37134r27866p65502o69777o99580p52896p14600n94616
$$ 476117879 475550562 474807024 473869890 472942024 472176522 471506745 470807165 470054269 469339669 468745053
3385.7D68745053m51327l23444l89338o29008o47693l82543k52187m34160o17296n22822
$$ 468745053 468293726 467970282 467580944 466951936 466304243 465921700 465669513 465235353 464618057 464095235
3406.1D64095235l36588k62886k73049l45826l61830k44737j40786o6429J9640R7036
$$ 464095235 463758647 463495761 463222712 462876886 462515056 462270319 462129533 462063104 462082744 462179780
3426.5D62179780J86712K06351K46942L44276K44260J6481J132J80483L73155N61208
$$ 462179780 462366492 462572843 462819785 463164061 463408321 463424802 463425934 463606417 463979572 464540780
3446.9D64540780O23613N77748N59717N88507P04586Q15452P68244P66009R85145J098931
$$ 464540780 465164393 465742141 466301858 466890365 467594951 468410403 469178647 469944656 470929801 472028732
3467.3D72028732Q57801O08116P11173R33319J030564J011998R31978R48429J070559
$$ 472028732 472886533 473494649 474205822 475139141 476169705 477181703 478113681 479062110 480132669
3485.7D80132669J109362J064837J095444J229316J333445J209647J063317J184016
$$ 480132669 481242031 482306868 483402312 484631628 485965073 487174720 488238037 489422053
3502D89422053J252145J097262J152634J443535J566947J410365J262814J252651J296222
$$ 489422053 490674198 491771460 492924094 494367629 495934576 497344941 498607755 499860406 501156628
3520.4E01156628J510799J599133J413584J460254J680911J712143J716375J755178
$$ 501156628 502667427 504266560 505680144 507140398 508821309 510533452 512249827 514005005
3536.7E14005005J683414J641453J718223J896977J923680J697302J748562K051473
$$ 514005005 515688419 517329872 519048095 520945072 522868752 524566054 526314616 528366089
3553E28366089K040923J877486J945973J943349J550913J725316L003300L267288K307653
$$ 528366089 530407012 532284498 534230471 536173820 537724733 539450049 542453349 545720637 548028290
3571.3E48028290J991928K258062K475083K591133K436996J983106K150357L219425
$$ 548028290 550020218 552278280 554753363 557344496 559781492 561764598 563914955 567134380
3587.7E67134380L265083K342999K374351K878189K921939K944946K907992K355695
$$ 567134380 570399463 572742462 575116813 577995002 580916941 583861887 586769879 589125574
3604E89125574K156198K866089L157556K928555K817273K528668L233909M171849L046035
$$ 589125574 591281772 594147861 597305417 600233972 603051245 605579913 608813822 612985671 616031706
3622.3F16031706J423657J387716L884315N061925L186166K662659K779781K671302
$$ 616031706 617455363 618843079 622727394 627789319 630975485 633638144 636417925 639089227
3638.7F39089227K633333K041936J141727J614451M266322N002677K457202J964807
$$ 639089227 641722560 643764496 644906223 646520674 650786996 655789673 658246875 660211682
3655F60211682L250718K894640J990617J718521J076698O85156J893818K251089J178801
$$ 660211682 663462400 666357040 668347657 670066178 671142876 671828032 673721850 675972939 677151740
3673.3F77151740K695977L408909J720548J095235O21021J77979J084209K563894K131104
$$ 677151740 679847717 683256626 684977174 686072409 686693430 686871409 687955618 690519512 692650616
3691.7F92650616J027525O11424L56078N39363J361012J150608m9114l87549P75218
$$ 692650616 693678141 694289565 694645643 695185006 696546018 697696626 697647512 697259963 698035181
3710F98035181K303302J509607R477k56896Q3983L55482N45502O04689j34409q06868
$$ 698035181 700338483 701848090 701857567 701600671 701684654 702040136 702585638 703190327 703055918 702249050
3730.4G02249050k11000J354456K184629O26564j327872o91474J583815O37889l31581
$$ 702249050 702038050 703392506 705577135 706203699 704875827 704184353 705768168 706406057 706074476
3748.8G06074476J813591K120495J40965k42114P49528P87139r3699j22606K71082
$$ 706074476 707888067 710008562 710149527 709907413 710656941 711444080 711350381 711227775 711498857
3767.1G11498857Q38100J046420K11000m09067n7935O97612N04017O5744L88146M55022
$$ 711498857 712336957 713383377 713594377 713185310 713127375 713824987 714329004 714394748 714782894 715237916
3787.5G15237916J23858k27332m45783k83659m73022j77026J103103N86331L34561
$$ 715237916 715361774 715134442 714688659 714405000 713931978 713754952 714858055 715444386 715778947
3805.9G15778947J138925J07289j160145p92801K73764j22726L05891J556277M51386
$$ 715778947 716917872 717025161 715865016 715072215 715345979 715223253 715529144 717085421 717536807
3824.3G17536807k80201k68758l69727k83540l89754N2571R16779P79808N59568M17948
$$ 717536807 717256606 716987848 716618121 716334581 715944827 715997398 716914177 717693985 718253553 718671501
3844.6G18671501o13511j911163j860261J399874L479362L66986j224220q79824L6239
$$ 718671501 718057990 716146827 714286566 715686440 719165802 719532788 718308568 717428744 717464983
3863G17464983L19660m49419K0921Q84235N61238J10983o22034l60488K98142J05083
$$ 717464983 717784643 717335224 717356145 718240380 718801618 718912601 718290567 717930079 718228221 718333304
3883.4G18333304N54264J44720m91441M21346L00169r58503j037657k16186N86569
$$ 718333304 718887568 719032288 718540847 718962193 719262362 718303859 717266202 717050016 717636585
3901.8G17636585J203597R21130k3723l62336m13537n79357j80483M35888K29836j95921
$$ 717636585 718840182 719761312 719737589 719375253 718961716 718382359 718201876 718637764 718867600 718671679
3922.1G18671679j6808M4227l00289p5519N13018L80456j64211m35293l03685Q4400
$$ 718671679 718654871 718699098 718398809 718323290 718836308 719216764 719052553 718617260 718313575 718397975
3942.5G18397975L7730j73688Q3267K03252N484q2493q0109n7876O2585R2566r5188
$$ 718397975 718435705 718262017 718345284 718548536 718554020 718471527 718391418 718333542 718396127 718488693 718393505
3965G18393505j77741r0242l9518J4961Q9765P1585M172Q643K0861r4294k01643j41263
$$ 718393505 718215764 718125522 718086004 718100965 718190730 718262315 718266487 718275130 718295991 718201697 718000054 717858791
3989.5G17858791n3405M17P6890O9141
$$ 717858791 717805386 717805803 717882693 717951834
3997.6G17951834
$$ 717951834
##END=$$ End of the data block
