##TITLE=$$ Begin of the data block
##JCAMP-DX=5.00 $$ ACD/SpecManager v 10.08
##SPECTROMETER/DATA SYSTEM=Alpha
##DATE=10 Nov 2014 10:35:34
##DATA TYPE=INFRARED SPECTRUM
##DATA CLASS=XYDATA
##ORIGIN=
##OWNER=
##NPOINTS=1765
##FIRSTX=399.76428223
##LASTX=3997.64306641
##MAXX=3997.64306641
##MINX=399.76428223
##MAXY=0.79983854
##MINY=0.45713094
##XFACTOR=1.0000000000
##YFACTOR=1.000000000000000e-9
##FIRSTY=0.67207676
##DELTAX=2.03961372
##XUNITS=1/CM
##YUNITS=ARBITRARY UNITS
##XYDATA=(X++(Y..Y))
$$ plain form
399.8 672076762 672171414 672529697 672811866 671899557 669857562 668319106 668111563 667837024 665989697
418.1 665989697 664254963 664134085 664172113 663472414 661933005 661007762 661797643 662868440 662720203
436.5 662720203 661658883 661043167 661588907 661901295 660883725 660191238 660699129 660760939 659263432
454.8 659263432 657344937 656830609 657308817 656857908 655260921 654232204 654430807 654324353 653021872
473.2 653021872 651913345 652245343 652984023 652358234 650815904 650296271 650941312 651069045 649838567
491.5 649838567 648433626 648219824 648582637 647923112 646150947 644867063 644633353 644047141 642221451
509.9 642221451 640299559 639346421 638718367 637360632 635520279 634422481 634287417 633983016 632628322
528.3 632628322 630998194 630480349 630834639 630722761 630371571 631078184 632848978 634385586 634750128
$$ packed form
399.8F72076762R4652L58283K82169r12309k041995j538456k07543k74539j847327
418.1F65989697j734734j20878L8028o99699j539409r25243P89881J070797j48237
436.5F62720203j061320o15716N45740L12388j017570o92487N07891O1810j497507
454.8F59263432j918495n14328M78208m50909j596987j028717J98603j06454j302481
473.2F53021872j108527L31998P38680o25789j542330n19633O45041J27733j230478
491.5F49838567j404941k13802L62813o59525j772165j283884k33710n86212j825690
509.9F42221451j921892r53138o28054j357735j840353j097798j35064l04401j354694
528.3F32628322j630128n17845L54290j11878l51190P06613J770794J536608L64542
$$ plain form
546.6 634750128 634528577 634850264 635483325 635482728 634906530 634582639 634939075 635408640 635208786 634609818
567 634609818 634408176 634598970 634492815 633894384 633612216 634157836 634849608 635072649 635009885 635174274
587.4 635174274 635778964 636161208 635648906 635008216 635107160 635421097 635259211 634681523 634118557 633796155
607.8 633796155 633321285 632133245 630375206 629114389 629355192 630736291 632302582 634038270 636315227
626.2 636315227 638790071 640575230 641392410 641987145 642997265 644123912 644877374 645464718 646533728
644.5 646533728 648091495 649442792 650232255 650826097 651766896 652818441 653239489 653084457 653093040 653269053
664.9 653269053 653077185 653373718 654841244 656680465 658769071 660542846 661584377 662570059 664212883
683.3 664212883 666004717 666923463 667081952 667596996 668808043 669677436 669475019 669221103 670178831
$$ packed form
546.6F34750128k21551L21687O33061n97n76198l23891L56436M69565j99854n98968
567F34609818k01642J90794j06155n98431k82168N45620O91772K23041o2764J64389
587.4F35174274O04690L82244n12302o40690R8944L13937j61886n77688n62966l22402
607.8F33796155m74870j188040j758039j260817K40803J381099J566291J735688K276957
626.2F36315227K474844J785159Q17180N94735J010120J126647P53462N87344J069010
644.5F46533728J557767J351297P89463N93842R40799J051545M21048j55032Q583J76013
664.9F53269053j91868K96533J467526J839221K088606J773775J041531R85682J642824
683.3F64212883J791834R18746J58489N15044J211047Q69393k02417k53916R57728
$$ plain form
701.6 670178831 671887279 673083127 673670590 674682558 676601350 678479195 679407835 680126905 681988478
720 681988478 684862614 687248349 688626647 690086722 692398667 694660127 695681930 695950747 696938396
738.3 696938396 698734164 699893236 699932098 700086415 701220334 702409148 702358067 701498151 701378942
756.7 701378942 702269316 702829540 702354670 702040792 703135133 704873919 705719888 705770433 706524074 708469927
777.1 708469927 710373044 711315870 712126374 714001715 716544926 718302906 718927979 719750702 721614361
795.4 721614361 723425329 723918855 723673046 724077404 725085974 725538433 725213110 725305080 726507127
813.8 726507127 727754653 727743328 726584554 725214362 724149168 723399043 723018646 723415732 724975586
832.2 724975586 727300406 729370236 730874836 732508898 734473348 735793591 735740423 735038936 734835386
$$ packed form
701.6F70178831J708448J195848N87463J011968J918792J877845R28640P19070J861573
720F81988478K874136K385735J378298J460075K311945K261460J021803K68817R87649
738.3F96938396J795768J159072L8862J54317J133919J188814n1081q59916j19209
756.7G01378942Q90374N60224m74870l13878J094341J738786Q45969N0545P53641J945853
777.1G08469927J903117R42826Q10504J875341K543211J757980O25073Q22723J863659
795.4G21614361J810968M93526k45809M04358J008570M52459l25323R1970J202047
813.8G26507127J247526j1325j158774j370192j065194p50125l80397L97086J559854
832.2G24975586K324820K069830J504600J634062J964450J320243n3168p01487k03550
$$ plain form
850.5 734835386 735138834 735251069 735138774 735497236 736575067 737582088 737770081 737453222 737422168 737681270
870.9 737681270 737401426 736241221 734831274 733753860 732629418 730704963 728120923 725809693 724239767
889.3 724239767 722938418 721428812 720141828 719801009 720239282 720563173 720315993 719824910 719360888
907.6 719360888 718587458 717133701 715291500 713707268 712564290 711516142 710320652 709207296 708486378
926 708486378 707985342 707114816 705503821 703404367 701168180 698656440 695477843 691594124 687543213
944.3 687543213 683806777 680256486 676659644 673265278 670515299 668353498 666189790 663658082
960.7 663658082 661002040 658575773 656145871 653041780 649072766 644678175 640119374 635056496
977 635056496 629153132 622802258 616821289 611545563 606648088 601940870 597861052 594714880 591971576
$$ packed form
850.5G34835386L03448J12235j12295L58462J077831J007021J87993l16859l1054K59102
870.9G37681270k79844j160205j409947j077414j124442j924455k584040k311230j569926
889.3G24239767j301349j509606j286984l40819M38273L23891k47180m91083m64022
907.6G19360888p73430j453757j842201j584232j142978j048148j195490j113356p20918
926G08486378n01036q70526j610995k099454k236187k511740l178597l883719m050911
944.3F87543213l736436l550291l596842l394366k749979k161801k163708k531708
960.7F63658082k656042k426267k429902l104091l969014m394591m558801n062878
977F35056496n903364o350874n980969n275726m897475m707218m079818l146172k743304
$$ plain form
995.3 591971576 588872313 585319877 581805527 578613222 575421512 571901798 568382084 565477312 563233256
1013.7 563233256 561153054 559079766 557466567 556659400 556339085 555968225 555562258 555579185 556134105
1032 556134105 556777477 557135582 557363570 557709992 557923853 557586014 556863785 556417584 556556344 556888402
1052.4 556888402 556993127 557035029 557465494 558315575 559065700 559334874 559311450 559247196 559030473 558471859
1072.8 558471859 557913125 558202446 559715033 561895311 564007580 565953255 567964852 569791138 570822597
1091.2 570822597 570914626 570581734 570315421 570039272 569489598 568985403 569228232 570396602 572005391
1109.6 572005391 573673189 575637221 578238368 581143439 583617985 585510254 587406874 589712024
1125.9 589712024 592164993 594460845 596664608 598914087 600958109 602192700 602422893 602234602 602333784
$$ packed form
995.3E91971576l099263l552436l514350l192305l191710l519714Tk904772k244056
1013.7E63233256k080202k073288j613199q07167l20315l70860m05967J6927N54920
1032E56134105O43372L58105K27988L46422K13861l37839p22229m46201J38760L32058
1052.4E56888402J04725M1902M30465Q50081P50125K69174k3424o4254k16723n58614
1072.8E58471859n58734K89321J512587K180278K112269J945675K011597J826286J031459
1091.2E70822597R2029l32892k66313k76149n49674n04195K42829J168370J608789
1109.6E72005391J667798J964032K601147K905071K474546J892269J896620K305150
1125.9E89712024K452969K295852K203763K249479K044022J234591K30193j88291R9182
$$ plain form
1144.2 602333784 602791369 603294909 603943646 605214357 607261956 609729230 612307549 615273118 619167566
1162.6 619167566 624075294 629604578 635494232 641914248 648995280 656234741 662874520 668820381
1178.9 668820381 674466491 679773331 684180200 687385559 689708531 691482425 692476451 692286193 691135943
1197.3 691135943 689792037 688658118 687496185 686132789 684874952 684016347 683241606 681944907 679994404
1215.6 679994404 677823007 675769150 673642993 671240509 668816328 666747749 665064037 663506448
1231.9 663506448 661980927 660767674 660093606 659747362 659428298 659211457 659376800 659912348 660492897
1250.3 660492897 660893023 661231339 661732256 662388742 663040221 663687885 664499462 665514708 666567683
1268.6 666567683 667496562 668333828 669142723 669831097 670231521 670315921 670304179 670391738 670475006 670281947
$$ packed form
1144.2F02333784M57585N03540O48737J270711K047599K467274K578319K965569L894448
1162.6F19167566M907728N529284N889654O420016P081032P239461O639779N945861
1178.9F68820381N646110N306840M406869L205359K322972J773894R94026j90258j150250
1197.3F91135943j343906j133919j161933j363396j257837q58605p74741j296699j950503
1215.6F79994404k171397k053857k126157k402484k424181k068579j683712j557589
1231.9F63506448j525521j213253o74068l46244l19064k16841J65343N35548N80549
1250.3F60492897M00126L38316N00917O56486O51479O47664Q11577J015246J052975
1268.6F66567683R28879Q37266Q08895O88374M00424Q4400j1742Q7559Q3268j93059
$$ plain form
1289 670281947 669695795 668827713 667755663 666335285 664459586 662235379 659856915 657413960 654840291
1307.4 654840291 652125537 649404466 646874607 644611895 642575979 640850902 639498889 638321698
1323.7 638321698 637084246 635716856 634319484 632993281 631741107 630529225 629393578 628602028
1340 628602028 628230155 627954364 627564490 627089560 626636744 626244545 625838399 625330567 624600947 623580933
1360.4 623580933 622497857 621495247 620252669 618615329 616780460 614718199 612454832 609974205
1376.7 609974205 605894446 598036170 588464499 584902167 590731561 598794699 602631748 603343487
1393.1 603343487 602934599 602370083 601959348 601661503 601275444 601028025 601131856 601350605 601623833 601924360
1413.5 601924360 602102280 602513433 603975236 605902553 607777357 609847724 611882269 613848627 615584791
$$ packed form
1289F70281947n86152q68082j072050j420378j875699k224207k378464k442955k573669
1307.4F54840291k714754k721071k529859k262712k035916j725077j352013j177191
1323.7F38321698j237452j367390j397372j326203j252174j211882j135647p91550
1340F28602028l71873k75791l89874m74930m52816l92199m06146n07832p29620j020014
1360.4F23580933j083076j002610j242578j637340j834869k062261k263367k480627
1376.7F09974205m079759p858276r571671l562332N829394Q063138L837049P11739
1393.1F03343487m08888n64516m10735k97845l86059k47419J03831K18749K73228L00527
1413.5F01924360J77920M11153J461803J927317J874804K070367K034545J966358J736164
$$ plain form
1431.8 615584791 616744518 618036926 620076060 621817410 623004973 623900831 624636471 625504911 626449347
1450.2 626449347 627026796 627220631 628131568 631091893 634077966 636195421 638686717 641987443 645090818
1468.5 645090818 648229361 653061748 659201264 664695859 669061065 672444284 675040126 676532090
1484.9 676532090 676823080 676397204 675841391 674774587 672494531 669206619 666046083 663171887 659946501
1503.2 659946501 655592144 650875568 648544848 646965802 644796550 642367840 640477121 639387786
1519.5 639387786 638852239 638533950 637917399 637106180 636169314 634813488 633335471 632031143 630301714
1537.9 630301714 628375053 627820015 628207147 628651261 628943622 629260659 629700661 629956663 629734695
1556.2 629734695 630065918 632371485 633820951 634037137 633731127 633036971 632286608 631273866 629455686
$$ packed form
1431.8F15584791J159727J292408K039134J741350J187563Q95858P35640Q68440R44436
1450.2F26449347N77449J93835R10937K960325K986073K117455K491296L300726L103375
1468.5F45090818L138543M832387O139516N494595M365206L383219K595842J491964
1484.9F76532090K90990m25876n55813j066804k280056l287912l160536k874196l225386
1503.2F59946501m354357m716576k330720j579046k169252k428710j890719j089335
1519.5F39387786n35547l18289o16551q11219r36866j355826j478017j304328j729429
1537.9F30301714j926661n55038L87132M44114K92361L17037M40002K56002k21968
1556.2F29734695L31223K305567J449466K16186l06010o94156p50363j012742j818180
$$ plain form
1574.6 629455686 627127945 625016391 622606039 619524300 616085172 612428308 608552635 604563594
1590.9 604563594 600713611 597147703 593895972 590806544 587768853 584859610 582070172 579265773
1607.2 579265773 576422632 573653102 570816278 567623436 564407885 561904728 559399307 556540847
1623.5 556540847 553839684 551228404 548745155 546563268 544418633 542605221 541982472 541810155 541482091
1641.9 541482091 540908098 540506601 540893734 541160941 541271508 542962372 545021474 546393633 547780931
1660.3 547780931 549824417 552435160 554639220 557073891 560694754 564330041 568232656 572914600
1676.6 572914600 577043831 580348551 584174752 590728760 597339272 602589250 607919335 612630308
1692.9 612630308 617638886 623524308 629628778 637103498 643196046 648042977 653161168 657335937
$$ packed form
1574.6F29455686k327741k111554k410352l081739l439128l656864l875673l989041
1590.9F04563594l849983l565908l251731l089428l037691k909243k789438k804399
1607.2E79265773k843141k769530k836824l192842l215551k503157k505421k858460
1623.5E56540847k701163k611280k483249k181887k144635j813412o22749j72317l28064
1641.9E41482091n73993m01497L87133K67207J10567J690864K059102J372159J387298
1660.3E47780931K043486K610743K204060K434671L620863L635287L902615M681944
1676.6E72914600M129231L304720L826201O554008O610512N249978N330085M710973
1692.9F12630308N008578N885422O104470P474720O092548M846931N118191M174769
$$ plain form
1709.2 657335937 660238981 662211716 663835585 666266501 669094920 670981288 672306955 673496485
1725.5 673496485 674263656 674550891 674613297 675492346 677325726 678656042 680018365 682022393 684295833
1743.9 684295833 686584353 689067245 692660153 697323024 701464057 705195189 709026039 712681949
1760.2 712681949 716685832 720570982 723713636 726555347 729450285 732959867 736467063 739006281
1776.5 739006281 741067588 743167043 745187521 746997595 748618484 749852419 750948608 752578616
1792.8 752578616 754315734 755632818 756807804 758162975 759595513 760832131 761908233 762932181
1809.2 762932181 764005125 765077531 766093612 767133415 768112183 768749774 769172966 769824386 770575523
1827.5 770575523 771410704 772520244 773509562 774292469 775057137 775558054 775668681 776064098 777156115
$$ packed form
1709.2F57335937K903044J972735J623869K430916K828419J886368J325667J189530
1725.5F73496485P67171K87235O2406Q79049J833380J330316J362323K004028K273440
1743.9F84295833K288520K482892L592908M662871M141033L731132L830850L655910
1760.2G12681949M003883L885150L142654K841711K894938L509582L507196K539218
1776.5G39006281K061307K099455K020478J810074J620889J233935J096189J630008
1792.8G52578616J737118J317084J174986J355171J432538J236618J076102J023948
1809.2G62932181J072944J072406J016081J039803R78768O37591M23192O51420P51137
1827.5G70575523Q35181J109540R89318P82907P64668N00917J10627L95417J092017
$$ plain form
1845.9 777156115 778194547 778863907 779399455 779997349 780623138 781108737 781497121 781915188 782259345
1864.2 782259345 782346606 782530546 783243537 784111083 784796715 785268009 785572708 785870254 786276758 786690176
1884.6 786690176 786885977 786996305 787398458 787946284 788353324 788645506 788916469 789286792 789703488 789963126
1905 789963126 790050626 790230811 790656865 791033506 791074097 791042805 791285932 791626751 791954517 792240441
1925.4 792240441 792408228 792595565 792860925 793052614 793119013 793187857 793237388 793234348 793309271 793489754 793730080
1947.9 793730080 793976009 794100761 794083536 794107318 794277608 794448972 794467092 794385672 794401467 794630766
1968.3 794630766 794854522 794869781 794828236 794914484 795061171 795086443 795017421 795004845 795082390 795107603 794998765
1990.7 794998765 794967175 795141101 795330405 795367956 795283794 795190513 795183182 795216739 795153439 794979334 794815063
$$ packed form
1845.9G77156115J038432O69360N35548N97894O25789M85599L88384M18067L44157
1864.2G82259345Q7261J83940P12991Q67546O85632M71294L04699K97546M06504M13418
1884.6G86690176J95801J10328M02153N47826M07040K92182K70963L70323M16696K59638
1905G89963126Q7500J80185M26054L76641M0591l1292K43127L40819L27766K85924
1925.4G92240441J67787J87337K65360J91689O6399O8844M9531l040P4923J80483K40326
1947.9G93730080K45929J24752j7225K3782J70290J71364J8120q1420J5795K29299
1968.3G94630766K23756J5259m1545Q6248J46687K5272o9022j2576P7545K5213j08838
1990.7G94998765l1590J73926J89304L7551q4162r3281p331L3557o3300j74105j64271
$$ plain form
2013.1 794815063 794725597 794682086 794618785 794503212 794416785 794396937 794339299 794183195 794047832 794014573 793987274
2035.6 793987274 793853641 793650568 793536723 793573976 793641031 793587863 793449163 793372512 793399572 793416798 793332458
2058 793332458 793224096 793184102 793195605 793187261 793143392 793134451 793197811 793236852 793158233 793054879 793075681 793176591
2082.5 793176591 793205798 793138444 793097973 793187320 793320298 793349087 793304920 793357849 793520510 793622553 793575466
2104.9 793575466 793507934 793596983 793767989 793816686 793741643 793731272 793883979 794050694 794062555 794026077 794120848
2127.3 794120848 794292629 794363141 794301033 794286549 794430792 794613898 794673383 794642150 794706345 794900298 795054376
2149.8 795054376 795078039 795098305 795255005 795485377 795623958 795653820 795735240 795958579 796183050 796271682
2170.2 796271682 796318114 796490848 796783149 797000051 797044575 797067225 797236979 797481596 797609627 797619402
$$ packed form
2013.1G94815063q9466m3511o3301j15573q6427j9848n7638j56104j35363l3259k7299
2035.6G93987274j33633k03073j13845L7253O7055n3168j38700p6651K7060J7226q4340
2058G93332458j08362l9994J1503q344m3869q941O3360L9041p8619j03354K0802J00910
2082.5G93176591K9207o7354m0471Q9347J32978K8789m4167N2929J62661J02043m7087
2104.9G93575466o7532Q9049J71006M8697p5043j0371J52707J66715J1861l6478R4771
2127.3G94120848J71781P0512o2108j4484J44243J83106N9485l1233O4195J93953J54078
2149.8G95054376K3663K0266J56700K30372J38581K9862Q1420K23339K24471Q8632
2170.2G96271682M6432J72734K92301K16902M4524K2650J69754K44617J28031R775
$$ plain form
2190.6 797619402 797699809 797940195 798178315 798254848 798263967 798391819 798615992 798738182 798712850 798728943 798889577
2213 798889577 799066603 799123585 799101532 799149930 799303532 799420774 799400687 799355686 799428225 799577177 799661160
2235.4 799661160 799632967 799617052 799696028 799762905 799742520 799708188 799745917 799833119 799838543 799725235 799645424
2257.9 799645424 799683988 799739063 799709022 799650133 799671710 799767911 799822211 799751580 799657226 799686790 799770117
2280.3 799770117 799723744 799551964 799387276 799249291 799073398 798838317 798584282 798375905 798182607 797880888
2300.7 797880888 797446012 796969235 796529889 796110451 795658052 795203745 794758320 794180214 793393195 792624831
2321.1 792624831 792101681 791704834 791220784 790677011 790210247 789799750 789404809 789027512 788668454 788501322
2341.5 788501322 788888156 789769292 790051162 789148569 787575305 785997510 784670293 783658743 783169210
$$ packed form
2190.6G97619402Q0407K40386K38120P6533R119J27852K24173J22190k5332J6093J60634
2213G98889577J77026N6982k2053M8398J53602J17242k0087m5001P2539J48952Q3983
2235.4G99661160k8193j5915P8976O6877k0385l4332L7729Q7202N424j13308p9811
2257.9G99645424L8564N5075l0041n8889K1577R6201N4300p0631r4354K9564Q3327
2280.3G99770117m6373j71780j64688j37985j75893k35081k54035k08377j93298l01719
2300.7G97880888m34876m76777m39346m19438m52399m54307m45425n78106p87019p68364
2321.1G92624831n23150l96847m84050n43773m66764m10497l94941l77297l59058j67132
2341.5G88501322L86834Q81136K81870r02593j573264j577795j327217j011550m89533
$$ plain form
2359.9 783169210 783252358 783668756 784316480 785180688 786102355 786980569 787788749 788503468 789136410 789697826
2380.2 789697826 790114999 790275991 790162146 789878488 789523005 789115250 788684785 788302422 787982404 787707508
2400.6 787707508 787484348 787280142 787050068 786772728 786449313 786121309 785800636 785456121 785088539 784692824
2421 784692824 784246504 783775151 783353806 783045471 782829821 782615602 782330692 781983733 781631172 781318665
2441.4 781318665 781025946 780664682 780242026 779875398 779535711 779122174 778701901 778340638 777972937 777553260
2461.8 777553260 777121782 776715577 776321352 775904536 775453627 774977446 774486065 774012029 773575068 773157299
2482.2 773157299 772729218 772278428 771820307 771366894 770935178 770544708 770159721 769740582 769294322 768832505
2502.6 768832505 768409550 768049777 767671585 767240047 766815126 766420841 766024590 765617967 765212357 764823914
$$ packed form
2359.9G83169210Q3148M16398O47724Q64208R21667Q78214Q08180P14719O32942N61416
2380.2G89697826M17173J60992j13845k83658l55483m07755m30465l82363l20018k74896
2400.6G87707508k23160k04206k30074k77340l23415l28004l20673l44515l67582l95715
2421G84692824m46320m71353m21345l08335k15650k14219k84910l46959l52561l12507
2441.4G81318665k92719l61264m22656l66628l39687m13537m20273l61263l67701m19677
2461.8G77553260m31478m06205l94225m16816m50909m76181m91381m74036m36961m17769
2482.2G73157299m28081m50790m58121m53413m31716l90470l84987m19139m46260m61817
2502.6G68832505m22955l59773l78192m31538m24921l94285l96251m06623m05610l88443
$$ plain form
2523 764823914 764447570 764046311 763637006 763264656 762901783 762515128 762115121 761703670 761276722 760844350
2543.4 760844350 760429740 760039926 759655178 759255409 758812845 758340299 757886648 757443249 756993413 756565630
2563.8 756565630 756167829 755776644 755337834 754840970 754365683 753933907 753513575 753092527 752637208 752145588
2584.2 752145588 751641154 751102328 750553608 750064015 749628127 749179721 748668432 748121798 747615337 747155964
2604.6 747155964 746668756 746105134 745542765 745080113 744651735 744144499 743562460 742982447 742474020 742013276
2625 742013276 741495132 740905344 740339160 739817917 739275277 738705754 738151550 737621725 737097561 736524761
2645.4 736524761 735899985 735308826 734783530 734252453 733666897 733110487 732619524 732086599 731490254 730903804
2665.8 730903804 730360806 729851663 729309857 728700221 728110433 727594733 727077484 726470351 725798786 725178897
$$ packed form
2523G64823914l76344m01259m09305l72350l62873l86655m00007m11451m26948m32372
2543.4G60844350m14610l89814l84748l99769m42564m72546m53651m43399m49836m27783
2563.8G56565630l97801l91185m38810m96864m75287m31776m20332m21048m55319m91620
2584.2G52145588n04434n38826n48720m89593m35888m48406n11289n46634n06461m59373
2604.6G47155964m87208n63622n62369m62652m28378n07236n82039n80013n08427m60744
2625G42013276n18144n89788n66184n21243n42640n69523n54204n29825n24164n72800
2645.4G36524761o24776n91159n25296n31077n85556n56410m90963n32925n96345n86450
2665.8G30903804n42998n09143n41806o09636n89788n15700n17249o07133o71565o19889
$$ plain form
2686.2 725178897 724650800 724133134 723530531 722862065 722242296 721687376 721096575 720436215 719785035 719196200
2706.6 719196200 718617022 717968881 717252791 716543257 715894461 715276718 714628816 713959336 713329375 712728202
2727 712728202 712076724 711397648 710812032 710346758 709884405 709298909 708643079 708095491 707679808 707236469
2747.4 707236469 706688166 706133366 705630362 705103457 704497695 703878403 703338206 702869594 702382803 701819360
2767.8 701819360 701239944 700711370 700177372 699539185 698800623 698082983 697447658 696822405 696137011 695430994
2788.2 695430994 694753587 694071352 693321526 692494273 691654980 690827847 689993739 689116061 688174486 687240541
2808.6 687240541 686319113 685346663 684316278 683242142 682181180 681134939 680002570 678751767 677447736
2826.9 677447736 676138103 674756885 673203886 671526790 669793785 667847991 665452838 662548542
$$ packed form
2686.2G25178897n28097n17666o02603o68466o19769n54920n90801o60360o51180n88835
2706.6G19196200n79178o48141p16090p09534o48796o17743o47902o69480o29961o01173
2727G12728202o51478o79076n85616m65274m62353n85496o55830n47588m15683m43339
2747.4G07236469n48303n54800n03004n26905o05762o19292n40197m68612m86791n63443
2767.8G01819360n79416n28574n33998o38187p38562p17640o35325o25253o85394p06017
2788.2F95430994o77407o82235p49826q27253q39293q27133q34108q77678r41575r33945
2808.6F87240541r21428r72450j030385j074136j060962j046241j132369j250803j304031
2826.9F77447736j309633j381218j552999j677096j733005j945794k395153k904296
$$ plain form
2843.2 662548542 659243405 655807316 652718246 650469363 649224758 648743808 648614109 648430467 647935867
2861.6 647935867 647131085 646099031 644840419 643472075 642266214 641319990 640535891 639848292 639210641
2879.9 639210641 638579309 637936175 637212873 636336863 635342360 634326994 633320391 632222772 630975962
2898.3 630975962 629668295 628363132 626993358 625431597 623634398 621594667 619205534 616440117
2914.6 616440117 613602281 611169040 609398842 608262599 607645154 607491493 607700646 608112454 608751178
2933 608751178 609691441 610875249 612254977 613802731 615373075 616736829 617761672 618524730 619124234
2951.3 619124234 619479120 619634271 619878054 620404422 621226549 622280896 623531461 624975264 626562238
2969.7 626562238 628261328 630013704 631680310 633257449 634776115 636104226 637219965 638263881
$$ packed form
2843.2F62548542l305137l436089l089070k248883j244605m80950j29699j83642m94600
2861.6F47935867q04782j032054j258612j368344j205861r46224p84099o87599o37651
2879.9F39210641o31332o43134p23302q76010r94503j015366j006603j097619j246810
2898.3F30975962j307667j305163j369774j561761j797199k039731k389133k765417
2914.6F16440117k837836k433241j770198j136243o17445j53661K09153M11808O38724
2933F08751178R40263J183808J379728J547754J570344J363754J024843P63058N99504
2951.3F19124234L54886J55151K43783N26368Q22127J054347J250565J443803J586974
2969.7F26562238J699090J752376J666606J577139J518666J328111J115739J043916
$$ plain form
2986 638263881 639279902 640215158 640957654 641412497 641672790 641775131 641640604 641366243 641049206 640663624
3006.4 640663624 640248060 639868379 639467955 638952315 638318598 637579978 636766315 635970592 635188401 634325027
3026.8 634325027 633418918 632590413 631862700 631093383 630177736 629257739 628429115 627564073 626583517 625562370
3047.2 625562370 624601364 623683035 622718275 621734977 620784283 619864941 618995547 618187964 617457330 616741657
3067.6 616741657 615950406 615148008 614417195 613767684 613184810 612573028 611879885 611161411 610418677 609678507
3088 609678507 608994126 608270168 607472837 606748581 606122851 605453253 604640782 603758872 602979004 602273762
3108.4 602273762 601471663 600606680 599801302 599036455 598206282 597186446 595998168 594845474 593840897
3126.7 593840897 592873275 591783464 590592802 589462578 588461995 587475240 586334407 585037887 583753347
$$ packed form
2986F38263881J016021R35256P42496M54843K60293J02341j34527k74361l17037l85582
3006.4F40663624m15564l79681m00424n15640o33717p38620q13663p95723p82191q63374
3026.8F34325027r06109q28505p27713p69317r15647r19997q28624q65042r80556j021147
3047.2F25562370r61006r18329r64760r83298r50694r19342q69394q07583p30634p15673
3067.6F16741657p91251q02398p30813o49511n82874o11782o93143p18474p42734p40170
3088F09678507o84381p23958p97331p24256o25730o69598q12471q81910p79868p05242
3108.4F02273762q02099q64983q05378p64847q30173j019836j188278j152694j004577
3126.7E93840897r67622j089811j190662j130224j000583r86755j140833j296520j284540
$$ plain form
3145.1 583753347 582610607 581579685 580519855 579317331 578006327 576697946 575398743 574082017
3161.4 574082017 572801113 571565092 570304632 569013953 567752659 566509962 565241933 563972533
3177.7 563972533 562702894 561406314 560148537 558981240 557827652 556619644 555399776 554216743
3194 554216743 553041697 551843584 550658643 549529612 548447311 547360957 546252668 545188367 544189513
3212.4 544189513 543173552 542088568 540981948 539912164 538877428 537835002 536766469 535753489
3228.7 535753489 534862339 533974171 532911658 531721950 530592501 529572666 528599977 527623773 526616693
3247.1 526616693 525545597 524407506 523261189 522129178 521004140 519931197 518888175 517827332
3263.4 517827332 516775906 515757024 514788449 513824999 512808025 511755884 510720253 509747982 508857906
$$ packed form
3145.1E83753347j142740j030922j059830j202524j311004j308381j299203j316726
3161.4E74082017j280904j236021j260460j290679j261294j242697j268029j269400
3177.7E63972533j269639j296580j257777j167297j153588j208008j219868j183033
3194E54216743j175046j198113j184941j129031j082301j086354j108289j064301r98854
3212.4E44189513j015961j084984j106620j069784j034736j042426j068533j012980
3228.7E35753489q91150q88168j062513j189708j129449j019835r72689r76204j007080
3247.1E26616693j071096j138091j146317j132011j125038j072943j043022j060843
3263.4E17827332j051426j018882r68575r63450j016974j052141j035631r72271q90076
$$ plain form
3281.7 508857906 508048654 507268906 506490767 505773604 505091369 504356921 503586292 502815306 502093136 501482546
3302.1 501482546 500917017 500274241 499514341 498655677 497764289 496925980 496118575 495268166 494381666 493510783
3322.5 493510783 492628306 491628647 490534067 489465237 488482028 487597048 486735612 485772818 484728009
3340.9 484728009 483704239 482708007 481764287 480897516 479965270 478859276 477707982 476696938 475826651
3359.2 475826651 474961460 474072337 473293185 472601414 471732974 470623523 469549209 468675584 467881501
3377.6 467881501 467071205 466260254 465498596 464832246 464299142 463884026 463415146 462749660 462050825 461585402
3398 461585402 461278737 460796565 460084170 459460109 459084123 458814651 458500952 458088666 457650095 457332075
3418.4 457332075 457185090 457136661 457130939 457203835 457380980 457589239 457837313 458150744 458369136 458391428
$$ packed form
3281.7E08857906q09252p79748p78139p17163o82235p34448p70629p70986p22170o10590
3302.1E01482546n65529o42776p59900q58664q91388q38309q07405q50409q86500q70883
3322.5D93510783q82477r99659j094580j068830r83209q84980q61436r62794j044809
3340.9D84728009j023770r96232r43720q66771r32246j105994j151294j011044q70287
3359.2D75826651q65191q89123p79152o91771q68440j109451j074314q73625p94083
3377.6D67881501q10296q10951p61658o66350n33104m15116m68880o65486o98835m65423
3398D61585402l06665m82172p12395o24061l75986k69472l13699m12286m38571l18020
3418.4D57332075j46985m8429n722P2896J77145K08259K48074L13431K18392K2292
$$ plain form
3438.8 458391428 458405465 458627939 459056556 459607869 460192770 460768968 461365372 462014496 462773800 463623911
3459.2 463623911 464416265 465219527 466271847 467491925 468495488 469154716 469824702 470783800 471939236
3477.5 471939236 473048091 474005431 474966437 476073712 477264881 478447676 479614884 480835825 482164323
3495.9 482164323 483450770 484636098 485936642 487313330 488519013 489751160 491267353 492899925
3512.2 492899925 494355559 495636761 496957004 498399973 500035763 501701355 503182292 504732370
3528.5 504732370 506502628 508310080 510142505 511993349 513707459 515370548 517165065 519158721
3544.8 519158721 521221876 523125648 525037289 527157545 529239297 531215072 533301353 535339475
3561.1 535339475 536956966 538779259 541894555 545266211 547703803 549847841 552229941 554823279
$$ packed form
3438.8D58391428J4037K22474M28617N51313N84901N76198N96404O49124P59304Q50111
3459.2D63623911P92354Q03262J052320J220078J003563O59228O69986R59098J155436
3477.5D71939236J108855R57340R61006J107275J191169J182795J167208J220941J328498
3495.9D82164323J286447J185328J300544J376688J205683J232147J516193J632572
3512.2D92899925J455634J281202J320243J442969J635790J665592J480937J550078
3528.5E04732370J770258J807452J832425J850844J714110J663089J794517J993656
3544.8E19158721K063155J903772J911641K120256K081752J975775K086281K038122
3561.1E35339475J617491J822293L115296L371656K437592K144038K382100K593338
$$ plain form
3577.5 554823279 557584882 560201764 562327504 564634442 568027735 571394622 573804617 576321423
3593.8 576321423 579398334 582506657 585626483 588674068 591119707 593360662 596371114 599716008
3610.1 599716008 602763474 605636120 608250380 611671507 616078436 619251728 620676875 622042656
3626.4 622042656 626037002 631289065 634583890 637320578 640164316 642892063 645566881 647611201
3642.7 647611201 648743510 650394797 654827774 660027683 662509322 664493203 667871773 670820296
3659 670820296 672750473 674376965 675384939 676074803 678011417 680222154 681343675 684129179 687631309
3677.4 687631309 689336717 690420866 691037953 691213965 692387581 695103407 697275698 698256791 698834777
3695.8 698834777 699180245 699714422 701107264 702271640 702139139 701674104 702518880 704962075 706507027
$$ packed form
3577.5E54823279K761603K616882K125740K306938L393293L366887K409995K516806
3593.8E76321423L076911L108323L119826L047585K445639K240955L010452L344894
3610.1E99716008L047466K872646K614260L421127M406929L173292J425147J365781
3626.4F22042656L994346N252063L294825K736688K843738K727747K674818K044320
3642.7F47611201J132309J651287M432977N199909K481639J983881L378570K948523
3659F70820296J930177J626492J007974O89864J936614K210737J121521K785504L502130
3677.4F87631309J705408J084149O17087J76012J173616K715826K172291R81093N77986
3695.8F98834777L45468N34177J392842J164376j32501m65035Q44776K443195J544952
$$ plain form
3714.1 706507027 706489325 706206083 706268370 706599176 707138777 707788110 707676470 706847310 706649065 708066106
3734.5 708066106 710263193 710780084 709259152 708468080 710192323 710932255 710549235 712405741 714634061
3752.9 714634061 714730263 714368403 715088785 715921342 715877533 715789378 716023207 716829121 717949450 718215466
3773.3 718215466 717765272 717659414 718381703 718953609 719044983 719378591 719763815 719863892 719599068 719081938
3793.7 719081938 718805373 718418419 718324721 719514549 720133722 720487654 721653521 721675575 720362306
3812 720362306 719527841 719920993 719863236 720185399 721774876 722171903 721822500 721507728 721095026 720799565
3832.4 720799565 720426977 720520735 721490264 722300768 722887874 723315358 722641110 720619202 718722343
3850.8 718722343 720301449 723971725 724308729 723010182 722132802 722197711 722461700 721917987 721959829
$$ packed form
3714.1G06507027j7702k83242O2287L30806N39601O49333j11640q29160j98245J417041
3734.5G08066106K197087N16891j520932p91072J724243P39932l83020J856506K228320
3752.9G14634061R6202l61860P20382Q32557m3809q8155K33829Q05914J120329K66016
3773.3G18215466m50194j05858P22289N71906R1374L33608L85224J00077k64824n17130
3793.7G19081938k76565l86954r3698J189828O19173L53932J165867K2054j313269
3812G20362306q34465L93152n7757L22163J589477L97027l49403l14772m12702k95461
3832.4G20799565l72588R3758R69529Q10504N87106M27484o74248k021908j896859
3850.8G18722343J579106L670276L37004j298547q77380O4909K63989n43713M1842
$$ plain form
3869.1 721959829 722975075 723567247 723557055 722814143 722485185 722846508 722873807 723399937 723604739 723119855
3889.5 723119855 723577261 723969400 723043919 721977592 721734047 722295225 723484695 724469662 724547744
3907.9 724547744 724211693 723726273 723061860 722846448 723304927 723567188 723365486 723352909 723423660 723085046
3928.3 723085046 722929120 723445594 723865092 723698378 723311067 723087549 723200917 723243773 723059356 723105490
3948.7 723105490 723281562 723298669 723254621 723204017 723122418 723123550 723182023 723098040 722939074 722841918 722771049
3971.1 722771049 722768188 722876430 722950995 722939551 722960711 722979128 722859681 722668231 722572505 722599924 722680807
3993.5 722680807 722753048 722760022
3997.6 722760022
$$ packed form
3869.1G21959829J015246N92172j0192p42912l28958L61323K7299N26130K04802m84884
3889.5G23119855M57406L92139r25481j066327k43545N61178J189470R84967P8082
3907.9G24547744l36051m85420o64413k15412M58479K62261k01702j2577P0751l38614
3928.3G23085046j55926N16474M19498j66714l87311k23518J13368M2856j84417M6134
3948.7G23105490J76072J7107m4048n0604q1599J132N8473q3983j58966r7156p0869
3971.1G22771049k861J08242P4565j1444K1160J8417j19447j91450r5726K7419Q0883
3993.5G22680807P2241O974
3997.6G22760022
##END=$$ End of the data block
