##TITLE=$$ Begin of the data block
##JCAMP-DX=5.00 $$ ACD/SpecManager v 10.08
##SPECTROMETER/DATA SYSTEM=Alpha
##DATE=10 Nov 2014 10:35:34
##DATA TYPE=INFRARED SPECTRUM
##DATA CLASS=XYDATA
##ORIGIN=
##OWNER=
##NPOINTS=1765
##FIRSTX=399.76428223
##LASTX=3997.64306641
##MAXX=3997.64306641
##MINX=399.76428223
##MAXY=0.80230999
##MINY=0.45131677
##XFACTOR=1.0000000000
##YFACTOR=1.000000000000000e-9
##FIRSTY=0.67165649
##DELTAX=2.03961372
##XUNITS=1/CM
##YUNITS=ARBITRARY UNITS
##XYDATA=(X++(Y..Y))
399.8 671656489 671627700 671685874 671839178 670983315 669117808 667957783 668025076 667638600 665214539 662471473
420.2 662471473 661891997 662226915 661974251 660808623 659839928 660291612 661207199 660832822 659613550
438.5 659613550 659179211 659737647 659852386 659021497 658577323 659040272 659045219 657456100 655546665 655326247
458.9 655326247 655934811 655389667 653740227 652586579 652582288 652362525 650964320 649801373 650263369
477.3 650263369 651224792 650701880 649075747 648447037 649121463 649320841 648211479 647073388 646940172
495.6 646940172 646908164 645786643 643954337 642870605 642862976 642484128 640726447 638795078 637879372
514 637879372 637162089 635596931 633633852 632391036 632080615 631742001 630557358 629310846 629136443
532.3 629136443 629480362 629150093 628569245 629064798 630737364 632282734 632763028 632698953 632905066 633273005
552.7 633273005 633293569 632814288 632382989 632722676 633299768 633103907 632523775 632424712 632668793 632552207
573.1 632552207 631993651 631830692 632448435 633057296 633139610 633121073 633446813 633983612 634086907 633538961
593.5 633538961 633198500 633535683 633891404 633690059 633073330 632519841 632203400 631719172 630572975 628951967
613.9 628951967 627830625 628032863 629300296 630925715 632762432 635021985 637526572 639432192 640341699
632.3 640341699 640943885 641965687 643237948 644215584 644962668 646069109 647668004 649095535 649885952
650.6 649885952 650540590 651661158 652808070 653191864 652965426 652916849 653148234 653151512 653463602 654755414
671 654755414 656549394 658701122 660525501 661602020 662679017 664430082 666256607 667159498 667381406
689.4 667381406 668007374 669147551 669824243 669580281 669394910 670357227 672012568 673164189 673763335
707.7 673763335 674842954 676812053 678707957 679671288 680467963 682426274 685329616 687680066 689033985
726.1 689033985 690505207 692884862 695223510 696265221 696543276 697548509 699347436 700497985 700416803
744.5 700416803 700337291 701351285 702619016 702727675 702006340 701951563 702811301 703299403 702787399 702445865
764.9 702445865 703525126 705346167 706322908 706397712 707090139 709014237 710926712 711880088 712714136
783.2 712714136 714608908 717110336 718800724 719441891 720326662 722210824 723958492 724341571 724043846
801.6 724043846 724498332 725638509 726189613 725815177 725793898 727002144 728343964 728341937 727113068 725665450
822 725665450 724556148 723833561 723473251 723859906 725422204 727747560 729850233 731396496 733039677
840.3 733039677 734971821 736229479 736170471 735463023 735181510 735479891 735676408 735565364 735841632 736857593
860.7 736857593 737819195 737944126 737599671 737608075 737891972 737569332 736320972 734847188 733743370 732584000
881.1 732584000 730675042 728178322 725938439 724399447 723087430 721540391 720234692 719879985 720281661
899.5 720281661 720555246 720251620 719685376 719181776 718460917 717066288 715214133 713593185 712435484
917.8 712435484 711385131 710181713 709046066 708300650 707778573 706897616 705314934 703249753 701010764
936.2 701010764 698447227 695194542 691275895 687228322 683518350 680016100 676482797 673141301
952.5 673141301 670360684 668134093 665981114 663466036 660765171 658284605 655821800 652715266
968.8 652715266 648742139 644300759 639714122 634686291 628820598 622478724 616521060 611320019
985.1 611320019 606504619 601812959 597684264 594488978 591758490 588705599 585178494 581698298
1001.4 581698298 578553081 575388134 571896374 568424523 565559566 563322127 561227202 559154570
1017.8 559154570 557574689 556794941 556450427 556009889 555548549 555571735 556176484 556834698 557121038 557248473
1038.2 557248473 557546556 557788372 557511032 556816518 556362569 556501329 556857586 556984901 557042360 557505310
1058.6 557505310 558399975 559173405 559398532 559296310 559234202 559082091 558573902 558049679 558329940 559792578
1079 559792578 561914623 563973188 565885425 567888975 569740713 570809305 570926607 570657551 570494533
1097.3 570494533 570280194 569734037 569193840 569409072 570608318 572254121 573935270 575947642 578615904
1115.7 578615904 581508636 583911419 585763335 587641120 589945078 592448354 594815612 597029746
1132 597029746 599209368 601212025 602492332 602785408 602630138 602749944 603230476 603726923 604331672
1150.3 604331672 605588257 607665420 610140026 612679541 615594149 619458735 624343514 629810631
1166.7 629810631 635631621 642040551 649126530 656349421 662988245 668949664 674607038 679924250
1183 679924250 684333980 687509239 689781189 691526890 692526996 692383289 691286325 689938366 688762665
1201.3 688762665 687578797 686206222 684923530 684027374 683223367 681921422 679981291 677824497 675786972
1219.7 675786972 673691332 671322525 668897569 666826546 665164769 663608253 662069261 660879493
1236 660879493 660255253 659948230 659653485 659443021 659609079 660165787 660765707 661152184 661487579 662026286
1256.4 662026286 662712395 663359225 663988590 664780319 665793240 666866541 667783678 668563187 669324934
1274.8 669324934 669998705 670400620 670493305 670493186 670584500 670652270 670436680 669838428 668951154 667840838
1295.2 667840838 666382372 664480150 662261128 659912050 657475650 654878438 652137935 649408758
1311.5 649408758 646880448 644617498 642588198 640868425 639507532 638326705 637099743 635725617
1327.8 635725617 634296238 632951915 631699860 630488753 629355252 628558099 628185868 627913892 627517641
1346.2 627517641 627047122 626603305 626211822 625827491 625378549 624739647 623822153 622818530 621873856
1364.5 621873856 620718360 619224012 617549360 615646362 613564610 611335754 607797384 601104558
1380.8 601104558 592904031 589608610 594211340 600846350 603969514 604441166 603979230 603371203 602882326
1399.2 602882326 602540612 602164626 601907670 601963758 602147162 602392316 602676570 602871239 603307664 604757011
1419.6 604757011 606660187 608537853 610591054 612578809 614517331 616246998 617424250 618748546
1435.9 618748546 620763183 622446656 623601019 624491334 625243723 626117110 627057314 627681017 627977610
1454.3 627977610 628998518 631953359 634856939 636930525 639398992 642668605 645763397 648942292
1470.6 648942292 653834164 659981012 665431023 669736981 673070729 675636113 677109957 677392960
1486.9 677392960 676947951 676306665 675153971 672878683 669619679 666398168 663448989 660258293 656068027
1505.2 656068027 651458800 649051309 647418559 645275414 642904282 641051948 640007198 639522135
1521.6 639522135 639234126 638642251 637825012 636882484 635597825 634244502 633024871 631415129 629716992
1539.9 629716992 629256606 629559994 629912078 630161762 630471826 630904257 631165266 631015301 631445706 633644760
1560.3 633644760 634931386 635065377 634723723 634013057 633202136 632099688 630240917 627886117 625693798
1578.7 625693798 623180032 619997203 616474926 612735629 608759284 604677200 600739002 597078502
1595 597078502 593734682 590528071 587340474 584292054 581385195 578447819 575451016 572537601 569593132
1613.4 569593132 566302717 562937260 560301840 557732940 554854453 552167594 549551845 547015846
1629.7 547015846 544839203 542841196 541222274 540689349 540609419 540444493 540061951 539885521 540524900
1648 540524900 541017950 541394830 543303490 545392871 546778440 548220634 550374806 553101540 555382490
1666.4 555382490 557913005 561629891 565292537 569189548 573839605 577930629 581263363 585203409
1682.7 585203409 591845512 598425150 603631318 608938634 613662481 618755639 624753654 630922735
1699 630922735 638384044 644445658 649309754 654446602 658629835 661574841 663621128 665334880 667819977
1717.4 667819977 670596898 672436774 673782706 674997449 675769269 676072121 676188707 677130878 678929806
1735.7 678929806 680194497 681549728 683561087 685819805 688128591 690686405 694326878 698949337
1752 698949337 703050733 706802487 710659385 714326024 718322277 722175419 725333869 728258669 731239855
1770.4 731239855 734772682 738238454 740732729 742784560 744914353 746963322 748779118 750391185
1786.7 750391185 751616120 752714932 754355013 756089568 757399917 758612096 760030508 761470795
1803 761470795 762663305 763711989 764751613 765841186 766883433 767854929 768891752 769895554 770556450
1821.4 770556450 771001458 771663010 772407115 773221612 774298251 775276065 776083887 776875913 777364969
1839.8 777364969 777441084 777835786 778941154 779969394 780622423 781144798 781751335 782402515 782897234
1858.1 782897234 783298731 783756375 784126580 784218192 784420550 785151303 786001027 786635578 787047505 787330449
1878.5 787330449 787654161 788081467 788479388 788669407 788812280 789232314 789761662 790148079 790437102 790721416
1898.9 790721416 791102529 791510820 791741967 791803122 791981757 792418003 792798996 792858958 792868018 793131053
1919.3 793131053 793448210 793730915 793990314 794186532 794431925 794700563 794859767 794920087 794968426 794991434
1939.7 794991434 795007706 795102119 795280635 795539558 795802891 795915961 795870185 795854628 795996904 796177328
1960.1 796177328 796215236 796141267 796166539 796386838 796586096 796599925 796575189 796667814 796803653 796816230 796738207
1982.5 796738207 796727836 796812654 796840250 796727479 796664000 796796918 796983182 797043324 796977341 796905100 796924710
2005 796924710 796976447 796910048 796732128 796595871 796524704 796453297 796357572 796227932 796135724 796123624 796097755
2027.4 796097755 795969486 795814097 795731723 795688272 795591474 795433342 795343876 795385599 795428038 795352757 795227885
2049.8 795227885 795188606 795254469 795286119 795193911 795073152 795015574 795008183 794983566 794928014 794925988 795028508
2072.3 795028508 795103848 795026779 794922709 794965327 795095444 795128942 795048296 795014083 795113146 795235872 795260847
2094.7 795260847 795231700 795303941 795497179 795633674 795591474 795493722 795555532 795742333 795842409 795823216 795852304
2117.1 795852304 796010971 796170056 796183884 796128392 796199620 796387374 796490610 796439767 796419382 796565235
2137.5 796565235 796766698 796860635 796846986 796904266 797104120 797259808 797258556 797262609 797422051 797650218 797804296
2160 797804296 797889352 798019171 798243344 798449159 798541009 798594475 798749983 799026549 799255669 799322486 799363077
2182.4 799363077 799549878 799797297 799914539 799922824 800007582 800251901 800506949 800609231 800632060 800764501
2202.8 800764501 800995588 801132917 801132143 801156938 801293314 801438451 801484227 801462948 801525235 801700413 801823497
2225.2 801823497 801804900 801770627 801864862 802022755 802084506 802042186 802045107 802149296 802221775 802195668 802165151
2247.7 802165151 802208424 802294374 802309990 802198410 802110136 802161872 802229941 802216530 802185535 802196145 802247822
2270.1 802247822 802280962 802230537 802178919 802230000 802295327 802225232 802042842 801898181 801822543 801682115 801415563
2292.5 801415563 801146209 800976753 800828516 800570250 800184250 799776912 799417853 799023271 798564136 798160374
2312.9 798160374 797807217 797312796 796608686 795899868 795386255 795011401 794599593 794143081 793783009 793485999
2333.3 793485999 793087840 792627454 792248547 792067528 792384267 793151855 793344021 792451918 790974319
2351.7 790974319 789556444 788474977 787738562 787353814 787355840 787740111 788384259 789081335 789724290 790340781
2372.1 790340781 790934980 791479826 791973114 792394698 792681754 792780995 792663813 792359114 791957498 791548371
2392.5 791548371 791150272 790765882 790441394 790191650 789990306 789779067 789506793 789193809 788881302 788576245
2412.9 788576245 788256466 787903786 787526727 787128627 786692083 786226034 785803795 785509706 785311818 785095453
2433.3 785095453 784818709 784490228 784127057 783788323 783486128 783148289 782764256 782391965 782014310 781584144
2453.7 781584144 781141758 780748725 780394077 780022025 779619932 779213667 778803110 778389215 777975976 777511239
2474.1 777511239 776987672 776510775 776096523 775656104 775203109 774777174 774340391 773868799 773386836 772938371
2494.5 772938371 772533238 772130609 771701753 771255791 770840347 770458639 770055592 769629419 769224286 768866003
2514.9 768866003 768516243 768131912 767728150 767325461 766931772 766540766 766140461 765733719 765313148 764888942
2535.3 764888942 764487386 764100790 763734162 763373196 762969434 762539268 762110651 761685014 761257589 760818243
2555.6 760818243 760376394 759945512 759516656 759094119 758703411 758315384 757880807 757400990 756923497 756483138
2576 756483138 756053448 755601466 755119205 754613638 754101157 753607690 753140926 752660930 752155662 751644850
2596.4 751644850 751132667 750630677 750148594 749663115 749138176 748584330 748066485 747629702 747210026 746696651
2616.8 746696651 746103168 745533109 745034933 744565785 744046867 743462682 742891848 742367327 741818964 741223991
2637.2 741223991 740656853 740161002 739668667 739101648 738481104 737889409 737353146 736804903 736207962 735630691
2657.6 735630691 735123873 734624803 734049022 733424783 732863843 732387066 731886923 731305182 730701804 730120420
2678 730120420 729543507 728942931 728323638 727740824 727215171 726689219 726091087 725447297 724847794 724283040
2698.4 724283040 723670840 722974300 722257853 721631944 721092463 720497668 719788432 719087005 718488812 717920184
2718.8 717920184 717277944 716597259 715973973 715381920 714711964 714004159 713408113 712938905 712469041 711901844
2739.2 711901844 711302996 710796952 710365295 709873378 709297717 708744407 708242774 707742929 707185864 706576943
2759.6 706576943 706018567 705530703 705025017 704458833 703889132 703364491 702828646 702184379 701457262 700781465
2780 700781465 700153410 699469924 698743820 698048234 697372496 696680427 695944488 695128024 694289327 693486631
2800.4 693486631 692676008 691811442 690904319 689982057 689022303 688022971 686988473 685901046 684818983
2818.8 684818983 683763564 682640612 681408942 680128396 678817689 677405357 675837338 674160063
2835.1 674160063 672409654 670438409 668050170 665208280 661984563 658552587 655364871 653034925
2851.4 653034925 651785433 651316583 651179969 650979042 650475264 649661779 648600817 647316277 645954370
2869.7 645954370 644779265 643874228 643114626 642425478 641800165 641189754 640512824 639723659 638851941
2888.1 638851941 637919605 636928022 635905564 634811461 633561909 632226288 630917370 629582644 628075659
2906.5 628075659 626304924 624240398 621817470 619040608 616201699 613772273 612038791 610973895
2922.8 610973895 610413969 610249221 610415518 610832334 611500800 612438202 613598704 614970922 616517067
2941.1 616517067 618073642 619453013 620550036 621375978 621981323 622348189 622557580 622833431 623354077
2959.5 623354077 624181032 625258803 626529396 627972782 629559338 631274462 633039176 634729087
2975.8 634729087 636338890 637875378 639233410 640405416 641497910 642523110 643446803 644193411 644678414
2994.2 644678414 644969583 645086169 644970000 644708574 644401431 644049525 643673658 643310845 642906845 642392755
3014.5 642392755 641775429 641076326 640315056 639534414 638728440 637862742 636997759 636207759 635478556 634696066
3034.9 634696066 633788168 632881820 632046998 631170809 630188763 629163504 628210008 627328098 626404524
3053.3 626404524 625437498 624477804 623531818 622649014 621870577 621163070 620434046 619618773 618795335 618081987
3073.7 618081987 617500722 616965950 616351664 615640223 614886940 614114881 613398433 612749636 612025380 611221731
3094.1 611221731 610480011 609829545 609173298 608380079 607489944 606695235 605995238 605209053 604355752 603587449
3114.5 603587449 602840543 601962805 600905955 599709630 598547220 597546339 596596062 595549703 594398439
3132.8 594398439 593264401 592258215 591237128 590020299 588718355 587504447 586379051 585285723
3149.2 585285723 584191740 583009779 581685185 580330491 579009295 577668786 576348901 575105846
3165.5 575105846 573863864 572571039 571294606 570066988 568834782 567552865 566234350 564914763
3181.8 564914763 563640654 562431157 561212122 559927523 558635771 557371914 556098461 554839611
3198.1 554839611 553660750 552568734 551489294 550340295 549162567 548045516 546984732 545932412
3214.4 545932412 544855356 543747723 542660952 541612267 540512085 539357841 538293839 537364542
3230.7 537364542 536432266 535350919 534151495 532986879 531902254 530845881 529800713 528718531
3247.1 528718531 527542174 526328683 525194585 524143636 523074865 521976888 520858645 519725800
3263.4 519725800 518651307 517648816 516676724 515656054 514549553 513436317 512387574 511418760 510507047
3281.7 510507047 509629130 508788526 507983863 507229447 506507993 505737543 504904926 504047453 503218472 502521396
3302.1 502521396 501933277 501260638 500394344 499412030 498428732 497474700 496532053 495577991 494606495 493662328
3322.5 493662328 492722005 491667479 490486205 489284426 488151729 487116784 486122131 485029489 483816087
3340.9 483816087 482621431 481475234 480352193 479287505 478179127 476949871 475728154 474605232
3357.2 474605232 473531604 472452492 471417755 470517516 469666272 468648463 467401773 466118962 465018332
3375.5 465018332 464092135 463191330 462239921 461328894 460542142 459890425 459391087 458874285 458120435 457323045
3395.9 457323045 456811726 456431270 455794096 454948068 454258680 453794330 453416288 453081608 452709556 452259749
3416.3 452259749 451856107 451579690 451402694 451316774 451372147 451552331 451749623 452032298 452441424 452705532
3436.7 452705532 452695429 452685654 452910602 453354239 453949571 454585344 455201536 455872506 456634074 457454681
3457.1 457454681 458308429 459100842 459921211 461044937 462358415 463431090 464182734 464986771 466059595
3475.5 466059595 467286646 468500346 469619483 470718890 471909910 473148584 474386156 475689024
3491.8 475689024 477098405 478573382 479949623 481221050 482599616 483995825 485209495 486492038
3508.1 486492038 488077402 489819825 491465926 492938280 494356841 495863795 497575790 499338865
3524.4 499338865 501005828 502757549 504610002 506426990 508324564 510312855 512186468 514030635
3540.8 514030635 516025722 518212914 520403981 522367895 524357855 526601851 528828263 530972540
3557.1 530972540 533232808 535401762 537126541 539082944 542399049 546006083 548624694 550938189
3573.4 550938189 553512931 556272388 559168935 561939538 564273655 566795170 570391595 574002206
3589.7 574002206 576629996 579305410 582578003 585899174 589152813 592327058 594972610 597465634
3606 597465634 600717723 604223788 607435524 610555887 613433957 617075861 621576846 624734998 626193941
3624.4 626193941 627718210 631971121 637381494 640683115 643442035 646353841 649154544 651909053
3640.7 651909053 654024899 655197918 656943202 661601186 666926563 669319928 671199203 674531758
3657 674531758 677452862 679410577 681115627 682165802 682886720 684923530 687186658 688287914 691156268
3675.4 691156268 694697559 696273327 697249115 697871685 698086679 699304283 702130854 704348266 705254734
3693.7 705254734 705773830 706127167 706724465 708158851 709298074 709189177 708799779 709676862 712097228
3712.1 712097228 713570535 713490069 713212311 713322043 713674784 714210689 714819670 714623213 713791072 713714480
3732.5 713714480 715245605 717438817 717896760 716356158 715584397 717316806 718048096 717755079 719723225
3750.8 719723225 721843958 721793711 721444964 722254336 723116815 723020911 722837865 723028839 723905444 725081027
3771.2 725081027 725300491 724788070 724659503 725398302 725952327 725959837 726258099 726706028 726896107 726702929
3791.6 726702929 726252019 726023078 725597680 725443900 726644456 727235258 727531254 728657126 728631616
3810 728631616 727323592 726541221 726989031 727024555 727505028 729151428 729428768 728999019 728699863 728312671
3830.4 728312671 727992952 727576792 727731347 728826582 729629815 730099082 730446756 729771733 727780700
3848.7 727780700 725906432 727523327 731212914 731475294 730089784 729161978 729215145 729532957 729091763
3867.1 729091763 729210377 730199099 730726302 730691254 729923248 729584634 729977071 730093658 730709374 730856180
3887.5 730856180 730281055 730755985 731138825 730099380 728961527 728796780 729507148 730787814 731739283
3905.8 731739283 731716692 731316745 730827332 730203629 730055690 730547369 730796695 730583370 730545580 730584204
3926.2 730584204 730265975 730168879 730681181 731041372 730885148 730537415 730306327 730429649 730519056 730350792
3946.6 730350792 730365932 730505645 730522215 730489910 730430245 730319321 730256915 730271697 730230927 730124295 730053425
3969.1 730053425 730073631 730160594 730246484 730263948 730204284 730207920 730306745 730282187 730110466 729986489 729942501
3991.5 729942501 729936898 729999900 730066657
3997.6 730066657
##END=$$ End of the data block
