##TITLE=$$ Begin of the data block
##JCAMP-DX=5.00 $$ ACD/SpecManager v 10.08
##SPECTROMETER/DATA SYSTEM=Alpha
##DATE=10 Nov 2014 10:35:34
##DATA TYPE=INFRARED SPECTRUM
##DATA CLASS=XYDATA
##ORIGIN=
##OWNER=
##NPOINTS=1765
##FIRSTX=399.76428223
##LASTX=3997.64306641
##MAXX=3997.64306641
##MINX=399.76428223
##MAXY=0.80531257
##MINY=0.44496870
##XFACTOR=1.0000000000
##YFACTOR=1.000000000000000e-9
##FIRSTY=0.66754842
##DELTAX=2.03961372
##XUNITS=1/CM
##YUNITS=ARBITRARY UNITS
##XYDATA=(X++(Y..Y))
399.8F67548418J48535R79602N32389j288235k476991j620173J38104J37389k167881
418.1F61931157k741933k77638N19872m57526j266777n65589P64191O46711q28028
436.5F57724440j430571k75075P99417J04547j035035n46336M70876r477j452028j794577
456.9F52556181l54350N70715m04597j532912r52840K70784j17778j427174j262367
475.2F47345662K67089Q69810m25100j649678q46446N16534J87815j053095j034260
493.6F44178331J20163K28762j151919k157986j319468J10507j20759j706660k148628
511.9F36032343j078367o01769j331150j739681j011670k75731o27756j473725j354575
530.3F26537919k60234L73006q2910l97384N54323J612306J384675N37515O8426K07305
$$ plain form
399.8 667548418 667696953 668676555 669208944 667920709 665443718 663823545 663961649 664099038 661931157
418.1 661931157 659189224 658911586 659431458 658973932 657707155 657141566 657905757 658552468 657724440
436.5 657724440 656293869 656018794 656818211 656922758 655887723 655341387 655812263 655802786 654350758 652556181
456.9 652556181 652201831 652772546 652367949 650835037 649882197 650152981 650035203 648608029 647345662
475.2 647345662 647612751 648482561 648057461 646407783 645561337 646077871 646265686 645212591 644178331
493.6 644178331 644298494 644527256 643375337 641217351 639897883 640008390 639887631 638180971 636032343
511.9 636032343 634953976 634352207 633021057 631281376 630269706 629993975 629366219 627892494 626537919
530.3 626537919 626277685 626650691 626567781 626170397 626724720 628337026 629721701 630259216 630327642 630534947
550.7F30534947L88145j42753p60257l90172M26173M92931j28329m64678j11639K14934
571.1F30059302j01268m53115p0512N79655N75840P5341j10746J96457N46694L58224
591.5F31655872k53856k37346L60847L97861k55406o60301m46438j91749m00126j169145
611.9F28800213j736521j098872L39747J361728J715660J993775K422929K546847J887381
630.2F38232887R70304P22229J116157J248538Q32975P45178J357078J755655J365602
648.6F48346603P33733O83248J165211J184643M84645r7215M2796L07381J18911N16475
669F53486431J412034J757204K098203J905084J150965J031935J705766J814962R06705
687.3F67269289K19942O09278J208961Q59142r2924j74403R07004J663327J186430
$$ plain form
550.7 630534947 630923092 630780339 630020082 629629910 630056083 630549014 630420685 629956007 629844368 630059302
571.1 630059302 629958034 629504919 629434407 630014062 630589902 630665243 630554497 630750954 631297648 631655872
591.5 631655872 631402016 631164670 631525517 631923378 631667972 631007671 630561233 630369484 629969358 628800213
611.9 628800213 627063692 625964820 626304567 627666295 629381955 631375730 633798659 636345506 638232887
630.2 638232887 639203191 639925420 641041577 642290115 643123090 643868268 645225346 646981001 648346603
648.6 648346603 649080336 649763584 650928795 652113438 652598083 652500868 652543664 652851045 652969956 653486431
669 653486431 654898465 656655669 658753872 660658956 661809921 662841856 664547622 666362584 667269289
687.3 667269289 667489231 668098509 669307470 670166612 670073688 669899285 670806289 672469616 673656046
705.7F73656046N99921J133204K038478J855433Q80480P58469K012194L032505K388954
724.1F88355684J289964J426935K364934K327144J035333K88009J057625J853049J129687
742.4G01128364j11819l1948J057983J212299L2186p57694r2089Q61823N40376m24564
762.8G03414917k45035J068890J700759Q85427R6083P21455J883149J933276J045049
781.2G12503970Q64446J884520K492785J649559O12914Q76129J825333J689613M13835
799.5G24813104k03669N42640J164675N12958l89219k086J186490J301229K1339j143635
819.9G27803826j379072j158536q62717m03226M15266J526057K300382K131283J573801
838.3G31947064J629472J898229J234711j20283p59244k68161K96772J65999j17600
$$ plain form
705.7 673656046 674255967 675389171 677427649 679283082 680163562 680922031 682934225 685966730 688355684
724.1 688355684 689645648 691072583 693437517 695764661 696799994 697088003 698145628 699998677 701128364
742.4 701128364 701016545 700984597 702042580 703254879 703287065 702529371 702437282 703299105 703839481 703414917
762.8 703414917 703169882 704238772 705939531 706824958 706921041 707642496 709525645 711458921 712503970
781.2 712503970 713368416 715252936 717745721 719395280 720008194 720884323 722709656 724399269 724813104
799.5 724813104 724609435 725152075 726316750 726829708 726440489 726438403 727624893 728926122 728947461 727803826
819.9 727803826 726424754 725266218 724403501 724000275 724415541 725941598 728241980 730373263 731947064
838.3 731947064 733576536 735474765 736709476 736589193 735829949 735561788 735858560 736024559 735906959
856.6G35906959K97367J029372R44972Q5175m15861q8751K06828l55363j238406j438260
877G34934032j084507j183331j962542k540231k263725j544237j300692j551330j285613
895.4G20217824l33726L47197K26140k84911n44905n49197p92146j391947j799465
913.7G15094864j602769j175165j075267j235068j125992p17163n67972r82225j661718
932.1G04951525k093196k259135k582133l242612l879905l983915l661930l463507
948.4F79785192l496647l355563k816736k236605k172708k545715k682268k474964
964.7F58003986k544522l194869l981173m390657m584193n077481n865157o307364
981.1F22058570n971312n268514m851640m646599m067480l160060k705455l034591
$$ plain form
856.6 735906959 736204326 737233698 738178670 738263845 737847984 737759233 737966061 737610698 736372292 734934032
877 734934032 733849525 732666194 730703652 728163421 725899696 724355459 723054767 721503437 720217824
895.4 720217824 719884098 720231295 720457435 720172524 719627619 719078422 718286276 716894329 715094864
913.7 715094864 713492095 712316930 711241663 710006595 708880603 708163440 707595468 706613243 704951525
932.1 704951525 702858329 700599194 698017061 694774449 690894544 686910629 683248699 679785192
948.4 679785192 676288545 672932982 670116246 667879641 665706933 663161218 660478950 658003986
964.7 658003986 655459464 652264595 648283422 643892765 639308572 634231091 628365934 622058570
981.1 622058570 616087258 610818744 605967104 601320505 597253025 594092965 591387510 588352919
997.4E88352919l501058l444195l113806l122151l449917l449619k834797k210676
1013.7E63226700k082765k033353j547873q16763l75807l97920m25876l755N29289
1032E56071877N41330J82330Q7202L02255K49148k74003o83308m32789J53482L75152
1052.4E56572676J76012J05918M72426Q48889P18296K33471m6670j4544j27732m83394
1072.8E58455348m99964K94209J467943K101421K019823J878738J968026J803339J056612
1091.2E70545495J84178j99974j27911j45376m44710m51863K67982J211048J636088
1109.6E72474957J669764K004087K659380K902270K435267J871526J870096K278268
1125.9E90165615K461195K316415K183974K177179K018929J337170L69609j26899R0957
$$ plain form
997.4 588352919 584851861 581407666 578293860 575171709 571721792 568272173 565437376 563226700
1013.7 563226700 561143935 559110582 557562709 556745946 556370139 555972219 555546343 555542588 556071877
1032 556071877 556613207 556795537 556882739 557184994 557434142 557160139 556476831 556044042 556197524 556572676
1052.4 556572676 556748688 556854606 557327032 558175921 558894217 559127688 559081018 559066474 558938742 558455348
1072.8 558455348 557955384 558249593 559717536 561818957 563838780 565717518 567685544 569488883 570545495
1091.2 570545495 570729673 570529699 570401788 570256412 569811702 569359839 569627821 570838869 572474957
1109.6 572474957 574144721 576148808 578808188 581710458 584145725 586017251 587887347 590165615
1125.9 590165615 592626810 594943225 597127199 599304378 601323307 602660477 603030086 602903187 602994144
1144.2F02994144M39882M99010O50049J280605K056063K440452K525270K926886L873408
1162.6F19685769M855692N407155N751550O345988P056951P232368O658197N961239
1178.9F68954909N639911N305826M413247L202260K308667J749873R56416k15650j155793
1197.3F91159666j348615j132012j164436j383364j290143r11116q24392j316488j954436
1215.6F79834664k159774k025545k086103k372026k422631k041757j602292j472891
1231.9F63651645j459658j147509o04868k75850k58922j87993J77443N59210N89311
1250.3F61042809L65139L18288N30243O77407O35207O22093Q02935J026511J051128
1268.6F67071760Q73685P50303P59601O92487M14968R0122j7822P1466M9889k52604
$$ plain form
1144.2 602994144 603434026 603933036 604583085 605863690 607919753 610360205 612885475 615812361 619685769
1162.6 619685769 624541461 629948616 635700166 642046154 649103105 656335473 662993670 668954909
1178.9 668954909 674594820 679900646 684313893 687516153 689824820 691574693 692531109 692315459 691159666
1197.3 691159666 689811051 688679039 687514603 686131239 684841096 683929980 683105588 681789100 679834664
1215.6 679834664 677674890 675649345 673563242 671191216 668768585 666726828 665124536 663651645
1231.9 663651645 662191987 661044478 660439610 660163760 659904838 659716845 659894288 660453498 661042809
1250.3 661042809 661407948 661726236 662256479 662933886 663569093 664191186 664994121 666020632 667071760
1268.6 667071760 667945445 668695748 669455349 670147836 670562804 670652926 670635104 670706570 670756459 670503855
1289F70503855o21557q72732j109540j484931j917958k241909k397418k491594k667010
1307.4F54699206k788543k691448k444625k227306k048791j733839j363933j202047
1323.7F38198674j246751j375436j434625j349389j243830j210272j132250p68304
1340F28437817l53455k90692m05968m48286m12285l48747l25859l93927n78403q35419
1360.4F24044776r13739q63552j088441j394629j515985j710772j873553j974583k974212
1378.8F09735310n414665o651282k925277L270865M991114K308011K06411n77152o72221
1397.1F04271114m99487l43978l87907k67685K7418J37449K11775K69055J85490M17113
1417.5F04020357J435340J907467J855612K010465J972318J941442J721144J158893
$$ plain form
1289 670503855 669882298 669009566 667900026 666415095 664497137 662255228 659857810 657366216 654699206
1307.4 654699206 651910663 649219215 646774590 644547284 642498493 640764654 639400721 638198674
1323.7 638198674 636951923 635576487 634141862 632792473 631548643 630338371 629206121 628437817
1340 628437817 628084362 627793670 627387702 626939416 626527131 626178384 625852525 625458598 624880195 624044776
1360.4 624044776 623131037 622267485 621179044 619784415 618268430 616557658 614684105 612709522 609735310
1378.8 609735310 604320645 597669363 594744086 598014951 603006065 605314076 605520487 604943335 604271114
1397.1 604271114 603771627 603427649 603039742 602772057 602799475 602936924 603148699 603417754 603603244 604020357
1417.5 604020357 605455697 607363164 609218776 611229241 613201559 615143001 616864145 618023038
1433.9F18023038J285493J992584J718223J200199R10759P47204Q66651R44257O11544
1452.2F28299952K57790J006961L006696K954006K106429K502679L292084L097534
1468.5F46524131L192902M920542O118775N368351M254699L320992K541125J434743
1484.9F77676260K56598m86195p23183j230538k347707l306389l187955k901256l207147
1503.2F60542488m246533m599392k343953j595914k132118k377689j832366r57429
1519.5F40457094l51250j87457n39601p72774r03309j245498j293719j157045j562715
1537.9F32443726j622856l23891M20093M01736K63512L14355M27723K60293j75893
1556.2F32408798L52263K154052J291395J36971l70264p85053q80062j143515j905799
$$ plain form
1433.9 618023038 619308531 621301115 623019338 624219537 625130296 625877500 626744151 627688408 628299952
1452.2 628299952 628557742 629564703 632571399 635525405 637631834 640134513 643426597 646524131
1468.5 646524131 649717033 654637575 660756350 666124701 670379400 673700392 676241517 677676260
1484.9 677676260 677932858 677446663 676723480 675492942 673145235 669838846 666650891 663749635 660542488
1503.2 660542488 656295955 651696563 649352610 647756696 645624578 643246889 641414523 640457094
1519.5 640457094 640105844 639918387 639378786 638606012 637702703 636457205 635163486 634006441 632443726
1537.9 632443726 630820870 630496979 630917072 631318808 631582320 631896675 632324398 632584691 632408798
1556.2 632408798 632761061 634915113 636206508 636343479 635973215 635188162 634308100 633164585 631258786
1574.6F31258786k418697k264738k592981l279984l641427l850639m057228m169941
1590.9F04983151m068911l843784l547550l376722l344059l232598l096581l088236
1607.2E77384710l133416l072619l094316l444791l533661k718210k590716k941191
1623.5E52855790k788186k676428k542615k143621j912832j415730k66671J13249k7657
1641.9E39195299k33650P3314R34004O58274N49436K267658K353788J550078J606643
1660.3E48954844K290726K794504K298653K545655L754378L685593L901899M689515
1676.6E74915767M142582L344953L926575O646812O592214N219579N324304M711569
1692.9F14824355N045473N959809O207466P592738O156564M879355N143702M218578
$$ plain form
1574.6 631258786 628840089 626575351 623982370 620702386 617060959 613210320 609153092 604983151
1590.9 604983151 600914240 597070456 593522906 590146184 586802125 583569527 580472946 577384710
1607.2 577384710 574251294 571178675 568084359 564639568 561105907 558387697 555796981 552855790
1623.5 552855790 550067604 547391176 544848561 542704940 540792108 539376378 539109707 539222956 539195299
1641.9 539195299 538961649 539034963 539968967 540627241 541176677 543444335 545798123 547348201 548954844
1660.3 548954844 551245570 554040074 556338727 558884382 562638760 566324353 570226252 574915767
1676.6 574915767 579058349 582403302 586329877 592976689 599568903 604788482 610112786 614824355
1692.9 614824355 619869828 625829637 632037103 639629841 645786405 650665760 655809462 660028040
1709.2F60028040K997399K104282J779080K564191K835393J844287J313746J185179
1725.5F76651597P86543L60548J58668R46999J799404J263559J360238K021491K248883
1743.9F87597930K277494K527177L635705M627883M085839L752172L889680L701448
1760.2G16095328M042149L881514L130972K864659K936900L559410L536582K538801
1776.5G42586315K067327K134860K062559J834869J627684J249432J128853J645028
1792.8G56336927J721681J308679J212478J407921J432955J214922J089275J047432
1809.2G66772270J049578J003325R86219J091361J027405O38783M32372O78838P74323
1827.5G74454474Q52883J103044R87172Q11279P68602M41372N6326M27008J142502
$$ plain form
1709.2 660028040 663025439 665129721 666908801 669472992 672308385 674152672 675466418 676651597
1725.5 676651597 677438140 677798688 677957356 678904355 680703759 681967318 683327556 685349047 687597930
1743.9 687597930 689875424 692402601 696038306 700666189 704752028 708504200 712393880 716095328
1760.2 716095328 720137477 724018991 727149963 730014622 732951522 736510932 740047514 742586315
1776.5 742586315 744653642 746788502 748851061 750685930 752313614 753563046 754691899 756336927
1792.8 756336927 758058608 759367287 760579765 761987686 763420641 764635563 765724838 766772270
1809.2 766772270 767821848 768825173 769811392 770902753 771930158 772568941 773001313 773680151 774454474
1827.5 774454474 775307357 776410401 777397573 778208852 778977454 779418826 779475152 779902160 781044662
1845.9G81044662J032293O57856N50330O23703O50764M98890L76761M05550L61026
1864.2G86201835J14739J85370O92248Q53718O70254M37796K74062K96176M19736M13000
1884.6G90558934J92404J30773M18603N36978L95775K95341K72215L53336M02629K49207
1905G93806195P3970J88231M43757L79383M0889k2650K47777L28541L02434K62975
1925.4G96051502J85788K52426K85983J34051J6272N8889O3717L7253J00255J70887
1945.8G97357023K56538K66969P8261q2612O020J68324J71065J8716j00374K1994K60413
1968.3G98422337K37643K0206n0008P8559J49369R954j01864l2366O7890L994j18971
1990.7G98686743j4305J84595J80185K3484r9957p5936N1320N6028q6248j54912j06216
$$ plain form
1845.9 781044662 782076955 782734811 783285141 783908844 784559608 785058498 785435259 785840809 786201835
1864.2 786201835 786316574 786501944 787194192 788047910 788718164 789155960 789430022 789726198 790145934 790558934
1884.6 790558934 790751338 790882111 791300714 791837692 792233467 792528808 792801023 793154359 793556988 793806195
1905 793806195 793880165 794068396 794512153 794891536 794932425 794909775 795157552 795486093 795788527 796051502
1925.4 796051502 796237290 796489716 796775699 796909750 796926022 796984911 797048628 797085881 797186136 797357023
1945.8 797357023 797613561 797880530 797958791 797876179 797882199 798050523 798221588 798240304 798139930 798161924 798422337
1968.3 798422337 798659980 798680186 798630178 798708737 798858106 798868060 798766196 798733830 798801720 798805714 798686743
1990.7 798686743 798672438 798857033 799037218 799060702 798960745 798884809 798936129 798992157 798905909 798750997 798644781
2013.1G98644781o0558n1737q8096j24275q3566m9770q2314j31249j21177m4644K027
2035.6G97809422q4519j94312j08361O1512O1870o6459j12057l1292N6326K4736q1062
2058G97335804j04905l9756J9312j252o1214j7881J08302R2566l5644m1187P4744J24932
2082.5G97453821K2411r2626m3451J11937J56045O0976n663O6936J63734J18852j8656
2104.9G97994316l3796J09851J69456N8115m2677L2603J83702J80185M1485k206J03414
2127.3G98794448J63615N4538p3790J3590K03967K16782P7367J1921J10983K21968
2147.7G99795389J62661O616Q822J88827K71321J48594N4240J29700K45929K40385
2168.1H01252484J12236M8101J59561K89202K20239N7638N7101J95086K48313J44422
$$ plain form
2013.1 798644781 798584223 798532486 798444390 798320115 798236549 798186779 798104465 797973216 797852039 797807395 797809422
2035.6 797809422 797724903 797530591 797422230 797483742 797545612 797479153 797367096 797335804 797392130 797416866 797335804
2058 797335804 797230899 797191143 797210455 797209203 797147989 797130108 797238410 797330976 797295332 797254145 797328889 797453821
2082.5 797453821 797476232 797383606 797340155 797452092 797608137 797669113 797663450 797730386 797894120 798012972 797994316
2104.9 797994316 797960520 798070371 798239827 798297942 798255265 798287868 798471570 798651755 798693240 798691034 798794448
2127.3 798794448 798958063 799012601 798938811 798952401 799156368 799373150 799450517 799462438 799573421 799795389
2147.7 799795389 799958050 799964666 799973488 800162315 800433636 800582230 800636470 800766170 801012099 801252484
2168.1 801252484 801364720 801412821 801572382 801861584 802081823 802139461 802196562 802391648 802639961 802784383
2188.5H02784383N1439J05441K21312K21610J00195L3856J26838K19942J36733J0192
2208.9H04011941L0398J43469J64091M6730r834J08361J90437Q9407l5286q822R6381
2231.4H04827273J19686N2452k5809L279J02639Q3446j7643l8922L3737R7155M0889
2253.8H05278182p5817n6923O1632P6830k6047p1407N246P6830M4048n5015p1466J7643
2278.3H05203736N4717m8816j65165j35362o3360j30951k57671k57969j69992j62900
2298.7H03866267k69651l75211l89398l61323l92437m42862l97802l72946n33760o91831
2319.1G99639046o23047m71175m45783n24282m84825l02255k88725m08232m20809l48866
2339.5G95321047j40845L96072Q05617J55210r31263j493573j450479j122594p35938
$$ plain form
2188.5 802784383 802835822 802941263 803162575 803384185 803484380 803518236 803645074 803865016 804001749 804011941
2208.9 804011941 804042339 804185808 804349899 804396629 804386795 804495156 804685593 804775000 804739714 804730892 804827273
2231.4 804827273 804946959 804999411 804973602 804976881 805079520 805162966 805145323 805106401 805140138 805237293 805278182
2253.8 805278182 805202365 805145442 805207074 805283904 805257857 805186450 805191696 805268526 805312574 805257559 805186093 805203736
2278.3 805203736 805258453 805209637 805044472 804909110 804845750 804714799 804457128 804199159 804029167 803866267
2298.7 803866267 803596616 803221405 802832007 802470684 802078247 801635385 801237583 800864637 800330877 799639046
2319.1 799639046 799015999 798544824 798099041 797574759 797089934 796787679 796498954 796090722 795669913 795321047
2339.5 795321047 795180202 795576274 796381891 796537101 795605838 794112265 792661786 791539192 790803254
2357.8G90803254l34919N8949L74437N55574O38903O73830O88970O54876N73457N10633
2378.2G95197964M31776K57849K1577j78873k94447l78728m45664m41849l75450k88963
2398.6G93505192k34664k24590k08735k10882k74360l34859l37779l19481l27051l67939
2419G90664852m05312m12345m33743m29332l26932k31087k31862k82347l37601l66568
2439.4G87207723l45648l33547l75212l98099l47257l10957l61085m23789m36187m12702
2459.8G83463240m05610m08828l95715l88444l87728m15862m99606n49018m75943l93570
2480.2G79142916m29690m83930m48346m20153m52221m53650m14014m00663m23193m33564
2500.6G74783492m37200m14491l67820l81291m07636l94642l80814l68596l73661m22180
$$ plain form
2357.8 790803254 790468335 790527284 790901721 791457295 792096198 792770028 793458998 794113874 794687331 795197964
2378.2 795197964 795629740 795887589 795909166 795730293 795435846 795057118 794611454 794169605 793794155 793505192
2398.6 793505192 793270528 793045938 792837203 792626321 792351961 792017102 791679323 791359842 791032791 790664852
2419 790664852 790259540 789847195 789413452 788984120 788657188 788426101 788194239 787911892 787574291 787207723
2439.4 787207723 786862075 786528528 786153316 785755217 785407960 785097003 784735918 784312129 783875942 783463240
2459.8 783463240 783057630 782648802 782253087 781864643 781476915 781061053 780561447 780012429 779536486 779142916
2480.2 779142916 778713226 778229296 777780950 777360797 776908576 776454926 776040912 775640249 775217056 774783492
2500.6 774783492 774346292 773931801 773563981 773182690 772775054 772380412 771999598 771631002 771257341 770835161
2521G70835161m51803m15504l84271l72291l59237l93867m30882m08054l89874m00960
2541.4G66828418l91603l76761l97443m27366m42266m49062m31954m18962m30345m43161
2561.8G62619495m34458l96430l88146m46558m85301m43816m09186m31418m61817m72307
2582.2G58250058m74215m90665n21541n41747n13792m60624m56810n12958n54442n23567
2602.6G53199697m70996m80652n49197n43297m40359m42803n65409n95272n06341m46797
2623G48158574m61578n23031n69880n31077n08488n80847o25551n75482n01574m84109
2643.4G42796957n55157o41167o13094n30779n39839n88000n67079n02169n04792n83231
2663.7G37171650o21498n66244m91559n10812n83112n76079n33343n54978o03498o21080
$$ plain form
2521 770835161 770383358 769967854 769583583 769211292 768852055 768458188 768027306 767619252 767229378 766828418
2541.4 766828418 766436815 766060054 765662611 765235245 764792979 764343917 763911963 763493001 763062656 762619495
2561.8 762619495 762185037 761788607 761400461 760953903 760468602 760024786 759615600 759184182 758722365 758250058
2582.2 758250058 757775843 757285178 756763637 756221890 755708098 755247474 754790664 754277706 753723264 753199697
2602.6 753199697 752728701 752248049 751698852 751155555 750715196 750272393 749706984 749111712 748605371 748158574
2623 748158574 747696996 747173965 746604085 746073008 745564520 744983673 744358122 743782640 743281066 742796957
2643.4 742796957 742241800 741600633 740987539 740456760 739916921 739328921 738761842 738259673 737754881 737171650
2663.7 737171650 736550152 735983908 735492349 734981537 734398425 733822346 733289003 732734025 732130527 731509447
2684.1G31509447n87582n39125n59389o33776o53088n85199n20348n50330o42180o64413
2704.5G25574017o03021n96344o87778p51019o95407n86510n59866o42061o78182o20365
2724.9G19153464o01709o37889o40631n71668m89294n07534o03318o05762m86672m17709
2745.3G13591278m89653n66840n27858m72486n06938n98192o32286n51045m47691m49657
2765.7G08348632n53548o02603n45800n18322n93186o88135p12157o80148o70850p00832
2786.1G02083051o98209o70969o98090p74741q11875p94887q07464q52645q96513q99315
2806.5F94178343q76188r21786r97246j042187j069784j062751j079619j172960j269400
2824.9F84686422j312077j323998j381755j525878j674116j779139j994491k408325
$$ plain form
2684.1 731509447 730921865 730382740 729823351 729189575 728536487 727951288 727430940 726880610 726238430 725574017
2704.5 725574017 724970996 724374652 723686874 722935855 722240448 721653938 721094072 720452011 719773829 719153464
2724.9 719153464 718551755 717913866 717273235 716701567 716212273 715704739 715101421 714495659 714008987 713591278
2745.3 713591278 713101625 712534785 712006927 711534441 711027503 710429311 709797025 709245980 708798289 708348632
2765.7 708348632 707795084 707192481 706646681 706128359 705535173 704847038 704134881 703454733 702783883 702083051
2786.1 702083051 701384842 700713873 700015783 699241042 698429167 697634280 696826816 695974171 695077658 694178343
2806.5 694178343 693302155 692380369 691383123 690340936 689271152 688208401 687128782 685955822 684686422
2824.9 684686422 683374345 682050347 680668592 679142714 677468598 675689459 673694968 671286643
2841.2F71286643k864898l237307l413379l158331k358436j307965m90248j26064j93298
2859.5F54136717n01394p97450j025260j235366j322865j175523r69589q38220o97374
2877.9F45573676n95212o05345o64234p40767q57651r67264r97603r92239j089513
2896.3F38063848j266420j322567j278639j322866j504719j769066k083361k455890
2912.6F25060320k777457k805174k410114j747548j098931n94377j51098K37405M67241
2930.9F14180267O57856R18866J177132J431346J644075J622259J345098J036108Q26060
2949.3F24839067O52910M22179K53380L17037N54085Q42452J082182J269757J459778
2967.6F31692827J614511J742720J813472J750171J659274J564205J372814J197696
$$ plain form
2841.2 671286643 668421745 665184438 661771059 658612728 656254292 654946327 654456079 654330015 654136717
2859.5 654136717 653635323 652837873 651812613 650577247 649254382 648078859 647109270 646271050 645573676
2877.9 645573676 644978464 644373119 643708885 642968118 642110467 641143203 640145600 639153361 638063848
2896.3 638063848 636797428 635474861 634196222 632873356 631368637 629599571 627516210 625060320
2912.6 625060320 622282863 619477689 617067575 615320027 614221096 613626719 613475621 613713026 614180267
2930.9 614180267 614838123 615756989 616934121 618365467 620009542 621631801 622976899 624013007 624839067
2949.3 624839067 625491977 625914156 626167536 626484573 627038658 627881110 628963292 630233049 631692827
2967.6 631692827 633307338 635050058 636863530 638613701 640272975 641837180 643209994 644407690
2984F44407690J123666J065255R67800P78973N18739L29257J40786j18196k69354l02910
3004.4F48641706l37720l56794l48329l86536m86911n91099o91533p83444p93993p69675
3024.7F43095672q13126q27015p64906p26044p75516q80421r04500q56042q61049r39369
3045.1F34747684r94802r51349q93593q97586r30071r65357r55463q77201p80821o76215
3065.5F25825226o40928p50542q18372p33673o15120n59092o23286p15792p25388p21932
3085.9F18921101o94871o44863p12871q01504p31945o26445o62565q01265q51929p42674
3106.3F11650169o79851p93218q59678p83265p72595q91507j051307j173019j138389
3124.7F03507340r85384r38714j058220j181126j162887j045167j022875j148522j259804
$$ plain form
2984 644407690 645531356 646596611 647564411 648343384 648862123 649191380 649332166 649213970 648944616 648641706
3004.4 648641706 648303986 647947192 647598863 647212327 646725416 646134317 645442784 644659340 643865347 643095672
3024.7 643095672 642282546 641455531 640690625 639964581 639189065 638308644 637404144 636548102 635687053 634747684
3045.1 634747684 633752882 632801533 631907940 631010354 630080283 629114926 628159463 627282262 626501441 625825226
3065.5 625825226 625184298 624433756 623615384 622881711 622266591 621707499 621084213 620368421 619643033 618921101
3085.9 618921101 618226230 617581367 616868496 616066992 615335047 614708602 614046037 613244772 612392843 611650169
3106.3 611650169 610970318 610177100 609317422 608534157 607761562 606870055 605818748 604645729 603507340
3124.7 603507340 602521956 601583242 600525022 599343896 598181009 597135842 596112967 594964445 593704641
3143E93704641j260281j182317j098633j101673j219213j354933j378715j344561j335323
3161.4E82428992j293302j244545j274109j324415j319587j294434j266420j258493
3177.7E72153687j315355j369953j341224j286804j272977j289606j296162j262248
3194E61719358j252890j286089j274467j195192j114249j120687j196503j197338j106084
3212.4E50975859j080870j149655j155972j089454j072705j100898j130640j125038
3228.7E42070627j055717j051963j174926j236141j177669j154959j148343j074254
3245E32996655j057804j153708j217663j198947j164437j150429j144230j139283j126230
3263.4E22643924j103163j065612j022339j051128j115739j107573j063645j039863
$$ plain form
3143 593704641 592444360 591262043 590163410 589061737 587842524 586487591 585108876 583764315 582428992
3161.4 582428992 581135690 579891145 578617036 577292621 575973034 574678600 573412180 572153687
3177.7 572153687 570838332 569468379 568127155 566840351 565567374 564277768 562981606 561719358
3194 561719358 560466468 559180379 557905912 556710720 555596471 554475784 553279281 552081943 550975859
3212.4 550975859 549894989 548745334 547589362 546499908 545427203 544326305 543195665 542070627
3228.7 542070627 541014910 539962947 538788021 537551880 536374211 535219252 534070909 532996655
3245 532996655 531938851 530785143 529567480 528368533 527204096 526053667 524909437 523770154 522643924
3263.4 522643924 521540761 520475149 519452810 518401682 517285943 516178370 515114725 514074862
3279.7E14074862r96232r29892q89778q66890q39651q22365q21054q42571q96216q95858
3300.1E05274355p74145o87837p90060r63032j090050j148134j091302j018852j018524
3318.4D96692419j037359j050413j099467j223087j329840j330346j273781j201003
3334.8D87147123j138956j205831j349956j374275j359701j349628j269042j296997
3351.1D76802737j451135j473040j338988j242429j273036j293808j164258j074105
3367.4D66491938j225055j448631j447230j236648j088828j089304j120538j055390
3383.7D56780314r07599p37578o18875p07507r04709q84802o45488n16445o81579q92132
3404.1D49283600p92802n78314n04464m79847n05656n22524m26888l03537j69873l0995
$$ plain form
3279.7 514074862 513078630 512148738 511258960 510392070 509552419 508730054 507909000 507066429 506170213 505274355
3300.1 505274355 504500210 503812373 503022313 502059281 500969231 499821097 498729795 497710943 496692419
3318.4 496692419 495655060 494604647 493505180 492282093 490952253 489621907 488348126 487147123
3334.8 487147123 486008167 484802336 483452380 482078105 480718404 479368776 478099734 476802737
3351.1 476802737 475351602 473878562 472539574 471297145 470024109 468730301 467566043 466491938
3367.4 466491938 465266883 463818252 462371022 461134374 460045546 458956242 457835704 456780314
3383.7 456780314 455872715 455135137 454516262 453808755 452904046 452019244 451373756 450857311 450175732 449283600
3404.1 449283600 448490798 447912484 447408020 446928173 446422517 445899993 445473105 445169568 444999695 444968700
3424.5D44968700N3645J38491J97291K35230K74062J91033O8277J24425L12000N05090
3444.9D47068244O55920O77049O57230P13229P99746R24349J018852R30935R28700
3463.2D54374254J210302J382500J161873Q64327R27657J196086J349092J292378J135736
3481.6D64894205J184553J401842J449436J360565J369715J462877J530379J466572
3497.9D76120144J419544J566589J591057J386791J441211J718163J824320J701414
3514.2D88769233J535386J530171J678764J911790J923561J751631J823813J974523
3530.6E02898872J996398K093196K165675K048910K001524K107560K296329K319157
3546.9E19927621K103686K167285K465665K450168K310932K407193K378106J968026
$$ plain form
3424.5 444968700 445022345 445160836 445358127 445593357 445867419 446058452 446126729 446251154 446563154 447068244
3444.9 447068244 447724164 448401213 449058443 449771672 450571418 451495767 452514619 453445554 454374254
3463.2 454374254 455584556 456967056 458128929 458993256 459920913 461116999 462466091 463758469 464894205
3481.6 464894205 466078758 467480600 468930036 470290601 471660316 473123193 474653572 476120144
3497.9 476120144 477539688 479106277 480697334 482084125 483525336 485243499 487067819 488769233
3514.2 488769233 490304619 491834790 493513554 495425344 497348905 499100536 500924349 502898872
3530.6 502898872 504895270 506988466 509154141 511203051 513204575 515312135 517608464 519927621
3546.9 519927621 522031307 524198592 526664257 529114425 531425357 533832550 536210656 538178682
3563.2E38178682K191365L510475L718376K728045K502382K822340K989411L109992
3579.5E61751068L008127K540231K730548L884137L860056K834380K902686L448963
3595.8E86960196L501893L561735L492832K858281K677202L467679L765464L489077
3612.1F13774359L283322K894819L708541M723192L389060J624167J677752M460215
3628.5F39535427N596101L399671K875506L051460K874375K760291K111256J160860
3644.8F63364947J753449M775763N477607K461076J892209L355086K992034K028465
3661.1F88100636J713514R76265O06477J998961K312541J077414K796530L562391J661658
3679.4G04806387J028240N78404J18911J153648K839505K316297J011133N62191L37541
$$ plain form
3563.2 538178682 540370047 543880522 547598898 550326943 552829325 555651665 558641076 561751068
3579.5 561751068 564759195 567299426 570029974 573914111 577774167 580608547 583511233 586960196
3595.8 586960196 590462089 594023824 597516656 600374937 603052139 606519818 610285282 613774359
3612.1 613774359 617057681 619952500 623661041 628384233 631773293 633397460 635075212 639535427
3628.5 639535427 645131528 648531199 651406705 654458165 657332540 660092831 662204087 663364947
3644.8 663364947 665118396 669894159 675371766 677832842 679725051 683080137 686072171 688100636
3661.1 688100636 689814150 690790415 691396892 693395853 695708394 696785808 699582338 703144729 704806387
3679.4 704806387 705834627 706413031 706531942 707685590 710525095 712841392 713852525 714414716 714752257
3697.8G14752257N70595J470268J201332j55211m75824R35793K549410J475155j47283
3716.2G22176492l09586J14083L81947N67197N96226k46823r15826j40190J585007
3734.5G23808527K276957M44174j583874p32124J850843P56920l63470J939357K142608
3752.9G30539918n2452l68953Q00848Q25107j38461j49072K30909Q51154J127839K14577
3773.3G33881414m46796o1989P46250N53667N6744L33190L67284O3777k49624m62413
3793.7G34781504k19524l92616j43170J191556N90265L26693J213312K6643j356065
3812G36018598q29816M75884J6153L64899J588881L28779l57866k53200l67880k97725
3832.4G36686707l96371J44839J057148P64429M59552L65734o80863k014995j820803
$$ plain form
3697.8 714752257 715322852 716793120 717994452 717839241 717363417 718299210 720848620 722323775 722176492
3716.2 722176492 721866906 721980989 722362936 722930133 723526359 723279536 722363710 722223520 723808527
3734.5 723808527 726085484 726529658 724945784 724213660 726064503 726821423 726457953 728397310 730539918
3752.9 730539918 730487466 730118513 730919361 731744468 731606007 731456935 731687844 732538998 733666837 733881414
3773.3 733881414 733434618 733372629 734118879 734672546 734729290 735062480 735429764 735493541 735243917 734781504
3793.7 734781504 734561980 734169364 734026194 735217750 735808015 736134708 737348020 737374663 736018598
3812 736018598 735188782 735664666 735680819 736045718 737634599 737963378 737605512 737352312 736984432 736686707
3832.4 736686707 736290336 736435175 737492323 738256752 738716304 739082038 738401175 736386180 734565377
3850.8G34565377J725853L693402K08199j442433r75072Q8095L95775m52995P4267
3869.1G37880468R96352N41150R299p09057l20614L88623N2630N39065J65760n41389
3889.5G39002287M90547M45902r74357j144409k14994O64830J249254R57787j908l70800
3909.9G40104139m49836o20187j98126M50135K28345k44796k5511Q6486k95221p3493
3930.3G38961935N77569M15623j84715m16457k77817R2744N8771j83106O0856K54751
3950.7G39360154J04427l3557j11700j49726j5140J02043k6047j23680n0962K0683
3971.1G39076495N9426P7546J4484l2723K0980M8101k6106p7486o1989p1407o0916
3993.5G38966405Q941L7253
$$ plain form
3850.8 734565377 736291230 739984632 740192831 738750398 737775326 737863421 738259196 737806201 737880468
3869.1 737880468 738876820 739417970 739427269 738718212 738397598 738786221 738838851 739377916 739543676 739002287
3889.5 739002287 739492834 739938736 738964379 737819970 737604976 738269806 739519060 740476847 740474939 740104139
3909.9 740104139 739654303 739034116 738835990 739286125 739514470 739269674 739244163 739330649 739035428 738961935
3930.3 738961935 739539504 739955127 739770412 739353955 739076138 739168882 739227653 739044547 739105403 739360154
3950.7 739360154 739464581 739431024 739319324 739169598 739154458 739256501 739230454 739106774 739055812 739076495
3971.1 739076495 739135921 739213467 739227951 739195228 739216208 739264309 739238203 739160717 739098728 739027321 738966405
3993.5 738966405 738975346 739012599
3997.6G39012599
$$ plain form
3997.6 739012599
##END=$$ End of the data block
