##TITLE=$$ Begin of the data block
##JCAMP-DX=5.00 $$ ACD/SpecManager v 10.08
##SPECTROMETER/DATA SYSTEM=16PC
##DATE=16 Jul 2013 11:01:38
##DATA TYPE=INFRARED SPECTRUM
##DATA CLASS=XYDATA
##ORIGIN=
##OWNER=
##NPOINTS=3601
##FIRSTX=400.00000000
##LASTX=4000.00000000
##MAXX=4000.00000000
##MINX=400.00000000
##MAXY=42.47150421
##MINY=4.75253963
##XFACTOR=1.0000000000
##YFACTOR=0.000000100000000
##FIRSTY=42.47150421
##DELTAX=1.00000000
##XUNITS=1/CM
##YUNITS=TRANSMITTANCE
##XYDATA=(X++(Y..Y))
$$ plain form
400 424715042 420997849 407470207 390238037 370431671 349795799 332591286 323079338 323000641
408 323000641 341807098 360625267 358745804 351128082 346340866 342845192 343406906 343679886 338553658
417 338553658 333085518 331780434 331184616 328432083 326262474 326524010 329025040 335357437 342014999
426 342014999 345458260 347379456 348666649 348189354 344024162 339435577 337693672 336856842 336526375
435 336526375 335342636 329838753 325937042 331570358 337238312 333090782 328108521 329577179 332729568
444 332729568 334888458 337068329 339350204 341854782 344586372 347971916 354072800 357987862 353166084
453 353166084 346617928 343261719 342822304 348585129 354784470 355492592 354480515 353349686 352680893
462 352680893 354434738 356071930 355342369 353337746 349826088 346525192 345885506 345475197 342901459
$$ packed form
400D24715042l717193j3527642j7232170j9806366k0635872j7204513r511948p8697
408C23000641J8806457J8818169j879463p617722m787216l495674N61714K72980n126228
417C38553658n468140j305084n95818k752533k169609K61536K501030O332397O657562
426C42014999L443261J921196J287193m77295m165192m588585j741905q36830l30467
435C36526375j183739n503883l901711N633316N667954m147530m982261J468658L152389
444C32729568K158890K179871K281875K504578K731590L385544O100884L915062m821778
453C53166084o548156l356209m39415N762825O199341P08122j012077j130829o68793
462C52680893J753845J637192p29561k004623l511658l300896o39686m10309k573738
$$ plain form
471 342901459 340496750 340005646 340795975 343387108 346068840 346500626 347091179 350470772 353634109
480 353634109 354354858 352923126 347350121 342243881 343213310 345263939 344300995 343233337 344149590
489 344149590 345415115 346328735 346177826 343335152 339840889 337941399 335390320 329391937 323839417
498 323839417 322466850 322953949 324075928 326280365 330241928 334050636 335098038 336153030 339713821
507 339713821 343984604 348563423 351764183 351041069 348571281 345234871 342376938 342233162 343008728
516 343008728 343581924 344168396 344498634 344906311 345379105 346684456 350615501 354082336 353584290 352143745
526 352143745 351676712 351998329 354127388 356365891 357231140 357095947 355012169 353459358 355821838
535 355821838 358434677 357946396 356800308 356278648 356510391 358535767 360901833 362967224 363336792
$$ packed form
471C42901459k404709m91104P90329K591133K681732M31786N90553L379593L163337
480C53634109P20749j431732n573005n106240R69429K050629r62944j067658R16253
489C44149590J265525R13620j50909k842674l494263j899490k551079n998383n552520
498C23839417j372567M87099J121979K204437L961563L808708J047402J054992L560791
507C39713821M270783M578819L200760p23114k469788l336410k857933j43776P75566
516C43008728N73196N86472L30238M07677M72794J305351L931045L466835m98046j440545
526C52143745m67033L21617K129059K238503Q65249j35193k083778j552811K362480
535C55821838K612839m88281j146088n21660K31743K025376K366066K065391L69568
$$ plain form
544 363336792 358869781 354161263 353723984 354663353 355732651 356500130 355705490 354586105 354242096
553 354242096 353822708 352383347 351305008 351830711 353427162 356743088 359474640 358952026 356919746
562 356919746 353590469 350889664 351814957 353361588 353376389 352298737 349022865 346029968 346268387
571 346268387 347227783 346925964 346724739 347569695 348725052 349840622 350703964 351117592 350683899 348244667
581 348244667 345881462 345800629 346467476 347079735 347643852 347648849 347842941 349171867 350531807 351118546
591 351118546 350975723 349231720 347827682 349313240 350988159 350433807 349354248 348699799 348312836
600 348312836 348639488 348817825 347863197 346586914 345449448 344518433 344230881 343936691 342885742 341813087
610 341813087 341293106 341055145 340833893 341186752 343030930 345020065 345706940 346310349 348049393 349473457
$$ packed form
544C63336792m467011m708518m37279R39369J069298P67479p94640j119385l44009
553C54242096m19388j439361j078339N25703J596451L315926K731552n22614k032280
562C56919746l329277k700805R25293J546631J4801j077652l275872k992897K38419
571C46268387R59396l01819k01225Q44956J155357J115570Q63342M13628m33693k439232
581C48244667k363205q0833O66847O12259N64117M997J94092J328926J359940N86739
591C51118546j42823j744003j404038J485558J674919n54352j079559o54449l86963
600C48312836L26652J78337r54628j276283j137466r31015k87552k94190j050949j072655
610C41813087n19981k37961k21252L52859J844178J989135O86875O03409J739044J424064
$$ plain form
620 349473457 348966370 348242989 349193344 349674683 347483368 344689102 342851639 341293793 339864502
629 339864502 338542213 336992722 336002808 336574783 337725868 338882675 339818459 340151787 339772682
638 339772682 338086853 336163750 335011215 334218750 333481293 333487511 335605125 337489128 336637497 334887733
648 334887733 333026657 331703415 332532158 333402863 332290421 330553055 328703880 327251205 327162476
657 327162476 327570419 327930222 328240623 328038216 328163376 328581810 331452103 343457222 350990067
666 350990067 336303215 318500519 312987785 313111305 319232693 325708847 325188637 323156128 323534241
675 323534241 323654861 321405182 319039803 318364143 318612099 320408325 321383476 317838421 314383259
684 314383259 315590611 317872753 319160690 319467545 317472458 315105896 314493179 313726425 311104774
$$ packed form
620C49473457n07087p23381R50355M81339k191315k794266j837463j557846j429291
629C39864502j322289j549491r89914N71975J151085J156807R35784L33328l79105
638C39772682j685829j923103j152535p92465p37457O218K117614J884003q51631j749764
648C34887733j861076j323242Q28743Q70705j112442j737366j849175j452675q8729
657C27162476M07943L59803L10401k02407J25160M18434K870293J2005119P532845
666C50990067j4686852j7802696n512734J23520O121388O476154n20210k032509L78113
675C23534241J20620k249679k365379o75660K47956J796226R75151l545055l455162
684C14383259J207352K282142J287937L06855j995087k366562o12717p66754k621651
$$ plain form
693 311104774 308129768 305815201 303921700 302968979 301691513 298736801 294885139 290025215 285475960
702 285475960 282860756 281152000 280176620 278994789 276021709 273015976 271686783 270596733 268963089
711 268963089 266529789 262958279 257711639 250016212 240240326 229026299 214777222 195635071
719 195635071 173024883 145991316 119815817 99312773 84925642 80068340 80641022 83653202
727 83653202 89188328 96471300 105085602 114352455 124283304 133881321 145492783 161409378 180797806
736 180797806 204470634 229780197 254889946 278177013 297160378 312576046 324141960 332428207
744 332428207 337391853 340589027 344027519 346307755 346236954 345199814 344263763 343186111 341824532
753 341824532 340944748 341702690 342784157 343065033 343128891 343216896 343230247 343349228 342977028 341342926
$$ packed form
693C11104774k975006k314567j893501r52721j277466k954712l851662m859924m549255
702B85475960k615204j708756r75380j181831k973080l005733j329193j090050j633644
711B68963089k433300l571510n246640p695427r775886j1214027j4249077j9142151
719A95635071k2610188k7033567k6175499k0503044j4387131m857302N72682L012180
727H3653202N535126P282972Q614302R266853R930849R598017J1611462J5916595J9388428
736A80797806K3672828K5309563K5109749K3287067J8983365J5415668J1565914Q286247
744C32428207M963646L197174L438492K280236p0801j037140r36051j077652j361579
753C41824532q79784P57942J081467K80876O3858Q8005J3351J18981l72200j634102
$$ plain form
763 341342926 339147568 336580734 334401588 333731880 333672523 333646049 333809128 334575882 334593506 331826439
773 331826439 328737259 327532768 326942902 326494217 326003075 324898949 323866844 323839645 323501816 321661224
783 321661224 318877926 315062752 310970764 307674866 304130783 299285393 294234734 289066772 285752296
792 285752296 287007332 290681114 296309929 301545601 302990189 303327065 304502239 305329323 305114021
801 305114021 304323902 303027382 301724892 301041603 300668945 300589790 300554504 299894333 299849262 302244186
811 302244186 304652214 304847221 304049244 302375298 300907364 301105499 301950207 303123474 303978424
820 303978424 303594818 302472572 300352097 298588505 299345722 299936752 297538986 294722786 293472519
829 293472519 292723656 292311897 291517258 289286366 286455154 283325653 280445099 278616409 277372589
$$ packed form
763C41342926k195358k566834k179146o69708n9357k6474J63079P66754J7624k767067
773C31826439l089180j204491n89866m48685m91142j104126j032105k7199l37829j840592
783C21661224k783298l815174m091988l295898l544083m845390n050659n167962l314476
792B85752296J255036L673782N628815N235672J444588L36876J175174Q27084k15302
801C05114021p90119j296520j302490o83289l72658p9155l5286o60171m5071K394924
811C02244186K408028J95007p97977j673946j467934J98135Q44708J173267Q54950
820C03978424l83606j122246k120475j763592P57217N91030k397766k816200j250267
829B93472519p48863m11759p94639k230892k831212l129501k880554j828690j243820
$$ plain form
838 277372589 276622524 276038399 275214901 274291992 273161392 272159081 271659603 271435966 271451225 271509628
848 271509628 271326523 271131268 270977249 271104565 272052040 272976151 272980919 272760620 272843819 272830963 272564640
859 272564640 271843414 270361652 268272400 265843391 262423744 257210484 250924568 244181862 236493568
868 236493568 227064133 217426529 207823029 201330185 202336063 207146873 213870277 221488953 228188515
877 228188515 234465599 240211487 245424728 249912491 254140358 258879166 263017883 265301704 266931763
886 266931763 268852940 270578384 272043457 272923927 272717476 271891346 270499229 269277325 269077759
895 269077759 269606590 271077614 272816658 274025917 275287132 276873341 278911819 281674385 284998169
904 284998169 288964729 293110600 296927910 300627708 304382076 307796478 310479870 312591553 314030876
$$ packed form
838B77372589p50065n84125q23498r22909j130600j002311m99478k23637J5259N8403
848B71509628j83105j95255j54019J27316R47475R24111M768k20299Q3199j2856k66323
859B72564640p21226j481762k089252k429009l419647n213260o285916o742706p688294
868B36493568r429435r637604r603500o492844J005878M810810O723404P618676O699562
877B28188515O277084N745888N213241M487763M227867M738808M138717K283821J630059
886B66931763J921177J725444J465073Q80470k06451q26130j392117j221904j99566
895B69077759N28831J471024J739044J209259J261215J586209K038478K762566L323784
904B84998169L966560M145871L817310L699798L754368L414402K683392K111683J439323
$$ plain form
913 314030876 315184593 316576958 317691078 317943325 318056107 318821182 319445839 319156876 318683853 318646183
923 318646183 318600883 318120461 317775726 318217030 318777084 318968048 318898659 318401794 317813873 317424278
933 317424278 317205429 317354908 317485561 317286243 316724052 315401535 314098110 313576927 313487053 313876152
943 313876152 314311028 314319363 314064026 313486805 312777271 312189808 311468353 310296516 309109688 308302631
953 308302631 307680359 307275276 306796532 305990677 304776192 302820206 300622215 298616638 296663990
962 296663990 294895878 292930107 290233116 287387600 284859161 282465210 280076733 277995338 276443939
971 276443939 275528908 275348415 276147842 278702736 281520844 282977810 284242382 286170235 288073540
980 288073540 289483528 290596466 291453114 292048683 292333355 292482605 292830925 292848816 291738968 290635815
$$ packed form
913C14030876J153717J392365J114120K52247J12782P65075O24657k88963m73023l7670
923C18646183m5300m80422l44735M41304N60054J90964o9389m96865n87921l89595
933C17424278k18849J49479J30653j99318n62191j322517j303425n21183q9874L89099
943C13876152M34876Q335k55337n77221p09534n87463p21455j171837j186828q07057
953C08302631o22272m05083m78744q05855j214485j955986k197991k005577j952648
962B96663990j768112j965771k696991k845516k528439k393951k388477k081395j551399
971B76443939r15031j80493P99427K554894K818108J456966J264572J927853J903305
980B88073540J409988J112938Q56648N95569K84672J49250L48320J7891j109848j103153
$$ plain form
990 290635815 290743332 291053772 290830841 290462723 290147533 289716473 289128532 288197746 286551933 284706573
1000 284706573 283155899 281589508 280139427 277972450 274066677 269117355 263622990 257150650 249829750
1009 249829750 240468731 227878799 212179642 191577663 170622330 152591219 139506569 135537615
1017 135537615 137518635 144297590 154000034 164595604 175398579 184766045 193536034 202375412
1025 202375412 210154533 215892792 219806671 221436005 221827011 222002983 221570721 220258465 218724957
1034 218724957 217783928 216696968 214728584 212682476 211075058 210032692 210116615 210536232 210393906
1043 210393906 210570335 211707573 213622093 216376534 219873180 224298477 228862514 232607594 236220818
1052 236220818 240246525 244152527 247680168 250553131 252227783 253245583 253994446 254390469 254522324
$$ packed form
990B90635815J07517L10440k22931l68118l15190m31060n87941r30786j645813j845360
1000B84706573j550674j566391j450081k166977l905773m949322n494365o472340p320900
1009B49829750r361019j2589932j5699157k0601979k0955333j8031111j3084650l968954
1017A35537615J981020O778955R702444J0595570J0802975R367466Q769989Q839378
1025B02375412P779121N738259L913879J629334L91006J75972m32262j312256j533508
1034B18724957r41029j086960j968384k046108j607418j042366Q3923M19617j42326
1043B10393906J76429J137238J914520K754441L496646M425297M564037L745080L613224
1052B36220818M025707L906002L527641K872963J674652J017800P48863L96023J31855
$$ plain form
1061 254522324 254257908 253607502 252229691 249444962 246275406 243876915 241165867 237184029 232709885
1070 232709885 228408566 223659973 218025436 211624374 204370499 196439495 187971115 178986549 169338455
1079 169338455 159672489 150529137 142073383 134875050 128257265 121627798 115302553 109460106 103920212
1088 103920212 98472347 93384018 88834276 84877720 81732264 79084864 76484432 74561110 74020138
1097 74020138 74184885 74686518 75303545 75433006 75849285 77315798 79260340 81341972 83629360
1106 83629360 86214771 88685503 90737572 92136135 92303743 91961136 91741076 91328135 90534439
1115 90534439 89606752 88640442 87898483 87725630 87970963 88619223 89608183 90811005 92402925 94734421
1125 94734421 97151508 98997107 100630512 102061501 103679171 105886450 108650198 112006893 116147747
$$ packed form
1061B54522324k64416o50406j377811k784729l169556k398491k711048l981838m474144
1070B32709885m301319m748593n634537o401062p253875p931004q468380q984566r648094
1079A69338455r665966r143352q455754p198333o617785o629467o325245n842447n539894
1088A03920212n447865n088329m549742l956556l145456k647400k600432j923322n40972
1097G4020138J64747N01633O17027J29461M16279J466513J944542K081632K287388
1106H3629360K585411K470732K052069J398563J67608l42607k20060m12941p93696
1115I0534439r27687r66310p41959j72853K45333O48260R88960J202822J591920K331496
1125I4734421K417087J845599J633405J430989J617670K207279K763748L356695M140854
$$ plain form
1134 116147747 121389141 127389421 133913984 140957108 148559322 156344404 163887253 171371689 178715935
1143 178715935 186290741 194651833 203161240 211309891 219263783 227144699 234572868 241177788 247051239
1152 247051239 252106171 256507874 260421257 263758411 266407471 268601646 270572662 272210579 273554554
1161 273554554 274386635 274551392 273899078 272075405 269538155 266648998 263338318 259416332 255604019
1170 255604019 252606144 250277977 248599510 247899513 248676300 250399342 252730598 255589943 258868675
1179 258868675 262310982 265634289 268808594 271841278 274335365 275645962 276524048 277744751 278591156
1188 278591156 278478127 277784805 276672115 275207024 273390274 271580448 270276527 269056778 267642250
1197 267642250 266099930 264393311 262551537 260509720 258510342 256900787 255298367 253326168 251312962
$$ packed form
1134A16147747N241394O000280O524563P043124P602214P785082P542849P484436P344246
1143A78715935P574806Q361092Q509407Q148651P953892P880916P428169O604920N873451
1152B47051239N054932M401703L913383L337154K649060K194175J971016J637917J343975
1161B73554554Q32081J64757o52314j823673k537250k889157l310680l921986l812313
1170B55604019k997875k328167j678467o99997P76787J723042K331256K859345L278732
1179B58868675L442307L323307L174305L032684K494087J310597Q78086J220703Q46405
1188B78591156j13029o93322j112690j465091j816750j809826j303921j219749j414528
1197B67642250j542320j706619j841774k041817j999378j609555j602420j972199k013206
$$ plain form
1206 251312962 249490013 247770538 246256104 244612923 242453079 240039825 237529984 234853020 232007732
1215 232007732 228941917 225626450 221988678 217881203 213497391 209001999 204330902 199586372 194432487
1224 194432487 188449364 181991081 175520649 168291321 159548988 149778357 138855448 127850046
1232 127850046 117952099 108677378 99801054 91732731 84855785 79022636 74217072 70425262 67795267
1241 67795267 65821638 63958635 62473526 61502686 60893049 60562363 60432186 60398569 60452929 60656538
1251 60656538 60695877 60058107 59399118 59439411 59469213 58795681 58086863 57891359 57873478 57850351 57911148
1262 57911148 58097591 58369150 58635941 59086075 59926023 61008921 62311401 63669434 64897766
1271 64897766 66036692 67079773 67981710 68586817 69217672 70220699 71367493 72559347 73753347
$$ packed form
1206B51312962j822949j719475j514434j643181k159844k413254k509841k676964k845288
1215B32007732l065815l315467l637772m107475m383812m495392m671097m744530n153885
1224A94432487n983123o458283o470432p229328q742333r770631j0922909j1005402
1232A27850046r897947r274721q876324q068323o876946n833149m805564l791810k629995
1241F7795267j973629j863003j485109r70840o09637l30686j30177l3617N4360K03609
1251F0656538L9339o37770o58989M0293K9802o73532p08818j95504j7881k3127O0797
1262E7911148J86443K71559K66791M50134Q39948J082898J302480J358033J228332
1271F4897766J138926J043081R01937O05107O30855J003027J146794J191854J194000
$$ plain form
1280 73753347 74797144 75917473 77379456 78913202 80210438 81648817 83594074 85771790 87958803
1289 87958803 90365400 93081465 96242418 100125542 104393711 108572950 113350382 119503489 126283875
1298 126283875 133276691 140255442 146746387 153075924 159533253 165753822 171226501 176676979 182782173
1307 182782173 189175110 195938339 202397575 207582226 212462654 217856159 223250141 228413811 233316879
1316 233316879 237711658 242018700 246667366 251383286 256118050 260622253 264555435 268141975 271652679
1325 271652679 274606457 276732903 277667999 276983719 274598351 270185928 264049759 256327133 247186661
1334 247186661 236488571 225292664 214266281 204444160 196920853 192180862 191067200 193598747
1342 193598747 200542202 210494270 222883682 235979080 247812500 258521080 267557373 275006294
$$ packed form
1280G3753347J043797J120329J461983J533746J297236J438379J945257K177716K187013
1289H7958803K406597K716065L160953L883124M268169M179239M777432O153107O780386
1298A26283875O992816O978751O490945O329537O457329O220569N472679N450478O105194
1307A82782173O392937O763229O459236N184651M880428N393505N393982N163670M903068
1316B33316879M394779M307042M648666M715920M734764M504203L933182L586540L510704
1325B71652679K953778K126446R35096o84280k385368m412423o136169p722626r140472
1334B47186661j0698090j1195907j1026383r822121p523307m739991j113662K531547
1342A93598747O943455R952068J2389412J3095398J1833420J0708580R036293P448921
$$ plain form
1350 275006294 280697098 284846535 287567844 289000015 289031487 288525581 288733234 288377037 286814442
1359 286814442 283390999 276634445 268352966 259680500 251167526 243968010 237403145 230561714 225292435
1368 225292435 223690491 224103928 225817909 228113880 229606380 231579285 235224476 239430180 243513565
1377 243513565 247376442 250674248 253462296 255499592 257327309 259963493 261734467 260858040 258677235
1386 258677235 255418530 252645721 252579441 253473282 255152454 255122643 249178162 242277851 239159584
1395 239159584 236278534 231371880 225330811 217881908 210256081 204657059 197893143 186427574
1403 186427574 173499107 160600891 149432411 142379990 138876429 138678541 143197527 154496422
1411 154496422 170373421 189925652 211319199 233737221 253224373 264103394 270719757 274745941
$$ packed form
1350B75006294N690804M149437K721309J432171L1472n05906K07653l56197j562595
1359B86814442l423443o756554q281479q672466q512974p199516o564865o841431n269279
1368B25292435j601944M13437J713981K295971J492500J972905L645191M205704M083385
1377B43513565L862877L297806K788048K037296J827717K636184J770974q76427k180805
1386B58677235l258705k772809o6280Q93841J679172k9811n944481o900311l118267
1395B39159584k881050m906654o041069p448903p625827n599022o763916j1465569
1403A86427574j2928467j2898216j1168480p052421l503561j97888M518986J1298895
1411A54496422J5876999J9552231K1393547K2418022J9487152J0879021O616363M026184
$$ plain form
1419 274745941 278520813 286826839 294006100 294106941 292792320 295005074 296952705 296246529 293616524
1428 293616524 288141003 282386284 279049377 276815643 276721706 274409046 262958031 251088371 246622086
1437 246622086 245329857 246221294 247401466 245761623 243950119 244182091 244645119 244357338 243040791
1446 243040791 239064445 235503426 235937119 237220993 235947609 236483574 245446434 252672901 246376495
1455 246376495 238044243 236074448 237946510 244904518 254052391 263813019 271473389 271901360 270777454
1464 270777454 272635460 275781860 280483246 285392761 289948463 292062035 287152748 282133331 284073830
1473 284073830 287918091 290538788 293216457 296295624 299455395 302679520 305395355 306382637 307567596
1482 307567596 311256409 315088730 317269554 318409195 318773270 317600479 312669258 308625927 310986977
$$ packed form
1419B74745941L774872Q306026P179261J00841j314621K212754J947631p06176k630005
1428B93616524n475521n754719l336907k233734r3937k312660j1451015j1869660m466285
1437B46622086j292229Q91437J180172j639843j811504K31972M63028k87781j316547
1446B43040791l976346l561019M33693J283874j273384N35965Q962860P226467o296406
1455B46376495q332252j969795J872062O958008R147873R760628P660370M27971j123906
1464B70777454J858006L146400M701386M909515M555702K113572m909287n019417J940499
1473B84073830L844261K620697K677669L079167L159771L224125K715835R87282J184959
1482C07567596L688813L832321K180824J139641L64075j172791m931221m043331K361050
$$ plain form
1491 310986977 314919701 318203926 318518391 310745945 301053047 294978600 289287796 282042961 274890652
1500 274890652 268704414 263864517 262169113 260235062 252060642 247296791 256737461 270951271
1508 270951271 284689407 296195488 299888115 301991920 309193840 314522247 309993973 305330276
1516 305330276 310983658 316774826 314307442 308683395 300442448 294872036 301173210 308142891 304413548
1525 304413548 299678555 301354160 304902534 308644295 311417084 311013927 308888664 303436279 301625957
1534 301625957 314737320 328231812 329328766 324031334 311192265 299482098 300498714 304310303
1542 304310303 303249359 302117348 303925743 306376209 308083038 309319954 309494724 309817314 311989784
1551 311989784 313940754 312275639 312664986 325232239 333221207 316383362 295318108 285014381
$$ packed form
1491C10986977L932724L284225L14465p772446r692898o074447n690804p244835p152309
1500B74890652o186238m839897j695404j934051q174420m763851R440670J4213810
1508B70951271J3738136J1506081L692627K103805P201920N328407m528274m663697
1516C05330276N653382N791168k467384n624047q240947n570412O301174O969681l729343
1525C04413548m734993J675605L548374L741761K772789m03157k125263n452385j810322
1534C01625957J3111363J3494492J096954n297432j2839069j1710167J016616L811589
1542C04310303j060944j132011J808395K450466J706829J236916J74770L22590K172470
1551C11989784J950970j665115L89347J2567253P988968j6837845k1065254j0303727
$$ plain form
1559 285014381 282052040 292012920 302879333 300765495 296856880 300234070 303325653 300602417
1567 300602417 295017700 285724144 278591156 282308807 287566414 288156261 283458939 266149521 250136375
1576 250136375 250516891 256396046 261361828 267059078 273119431 279170265 284859161 289755821 293090096
1585 293090096 295526257 297474861 298926353 299910049 300717812 301924210 302710533 302086582 301139584
1594 301139584 300745964 300545197 300549965 300516586 300246468 299616814 298196793 296711922 295940151 295289993
1604 295289993 294477463 293357353 291610470 289473763 286548367 284422379 284905186 286932449 291790237
1613 291790237 294233780 285765152 277428379 279631367 285784225 294180870 300577621 297886600 292931309
1622 292931309 290466061 289607754 292404404 294816723 291639557 288416862 289751759 293259125 299560051
$$ packed form
1559B85014381k962341R960880J0866413k113838l908615L377190L091583k723236
1567C00602417n584717r293556p132988L717651N257607N89847m697322j7309418j6013146
1576B50136375L80516N879155M965782N697250O060353O050834N688896M896660L334275
1585B93090096K436161J948604J451492R83696Q07763J206398P86323o23951r46998
1594C01139584l93620k00767M768l3379k70118o29654j420021j484871p71771o50158
1604B95289993q12530j120110j746883k136707k925396k125988M82807K027263M857788
1613B91790237K443543q468628q336773K202988O152858Q396645O396751k691021m955291
1622B92931309k465248q58307K796650K412319l177166l222695J334897L507366O300926
$$ plain form
1631 299560051 304236412 302082520 296080818 284893990 276273956 281228523 288652172 288924675 288595657
1640 288595657 292256355 296158791 298800926 298035374 287838211 278336029 279169083 285771370 301912537
1649 301912537 312223434 295075645 273016434 263077011 260173550 267838230 277250996 278815727
1657 278815727 278392067 279865265 279559841 273202648 266469002 264326324 264623871 268431664 271054268
1666 271054268 266567936 259725075 252177467 247302055 252478600 257350197 250977974 242485504 237893562
1675 237893562 235569000 236888885 238842964 237919807 236999016 240640869 240288734 222949734 206492424
1684 206492424 209510307 216833344 218095779 217477074 214882355 212767601 215312462 217248669 213811378
1693 213811378 207666855 198279381 190488815 193446159 193681946 174609890 154729595 151679029
$$ packed form
1631B99560051M676361k153892o001702j1186828q620034M954567P423649K72503l29018
1640B88595657L660698L902436K642135p65552j0197163r502182Q33054O602287J6141167
1649C01912537J0310897j7147789k2059211r939423k903461P664680R412766J564731
1657B78815727m23660J473198l05424o357193o733646k142678K97547L807793K622604
1666B71054268m486332o842861p547608m875412N176545M871597o372223q492470m591942
1675B37893562k324562J319885J954079r23157r20791L641853l52135j7339000j6457310
1684B06492424L017883P323037J262435o18705k594719k114754K544861J936207l437291
1693B13811378o144523r387474p790566K957344K35787j9072056j9880295l050566
$$ plain form
1701 151679029 151457062 144654503 135131826 122598162 110096207 101503601 94021311 85678568
1709 85678568 77864637 71357241 66019526 62272539 59216728 55968752 52899590 49560537 47525396
1718 47525396 49147596 51637878 52673569 53206434 53180447 53295364 54487457 55989017 57070484
1727 57070484 58552017 61183443 64444532 69105616 72042933 67504873 64142694 71301451 81148138
1736 81148138 88152637 94749918 100723495 108497610 121562233 136502018 150571575 165248375
1744 165248375 181913834 198108177 211780777 223084450 230638008 236989250 244268646 252344837
1752 252344837 263264408 272622108 274607162 275481930 281097164 286873093 289859047 291018238 288861504
1761 288861504 287794113 293895226 300651302 302231789 302665710 304471245 306348076 308789711 308931103
$$ packed form
1701A51679029k21967o802559r522677j2533664j2501955q592606p482290q342743
1709H5678568p813931o507396n337715l746987l055811l247976l069162l339053k035141
1718D7525396J622200K490282J035691N32865k5987J14917J192093J501560J081467
1727E7070484J481533K631426L261089M661084K937317m538060l362179P158757R846687
1736H1148138P004499O597281N973577P774115J3064623J4939785J4069557J4676800
1744A65248375J6665459J6194343J3672600J1303673P553558O351242P279396Q076191
1752B52344837J0919571R357700J985054Q74768N615234N775929K985954J159191k156734
1761B88861504j067391O101113O756076J580487M33921J805535J876831K441635J41392
$$ plain form
1770 308931103 301308384 294209232 296340942 300980797 303890686 306323280 308397751 309273720 306982994
1779 306982994 305026054 307835808 310644855 308734894 306390762 306786289 308532715 311939240 315083961
1788 315083961 316347351 315130463 308118820 301838379 303663960 307732334 310441246 312382698 312818756
1797 312818756 312134018 309994698 307814350 307131767 307235947 308121910 309209099 309831619 310239544
1806 310239544 310571671 310495129 309446793 308254242 307591667 307355385 307934265 308522682 308198204 307697754
1816 307697754 307427635 307455292 308046093 309011917 310877800 311767330 308436623 305512657 308209877
1825 308209877 311519127 311629047 310160141 306372395 303533783 306168060 309766521 310690384 310853710
1834 310853710 310970764 310999146 310704937 311375847 315363636 319241753 320370178 318738689 311046829
$$ packed form
1770C08931103p622719p099152K131710M639855K909889K432594K074471Q75969k290726
1779C06982994j956940K809754K809047j909961k344132L95527J746426L406525L144721
1788C15083961J263390j216888p011643o280441J825581M068374K708912J941452M36058
1797C12818756o84738k139320k180348o82583J04180Q85963J087189O22520M07925
1806C10239544L32127p6542j048336j192551o62575k36282N78880N88417l24478n00450
1816C07697754k70119K7657N90801R65824J865883Q89530l330707k923966K697220
1825C08209877L309250J09920j468906l787746k838612K634277L598461R23863J63326
1834C10853710J17054K8382k94209O70910L987789L878117J128425j631489p691860
$$ plain form
1843 311046829 304523926 308003883 313372364 314271431 314263344 315127831 315851669 315766087 315615883 316114426
1853 316114426 316686859 316936493 317042580 317002525 316963425 317104340 317326546 317410221 317895889 319667320
1863 319667320 321472168 322658997 322306862 318023434 313569775 312466621 313042145 315361729 317732315
1872 317732315 318032494 317612877 317065945 316542854 316502571 316612244 316713562 316739540 316536407 316203346
1882 316203346 315528870 315290680 316902161 318243484 317005863 315166931 313875198 313309669 314745903
1891 314745903 316042404 314689140 313064079 313151588 313620567 313662033 313690643 314025631 314143639 313362350
1901 313362350 312477570 312111359 312099686 312753906 313267708 312642326 311766129 311153870 310926189 311557274
1911 311557274 312499275 313577881 314146271 313254108 311634064 309168568 307457676 309095840 310981255
$$ packed form
1843C11046829o522903L479957N368481Q99067q087Q64487P23838q5582j50204M98543
1853C16114426N72433K49634J06087m0055l9100J40915K22206Q3675M85668J771431
1863C19667320J804848J186829l52135m283428m453659j103154N75524K319584K370586
1872C17732315L00179m19617n46932n23091m0283J09673J01318K5978k03133l33061
1882C16203346o74476k38190J611481J341323j237621j838932j291733n65529J436234
1891C14745903J296501j353264j625061Q7509M68979M1466K8610L34988J18008p81289
1901C13362350q84780l66211j1673O54220N13802o25382q76197o12259k27681O31085
1911C11557274R42001J078606N68390q92163j620044k465496j710892J638164J885415
$$ plain form
1920 310981255 310153465 308781624 308203201 307952156 308173885 308369141 307889214 307325363 307201385 307068577
1930 307068577 306577911 305954437 305253983 304634552 304264526 304168701 304688911 305041313 304442635 303229561
1940 303229561 301071167 299185028 299124470 299551716 299544792 299408665 299116592 298741341 298225155 297929516
1950 297929516 298465004 299025040 298784008 298406830 298370819 298409920 298369637 298389893 298581829 298874130 299176674
1961 299176674 299654236 300629845 301536064 301764717 301758270 301690102 301757812 302373390 303064804 303407421 303667526
1972 303667526 304014664 304312210 304460030 304516296 304461231 304426899 304603577 304795971 304818611 304829597 304981232
1983 304981232 305102806 304946175 304895401 305479507 306015472 305897942 305420876 304367294 303662052 304615974
1993 304615974 305853596 306224823 306362152 306557884 306682816 306650620 306622505 306801548 306975594 306875935
$$ packed form
1920C10981255q27790j371841n78423k51045K21729J95256m79927n63851j23978j32808
1930C07068577m90666o23474p00454o19431l70026r5825N20210L52402n98678j213074
1940C03229561k158394j886139o0558M27246o924j36127k92073l75251n16186k95639
1950B97929516N35488N60036k41032l77178l6011L9101m0283K0256J91936K92301L02544
1961B99176674M77562R75609R06219K28653o447o8168O7710O15578O91414L42617K60105
1972C03667526L47138K97546J47820N6266n5065l4332J76678J92394K2640J0986J51635
1983C04981232J21574j56631n0774N84106N35965j17530m77066j053582p05242R53922
1993C04615974J237622L71227J37329J95732J24932l2196k8115J79043J74046r9659
$$ plain form
2003 306875935 306873779 307490101 308005562 307642441 307093849 306824913 306740761 306914787 307305088 308071594
2013 308071594 308681946 308398476 307993641 308133583 308398247 308628788 308705330 308289280 307875633 307985058
2023 307985058 308200836 308286896 308220615 307740211 307323685 307512741 307851295 308027725 308146935 308220139
2033 308220139 308214893 308044186 307880630 307944527 308002701 307831268 307620049 307497253 307420235 307422390 307402363
2044 307402363 307202091 307025185 307123642 307193756 306895714 306588173 306577435 306679955 306888580 306977730 306581249
2055 306581249 306111088 305907249 305818062 305831413 305868378 305888882 305762997 305196762 304640522 304562321 304613571
2066 304613571 304604530 304524422 304244041 303929329 303737144 303565025 303313007 303129902 303195229 303315163 303363304
2077 303363304 303314209 303068161 302719116 302316170 301894188 301464310 301143398 301128845 301189880 301124802 301040401
$$ packed form
2003C06875935k156O16322N15461l63121n48592k68936q4152J74026L90301P66506
2013C08071594O10352k83470m04835J39942K64664K30541P6542m16050m13647J09425
2023C07985058K15778Q6060o6281m80404m16526J89056L38554J76430J19210P3204
2033C08220139n246j70707j63556O3897N8174j71433k11219j22796p7018K155k0027
2044C07402363k00272j76906R8457P0114k98042l07541j0738J02520K08625Q9150l96481
2055C06581249m70161k03839q9187J3351L6965K0504j25885n66235n56240p8201N1250
2066C04613571r041q0108k80381l14712j92185j72119k52018j83105O5327J19934M8141
2077C03363304m9095k46048l49045m02946m21982m29878l20912j4553O1035o5078q4401
$$ plain form
2088 301040401 300936203 300930729 301277390 301567535 301356544 301005363 300724487 300520172 300521851 300568085 300565948
2099 300565948 300437431 299888115 299473267 299917927 300417652 300232887 299893837 299688339 299602013 299820404
2109 299820404 300028553 299907188 299652805 299262276 299014549 299317360 299781075 300185909 300427189 300165176
2119 300165176 299883595 300108910 300371170 300295105 300123444 299935093 299844494 300105801 300378304 300326805
2129 300326805 300188770 300097923 300029507 300010433 300018063 300047379 300070267 300060730 300006866 299837818 299702644 299784164
2141 299784164 299907913 299949398 299937954 299804440 299719315 299893608 300133209 300294628 300436020 300611725
2151 300611725 300686340 300455799 300178032 300027351 300050011 300490131 300925255 300877800 300756454 300870399
2161 300870399 301039200 301182251 301306229 301408272 301436424 301281681 301110268 301072578 301105003 301172009 301338654
$$ packed form
2088C01040401j04198n474L46661K90145k10991l51181k80876k04315J679M6234k137
2099C00565948j28517n49316m14848M44660M99725j84765l39050k05498q6326K18391
2109B99820404K08149j21365k54383l90529k47727L02811M63715M04834K41280k62013
2119C00165176k81581K25315K62260p6065j71661j88351r0599K61307K72503n1499
2129C00326805j38035r0847o8416j9074P630K9316K2888r537n3864j69048j35174Q1520
2141B99784164J23749M1485j1444j33514q5125J74293K39601J61419J41392J75705
2151C00611725P4615k30541k77767j50681K2660M40120M35124m7455j21346J13945
2161C00870399J68801J43051J23978J02043K8152j54743j71413l7690L2425O7006J66645
$$ plain form
2172 301338654 301721325 302128544 302410355 302556992 302450180 302264442 302146664 302060833 302038193 302022686
2182 302022686 301990967 301873436 301488152 301146736 301172485 301347961 301591625 301818600 301896324 301882973 301755180
2193 301755180 301623344 301645737 301655521 301488628 301293602 301201820 301099281 300843697 300650597 300758591 300954571
2204 300954571 301143150 301206589 300874214 300507545 300407867 300484886 300891628 301197281 300882339 300362587
2214 300362587 299823990 299435844 299530983 299802780 300059071 300288658 300411930 300439339 300321808 300156593
2224 300156593 300010681 299925804 300039749 300129890 299958935 299706917 299448719 299259644 299320927 299388638 299235096
2235 299235096 298989525 298643818 298382511 298493614 298656921 298578491 298465729 298460464 298463097 298384895 298334579
2246 298334579 298465233 298552971 298385372 298081398 297585716 297207584 297399750 297672977 297567120 297446480
$$ packed form
2172C01338654L82671M07219K81811J46637j06812j85738j17778q5831k2640j5507
2182C02022686l1719j17531l85284l41416K5749J75476K43664K26975P7724j3351j27793
2193C01755180j31836K2393R784j66893j95026r1782j02539k55584j93100J07994J95980
2204C00954571J88579O3439l32375l66669r9678P7019M06742L05653l14942n19752
2214C00362587n38597l88146R5139K71797K56291K29587J23272K7409j17531j65215
2224C00156593j45912q4877J13945R0141j70955k52018k58198j89075O1283O7711j53542
2235B99235096k45571l45707k61307J11103J63307p8430j12762n265K633p8202n0316
2246B98334579J30654Q7738j67599l03974m95682l78132J92166K73227j05857j20640
$$ plain form
2256 297446480 297601204 297790279 297821045 297836533 297937393 298058262 298226814 298264732 297850361 297440758
2266 297440758 297492027 297683945 297899952 297985306 297619324 297180405 297035923 296897392 296533585 296137314
2276 296137314 295802822 295592537 295612335 295824280 296267509 296814671 297445755 297878017 297665100 297275772
2286 297275772 297029247 296925049 297194233 297458153 297338715 297064285 296611538 296354523 296858540 297523956
2296 297523956 297875633 298102131 298184624 298268318 298468094 298854828 299663773 300515633 301046371 301444511
2306 301444511 301855793 302042007 301742306 301167240 300214272 299561253 300050240 301084976 302678337 303844204
2316 303844204 303268890 301945686 300429573 298719158 296804657 295263748 294887543 295023193 295369148
2325 295369148 295659294 295724373 294969063 292062263 289039841 287669411 287421455 288833122 290469398
$$ packed form
2256B97446480J54724J89075L0766J5488J00860J20869J68552L7918m14371m09603
2266B97440758N1269J91918K16007Q5354l65982m38919j44482j38531l63807l96271
2276B96137314l34492k10285J9798K11945M43229N47162O31084M32262k12917l89328
2286B97275772k46525j04198K69184K63920j19438k74430m52747k57015N04017O65416
2296B97523956L51677K26498Q2493Q3694J99776L86734Q08945Q51860N30738L98140
2306C01444511M11282J86214k99701n75066r52968o53019M88987J034736J593361J165867
2316C03844204n75314j323204j516113j710415j914501j540909l76205J35650L45955
2325B95369148K90146O5079p55310k906800l022422j370430k47956J411667J636276
$$ plain form
2334 290469398 290882568 290645351 289981346 288489094 285807114 282036781 277013054 271170368 262855759
2343 262855759 258166065 264275780 276296368 294208984 310576668 316261749 316344490 311945667
2351 311945667 305805912 301518440 297645321 294045448 290418625 286203384 282041779 278209686 275242805
2360 275242805 274257164 273786774 272513847 271106472 269721737 268573513 268099785 267783623 267006378
2369 267006378 266510010 267054558 267966976 268738022 269636154 270771027 272106400 273667088 275377731
2378 275377731 277100792 279044857 281560650 284082870 286179771 287799587 288517227 289020042 290082932
2387 290082932 291017761 291280251 291212540 290871620 290568352 290763130 291064720 291133633 291273575 291847229
2397 291847229 292337646 292177906 291880360 291777115 291839104 292276382 292703381 292697182 292577496 292545776 292530766
$$ packed form
2334B90469398M13170k37217o64005j492252k681980l770333n023727n842686q314609
2343B62855759m689694O109715J2020588J7912616J6367684N685081Q2741m398823
2351C11945667o139755m287472l873119l599873l626823m215241m161605l832093k966881
2360B75242805r85641m70390j272927j407375j384735j148224m73728l16162p77245
2369B67006378m96368N44548R12418P71046Q98132J134873J335373J560688J710643
2378B75377731J723061J944065K515793K522220K096901J619816P17640N02815J062890
2387B90082932R34829K62490o7711l40920l03268J94778L01590O8913J39942N73654
2397B91847229M90417j59740k97546j03245O1989M37278M26999o199j19686l1720j5010
$$ plain form
2408 292530766 292510738 292536240 292700768 292851200 292799950 292740822 292885532 292990437 292776337 292557945 292595615
2419 292595615 292772045 293106079 293448448 293654900 293729534 293547630 293347588 293383102 293481579 293549995 293599586
2430 293599586 293595543 293582668 293602448 293626537 293621769 293643951 293778877 293903580 293878059 293837299 293963432 293973923
2442 293973923 293441772 292980194 293270340 293678036 293683281 293624153 293689480 293806076 293996811 294161301 294178963
2453 294178963 294131737 294071198 293968201 293782463 293595543 293452969 293421745 293669930 293938637 294019928 293929100
2464 293929100 293532829 293067436 292733192 292501450 292413464 292457581 292706947 292945614 292957058 292813301
2474 292813301 292396774 292057266 292238941 292537689 292715530 292717438 292280903 291787376 291583061 291509628
2484 291509628 291556358 291625977 291600933 291529884 291452866 291277161 290788651 290390244 290598869 290856113 290673962
$$ packed form
2408B92530766k0028K5502J64528J50432n1250n9128J44710J04905k14100k18392L7670
2419B92595615J76430L34034L42369K06452P4634j81904k00042L5514R8477O8416M9591
2430B93599586m043j2875J9780K4089m768K2182J34926J24703k5521m0760J26133J0491
2442B93973923n32151m61578K90146M07696N245n9128O5327J16596J90735J64490J7662
2453B94178963m7226o0539j02997j85738j86920j42574l1224K48185K68707Q1291r0828
2464B93929100l96271m65393l34244k31742q7986M4117K49366K38667J1444j43757
2474B92813301m16527l39508J81675K98748J77841J908m36535m93527k04315p3433
2484B91509628M6730O9619k5044p1049p7018j75705m88510l98407K08625K57244j82151
$$ plain form
2495 290673962 290355682 290027618 289731255 289579620 289481869 289336205 289285889 289521217 289798241 289949875
2505 289949875 289935112 289534798 289116364 289097061 289105644 288773994 288508415 288730125 289025764 289086342 289018631
2516 289018631 288767567 288507919 288431396 288431873 288504829 288535118 288359871 288117638 287897339 287683716 287470093 287317028
2528 287317028 287282944 287366867 287652016 287943840 288057079 288047295 287835579 287636757 287729263 287841797 287705173
2539 287705173 287591438 287767162 287976723 288079967 287996521 287479630 286887627 286471367 286305428 286676636
2549 286676636 287196617 287565689 287802448 287796021 287635078 287327271 287005177 286785355 286721230 287027111
2559 287027111 287335148 287247658 287068367 286957016 286944389 287198296 287465801 287502041 287450294 287384987 287267685
2570 287267685 287064056 286836624 286607971 286462288 286559811 286694031 286666145 286610603 286576500 286620369 286897163
$$ packed form
2495B90673962l18280l28064k96363j51635r7751j45664n0316K35328K77024J51634
2505B89949875j4763m00314m18434j9303Q583l31650k65579K21710K95639O0578o7711
2516B89018631k51064k59648p6523M77P2956L0289j75247k42233k20299k13623Tj53065
2528B87317028l4084Q3923K85149K91824J13239r784k11716j98822R2506J12534j36624
2539B87705173j13735J75724K09561J03244q3446n16891n92003m16260j65939L71208
2549B86676636N19981L69072K36759o427j60943l07807l22094k19822o4125L05881
2559B87027111L08037q7490j79291j11351j2627K53907K67505L6240n1747o5307j17302
2570B87267685k03629k27432k28653j45683R7523J34220k7886n5542l4103M3869K76794
$$ plain form
2581 286897163 287158012 287122726 287036648 287114372 287165394 286977768 286828499 287014465 287263870 287402382 287433853
2592 287433853 287219753 287012329 287106743 287233810 287141304 287071934 287275543 287477493 287405243 287300110 287350159
2603 287350159 287439804 287533264 287576427 287482491 287312508 286979179 286837330 287494888 288103809 287779560 287237396
2614 287237396 286956787 286760330 286634674 286566963 286574364 286553383 286314716 286131134 286301842 286554794 286726704
2625 286726704 286790123 286592941 286343327 286240807 286157112 285960655 285860767 286094666 286443710 286761284
2635 286761284 287067165 287315598 287554741 287821522 288103809 288521519 288714867 288154602 287468414 287146568
2645 287146568 287070274 287402382 287785530 287844887 287794819 287732830 287631741 287459602 287326088 287350159 287470322
2656 287470322 287725906 287930489 287816277 287666550 287734985 287840118 287816505 287868958 288311710 288650265
$$ packed form
2581B86897163K60849l5286q6078P7724N1022j87626j49269J85966K49405J38512L1471
2592B87433853k14100k07424R4414J27067r2506o9370K03609K01950p2250j05133N0049
2603B87350159Q9645R3460M3163r3936j69983l33329j41849O57558O08921l24249n42164
2614B87237396k80609j96457j25656o7711P401k0981k38667j83582J70708K52952J71910
2625B86726704O3419j97182k49614j02520q3695j96457r9888K33899L49044L17574
2635B86761284L05881K48433K39143K66781K82287M17710J93348n60265o86188l21846
2645B87146568p6294L32108L83148N9357n0068o1989j01089j72139j33514K4071J20163
2656B87470322K55584K04583j14212j49727O8435J05133k3613N2453M42752L38555
$$ plain form
2666 288650265 288288822 287844162 287861576 287957191 287875633 287776451 287781944 287746429 287497749 287234535 287113419
2677 287113419 287086239 287186375 287323952 287398796 287472725 287577381 287701359 287889233 288003922 287850380
2687 287850380 287646046 287580719 287539482 287431946 287371635 287469368 287642708 287893753 288077583 287950745 287810326
2698 287810326 288012257 288133125 287689438 287215939 287148228 287299385 287758827 288130512 287885666 287511578
2708 287511578 287381878 287308197 287216415 287135353 287049046 287015190 287169685 287258606 286969414 286613216 286402454
2719 286402454 286319485 286517601 286696663 286490669 286248436 286307564 286333790 285955658 285619488 285748482
2729 285748482 286038399 286367874 286608448 286537628 286312561 285938015 285647144 285819759 286020737 285871506
2739 285871506 285578957 285173874 284804802 284669151 284647446 284693718 284783363 284907570 284971237 284843903 284621696
$$ packed form
2666B88650265l61443m44660J7414R5615q1558r9182N493l5515k48680k63214j21116
2677B87113419k7180J00136J37577P4844P3929J04656J23978J87874J14689j53542
2687B87850380k04334o5327m1237j07536o0311R7733J73340K51045J83830j26838j40419
2698B87810326K01931J20868m43687m73499o7711J51157M59442L71685k44846l74088
2708B87511578j29700p3681r1782q1062q6307l3856J54495Q8921k89192l56198k10762
2719B86402454q2969J98116J79062k05994k42233N9128K6226l78132l36170J28994
2729B85748482K89917L29475K40574p0820k25067l74546k90871J72615K00978j49231
2739B85871506k92549m05083l69072j35651k1705M6272Q9645J24207O3667j27334k22207
$$ plain form
2750 284621696 284257164 284047832 284444809 284936905 285117378 285120964 284845581 284593811 284735432 284965744
2760 284965744 285075645 285145035 285176983 285189133 285264015 285209408 284699669 284214725 284260750 284433117 284461727
2771 284461727 284445763 284383049 284304371 284247856 284185638 284069290 283998241 284126511 284241428 284096947 283944836
2782 283944836 283997536 284125786 284306030 284430962 284331322 284167290 284076920 283955078 283749580 283436050
2792 283436050 282837143 282357216 282492867 282787781 282941322 282982101 282744865 282508602 282592049 282709827
2802 282709827 282581558 282507401 282831192 283140182 283008080 282816887 282881737 282975903 282947540 282886257 282800179
2813 282800179 282780151 283004513 283219090 283159485 283033600 282965660 282941818 283071976 283105850 282710304 282243004
2824 282243004 281993141 281832924 281744461 281684380 281538963 281499138 281921844 282195320 281594276 280814171
$$ packed form
2750B84621696l64532k09332L96977M92096J80473L586k75383k51770J41621K30312
2760B84965744J09901O9390L1948J2150P4882n4607n09739m84944M6025J72367K8610
2771B84461727j5964o2714p8678n6515o2218j16348p1049J28270J14917j44481j52111
2782B83944836N2700J28250J80244J24932r9640j64032r0370j21842k05498l13530
2792B83436050n98907m79927J35651K94914J53541M0779k37236k36263Q3447J17778
2802B82709827j28269p4157L23791L08990j32102j91193O4850R4166k8363o1283q6078
2813B82800179k0028K24362K14577n9605j25885o7940k3842J30158L3874l95546m67300
2824B82243004k49863j60217q8463o0081j45417l9825M22706K73476o01044p80105
$$ plain form
2834 280814171 280383816 280077934 279858589 279689789 279484501 279357910 279518833 279597511 279211998 278606873
2844 278606873 277845612 277088623 276591530 276129951 275507202 274895668 274412384 274025421 273805618 273559074
2854 273559074 272991886 272471657 272351017 272377968 272446632 272467842 272276154 271992912 271697998 271349907
2864 271349907 270888329 270448914 270189037 269981613 269737949 269499531 269300461 269072533 268739929 268357029
2874 268357029 267930031 267524719 267250519 266981831 266581993 266189804 265966415 265704613 265137672 264603615
2884 264603615 264437675 264379005 264253368 264132729 264016857 263946037 263925056 264057159 264552345 265094509
2894 265094509 265384674 265579224 265758266 265851021 265777092 265643120 265523663 265432587 265442123 265451889 265320530
2905 265320530 265242577 265380135 265686493 266252270 266827583 267105560 267347794 267778397 268200150 268434525
$$ packed form
2834B80814171m30355l05882k19345j68800k05288j26591J60923P8678l85513o05125
2844B78606873p61261p56989m97093m61579o22749o11534m83284l86963k19803k46544
2854B73559074n67188n20229j20640K6951O8664K1210j91688k83242k94914l48091
2864B71349907m61578m39415k59877k07424k43664k38418j99070k27928l32604l82900
2874B68357029m26998m05312k74200k68688l99838l92189k23389k61802n66941n34057
2884B64603615j65940n8670j25637j20639j15872p0820k0981J32103M95186N42164
2894B65094509K90165J94550J79042R2755p3929j33972j19457r1076R536R766j31359
2905B65320530p7953J37558L06358N65777N75313K77977K42234M30603M21753K34375
$$ plain form
2915 268434525 268647652 268972397 269327393 269802322 270013561 269297352 268581619 268908253 269271603 268733482
2925 268733482 268130531 268241882 268301468 267681122 266746025 265520096 264398804 264061203 263680916 262470245
2935 262470245 260989189 259590149 258107891 256434898 254748573 253295650 251759281 249835243 247731667
2944 247731667 245517731 243303757 241232376 239274731 237458229 235754242 234129410 232624283 231264114
2953 231264114 230060806 229073524 228185406 227213612 226413231 226035347 225908031 225955963 226140480 226283779
2963 226283779 226725082 227954617 229340057 230277061 231169453 232195129 233425598 235115051 236890545
2972 236890545 238397827 239832630 241321068 242715340 243843307 244901409 246040344 247221947 248461475
2981 248461475 249746075 251197815 252424469 252827644 253146629 254092445 255151978 256058197 256781330
$$ packed form
2915B68434525K13127L24745L54996M74929K11239p16209p15733L26634L63350n38121
2925B68733482o02951J11351N9586o20346r35097j225929j121292l37601l80287j210671
2935B62470245j481056j399040j482258j672993j686325j452923j536369j924038k103576
2944B47731667k213936k213974k071381j957645j816502j703987j624832j505127j360169
2953B31264114j203308r87282q88118r71794q00381l77884j27316M7932J84517J43299
2963B26283779M41303J229535J385440R37004Q92392J025676J230469J689453J775494
2972B36890545J507282J434803J488438J394272J127967J058102J138935J181603J239528
2981B48461475J284600J451740J226654M03175L18985R45816J059533R06219P23133
$$ plain form
2990 256781330 257097950 257321110 257729282 258199444 258735161 259233932 259533386 259814968 260220985 260705223
3000 260705223 261254063 261909237 262781849 263649445 264309883 264812222 265053978 265287399 265800228 266381016
3010 266381016 266931038 267397156 267602425 267816544 268244247 268903484 270040512 271174660 271862736 272235870
3020 272235870 272107830 271986713 272475243 273100128 273575783 273940792 274053326 274168968 274543514 275033226
3030 275033226 275678864 276180725 276144028 275892963 275589447 275322914 275277843 275329094 275477867 275527000 275274029
3041 275274029 274733772 273793449 272630920 271324158 270059586 269109478 268293381 267442932 266792049
3050 266792049 266658783 266620865 266240578 265879135 265769463 265858650 266241779 266707649 267065506 267348518
3060 267348518 267495384 267597656 267791977 267881393 267655125 267288666 266803741 266448021 266605835 266889076
$$ packed form
2990B56781330L16620K23160M08172M70162N35717M98771K99454K81582M06017M84238
3000B60705223N48840O55174Q72612Q67596O60438N02339K41756K33421N12829N80788
3010B66381016N50022M66118K05269K14119M27703O59237J137028J134148O88076L73134
3020B72235870j28040j21117M88530O24885M75655L65009J12534J15642L74546M89712
3030B75033226O45638N01861l6697k51065l03516k66533m5071N1251J48773M9133k52971
3041B75274029n40257r40323j162529j306762j264572r50108q16097q50449o50883
3050B66792049j33266l7918l80287l61443j09672Q9187L83129M65870L57857K83012
3060B67348518J46866J02272J94321Q9416k26268l66459m84925l55720J57814K83241
$$ plain form
3070 266889076 266945114 267050247 267441750 267881851 268245697 268431892 268209915 267839890 267435532 267201881
3080 267201881 267469158 267974358 268621197 269237518 269512882 269762497 270256500 270818939 271395912 271890869
3090 271890869 272170773 272289028 272296410 272065620 271337261 270556908 270168762 269916286 269623985 269490948
3100 269490948 269736042 270124435 270494461 270843506 271093121 271308403 271498184 271751404 272233009 272720795
3110 272720795 273018589 273212891 273275127 273353081 273615837 273968925 274423828 274831524 275072803 275066376 274496307
3121 274496307 273946991 274082184 274346581 274346352 274260750 274085999 273977509 274154167 274418335 274675827 274831772
3132 274831772 274644356 274456730 274592857 274866104 275222778 275584679 275847893 276033401 276104202 276128769
3142 276128769 276128521 276207199 276542664 276933174 277251949 277451973 277377357 277225246 277132988 277123203 277371635
$$ packed form
3070B66889076N6038J05133L91503M40101L63846J86195k21977l70025m04358k33651
3080B67201881K67277N05200O46839O16321K75364K49615M94003N62439N76973M94957
3090B71890869K79904J18255P382k30790p28359p80353l88146k52476k92301j33037
3100B69490948K45094L88393L70026L49045K49615K15282J89781K53220M81605M87786
3110B72720795K97794J94302O2236P7954K62756L53088M54903M07696K41279o427n70069
3121B74496307n49316J35193K64397k29q5602j74751j08490J76658K64168K57492J55945
3132B74831772j87416j87626J36127K73247L56674L61901K63214J85508P0801K4567
3142B76128769k48P8678L35465L90510L18775K00024p4616j52111r2258r785K48432
$$ plain form
3153 277371635 277555923 277264099 276940346 277010918 277116051 276925545 276773911 276949883 277258625 277696362
3163 277696362 277977943 277637234 277212849 277159691 277261963 277487984 277738323 277909737 277981033 277838936
3173 277838936 277655106 277611237 277561188 277340164 277183990 277377357 277607193 277655354 277522087 276969910
3183 276969910 276492577 276641121 277003994 277434349 277689438 277308216 276797295 276548615 276444435 276540031
3193 276540031 276707153 276801109 276924362 277237892 277420273 277037373 276587238 276487350 276542416 276756287
3203 276756287 276945820 276862850 276706200 276588440 276519279 276550999 276665688 276915779 277139168 277176609 277069321
3214 277069321 276715279 276384106 276427021 276497593 276292305 276032200 275823593 275703659 275776615 275946846
3224 275946846 276155930 276394348 276690941 276871910 276735535 276394348 275826454 275232067 274789085 274540901
$$ packed form
3153B77371635J84288k91824l23753P0572J05133j90506j51634J75972L08742M37737
3163B77696362K81581l40709m24385n3158J02272K26021K50339J71414P1296j42097
3173B77838936j83830m3869n0049k21024j56174J93367K29836M8161j33267n52177
3183B76969910m77333J48544L62873M30355K55089l81222n10921k48680j04180R5596
3193B76540031J67122R3956J23253L13530J82381l82900m50135r9888N5066K13871
3203B76756287J89533q2970j56650j17760o9161L1720J14689K50091K23389L7441j07288
3214B77069321l54042l31173M2915P0572k05288k60105k08607j19934P2956J70231
3224B75946846K09084K38418K96593J80969j36375l41187n67894n94387m42982k48184
$$ plain form
3234 274540901 274689903 274935226 274928799 275012245 275601616 276122551 275949936 275649300 275665512 275734653 275696507
3245 275696507 275684814 275855293 275981903 275819530 275579205 275449753 275250435 274701824 274288406 274600029
3255 274600029 275040131 275135994 275103321 274997940 274825554 274553299 274350166 274473190 274624100 274558067
3265 274558067 274371605 273977032 273679962 273869019 274204254 274488201 274680367 274601936 274469128 274483910
3275 274483910 274510136 274487724 274389267 274107933 273818474 273677101 273629417 273773193 273807030 273323765 272738209
3286 272738209 272285461 272096634 272556763 273135891 273381939 273443928 273293724 273009052 272618752 272240143
3296 272240143 272038918 271897316 271696796 271602631 271848679 272107353 272018661 271910896 272097092 272262325
3306 272262325 272063255 271894913 272206059 272489300 272249680 271898499 271724701 271600227 271502247 271404266
$$ packed form
3234B74540901J49002K45323o427Q3446N89371N20935j72615l00636J6212O9141l8146
3245B75696507j1693J70479J26610j62373k40325j29452j99318n48611m13418L11623
3255B74600029M40102R5863l2673j05381j72386k72255k03133J23024J50910o6033
3265B74558067j86462l94573k97070J89057L35235K83947J92166p8431j32808J4782
3275B74483910K6226k2412r8457k81334k89459j41373m7684J43776L3837m83265n85556
3286B72738209m52748j88827M60129N79128K46048O1989j50204k84672l90300l78609
3296B72240143k01225j41602k00520r4165K46048K58674q8692j07765J86196J65233
3306B72262325j99070j68342L11146K83241k39620l51181j73798j24474r7980r7981
$$ plain form
3316 271404266 271258106 271105766 270896187 270857563 271439781 271926384 271491508 270911217 270744076 270815353
3326 270815353 271289101 271707287 271500816 271164398 271088104 271015396 270780315 270501137 270167103 269998779
3336 269998779 270378342 270806770 270754566 270695190 271044960 271445980 271707764 271743050 271241188 270681610
3346 270681610 270530205 270516853 270516396 270559311 270598640 270740013 271208515 271596909 271392097 271133652 271296959
3357 271296959 271559467 271734238 271888485 272080879 272148590 271867752 271479359 271137695 270879250 270807724
3367 270807724 270873070 271094322 271367302 271558762 271773090 272177925 272448540 272181511 271777153 271558266
3377 271558266 271352768 271043777 270786037 270708313 270770073 271060696 271316757 271230202 271023979 270800095
3387 270800095 270611267 270575752 270598164 270659199 270648956 270410290 270063400 269561272 269247055 269687653 270160904
$$ packed form
3316B71404266j46160j52340k09579l8624N82218M86603m34876n80291j67141P1277
3326B70815353M73748M18186k06471l36418p6294p2708k35081k79178l34034j68324
3336B69998779L79563M28428n2204n9376L49770M01020K61784L5286n01862n59578
3346B70681610j51405j3352m57M2915L9329J41373M68502L88394k04812k58445J63307
3357B71296959K62508J74771J54247J92394O7711k80838l88393l41664k58445p1526
3367B70807724O5346K21252K72980J91460K14328M04835K70615k67029m04358k18887
3377B71558266k05498l08991k57740p7724O1760K90623K56061q6555k06223k23884
3387B70800095j88828l5515K2412O1035j0243k38666l46890n02128l14217M40598M73251
$$ plain form
3398 270160904 270012608 269602776 268993607 268421402 268264046 268156281 267822495 267369270 266697636 266147366
3408 266147366 266231995 266329517 265850525 265210381 264577866 264101257 264196148 264228573 263494492 262619247 262070408
3419 262070408 261614799 261186600 260750523 260237446 259681931 259017448 258475304 258347969 258384933 258442383
3429 258442383 258491516 258384933 258331528 258541813 258861294 259217014 259572983 259795189 260102501 260740509
3439 260740509 261493435 262366753 262941818 262533417 261945724 261795750 261958828 262671471 263467293 263824692
3449 263824692 264144173 264777641 265347710 265454998 265515785 265900841 266344528 266736031 266981583 266863327
3459 266863327 266640167 266454449 266437035 266882172 267441025 267875175 268146515 267988663 267845383 268240433
3469 268240433 268666725 268772831 268611908 267888298 267294388 267714729 268274059 268311005 268066406 267368069
$$ packed form
3398B70160904j48296m09832o09169n72205j57356j07765l33786m53225o71634n50270
3408B66147366Q4629R7522m78992o40144o32515m76609R4891L2425p34081q75245n48839
3419B62070408m55609m28199m36077n13077n55515o64483n42144j27335L6964N7450
3429B58442383M9133j06583n3405K10285L19481L55720L55969K22206L07312O38008
3439B60740509P52926Q73318N75065m08401n87693j49974J63078P12643P95822L57399
3449B63824692L19481O33468N70069J07288O0787L85056M43687L91503K45552j18256
3459B66863327k23160j85718j7414M45137N58853M34150K71340j57852j43280L95050
3469B68240433M26292J06106j60923p23610n93910M20341N59330L6946k44599o98337
$$ plain form
3479 267368069 266793003 267116547 267569046 267549267 267325153 266800880 266463509 267031422 267714252 267890682
3489 267890682 267771950 267215004 266661148 266592731 266740551 267028084 267356377 267717113 267761688 266892891
3499 266892891 265847912 265153389 264842987 265384178 265998344 265913010 265575161 265064697 264707794 265030136
3509 265030136 265511017 265782108 265909901 265782814 265565376 265320053 265240669 265750389 266220322 266098728
3519 266098728 265573959 264401436 263325920 263280621 263454437 263294220 262958755 262204876 261682014 262256374
3529 262256374 263034325 263357391 263386726 262905827 262386322 262227516 262427082 263352146 264290314 264616470
3539 264616470 264432907 263487568 262217979 260803928 259766579 259959450 260561943 261114120 261386623
3548 261386623 260677090 259944420 260054340 260583878 261548748 262497902 262846699 263008823 262975445 263426781
$$ packed form
3479B67368069n75066L23544M52499j9779k24114n24273l37371N67913O82830J76430
3489B67890682j18732n56946n53856o8417J47820K87533L28293L60736M4575q68797
3499B66892891j044979o94523l10402N41191O14166q5334l37849n10464l56903L22342
3509B65030136M80881K71091J27793j27087k17438k45323p9384N09720M69933j21594
3519B66098728n24769j172523j075516m5299J73816j60217l35465p53879n22862N74360
3529B62256374P77951L23066K9335m80899n19505j58806J99566R25064R38168L26156
3539B64616470j83563r45339j269589j414051j037349J92871O02493N52177K72503
3548B61386623p09533p32670J09920N29538R64870R49154L48797J62124l3378M51336
$$ plain form
3558 263426781 265582314 267813683 269052505 268837204 265700798 261590004 257521629 254817715 255907764
3567 255907764 258486252 261286736 263618469 263880005 263534298 263663044 263806572 263810616 263839226 263822556
3577 263822556 264304619 266114464 268325310 270773163 271996498 269874325 266217937 261393547 257612934
3586 257612934 258016338 260184040 263274651 265692711 264724483 262880554 261840096 261381607 262328377
3595 262328377 263225307 262329102 261326542 261322479 262317657 265396118 268409481 269428711 268877487 265818596
3605 265818596 262402287 260688534 260008812 260627747 261804333 262710075 263869991 266312351 267696133
3614 267696133 265201321 261291008 256776314 253792515 255367279 259631615 266877632 273648014 276766052
3623 276766052 275680542 266851883 256067734 247230759 242453327 247941246 255317192 256819477
$$ packed form
3558B63426781K155533K231369J238822k15301l136406m110794m068375k703914J090049
3567B55907764K578488K800484K331733K61536l45707J28746J43528M044K8610j6670
3577B63822556M82063J809845K210846K447853J223335k122173l656388m824390l780613
3586B57612934M03404K167702L090611K418060r68228j843929j040458m58489R46770
3595B62328377Q96930q96205j002560m063R95178L078461L013363J019230n51224l058891
3605B65818596l416309j713753o79722O18935J176586R05742J159916K442360J383782
3614B67696133k494812l910313m514694k983799J574764M264336P246017O770382L118038
3623B76766052j085510q828659j0784149q836975m777432N487919P375946J502285
$$ plain form
3631 256819477 256804924 257108917 257531872 258790474 259971371 259819489 260076275 262356033 265781860
3640 265781860 270665169 275052776 277654400 276791801 268525352 258346558 249853840 244785061 247808914
3649 247808914 253728619 259543419 263330917 260381451 256053429 254534950 254626732 257187119 260230770
3658 260230770 261430740 262667408 265242577 268565178 273465385 276981583 275511971 271803608 266302814
3667 266302814 262308350 265324097 269180298 269600143 266407719 254749756 244379044 246352901
3675 246352901 251902084 255181313 258475304 262082329 266113987 271434059 276082497 278779259 278345337
3684 278345337 271748047 263267975 255553474 250468483 252294540 256423950 259243011 262048473 265254021
3693 265254021 267893066 269004097 268982887 267878284 265768280 261683693 258813362 261015644 265310993
$$ packed form
3631B56819477j4553L03993M22955J258602J180897j51882K56786K279758L425827
3640B65781860M883309M387607K601624q62599q266449j0178794q492718n068779L023853
3649B47808914N919705N814800L787498k949466m328022j518479R1782K560387L043651
3658B60230770J199970J236668K575169L322601M900207L516198j469612l708363n500794
3667B66302814l994464L015747L856201M19845l192424j1657963j0370712J973857
3675B46352901N549183L279229L293991L607025M031658N320072M648438K696762m33922
3684B78345337o597290q480072p714501n084991J826057M129410K819061K805462L205548
3693B65254021K639045J111031k1210j104603k110004m084587k870331K202282M295349
$$ plain form
3702 265310993 270668983 275098076 276053886 274161568 268223515 261160126 255010605 251219254 252833824
3711 252833824 257082443 262900581 268213501 269888630 270035248 269764652 268936157 267684441 266293030
3720 266293030 264983177 264076233 263846855 264655113 267404785 270736198 274142017 275968056 273632755
3729 273632755 269407501 264597168 259518623 254078140 250811806 252597809 258313179 270233383
3737 270233383 281040897 282998791 279639473 269643536 259829521 257646065 259882202 269126167
3745 269126167 275425186 265036335 251916389 246667137 245609035 249598961 255626907 261536350
3753 261536350 265622845 264075031 261055222 259586334 259275188 261311989 263967266 265970688 267132034
3762 267132034 266458740 265084724 264110794 262642365 259351006 256637573 256903877 258817673 262386551
$$ packed form
3702B65310993N357990M429093R55810j892318n938053p063389o149521l791351J614570
3711B52833824M248619N818138N312920J675129J46618k70596q28495j251716j391411
3720B66293030j309853r06944k29378Q08258K749672L331413L405819J826039k335301
3729B73632755m225254m810333n078545n440483l266334J786003N715370J1920204
3737B70233383J0807514J957894l359318r995937r814015k183456K236137R243965
3745B69126167O299019j0388851j3119946n249252j058102L989926O027946N909443
3753B61536350M086495j547814l019809j468888l11146K036801K655277K003422J161346
3762B67132034o73294j374016r73930j468429l291359k713433K66304J913796L568878
$$ plain form
3771 262386551 265990715 267949104 268452396 266735783 263981819 260554066 258144131 259556522 261813622
3780 261813622 262562981 262730598 262222996 261744251 262093048 262890816 264120331 265495529 266735783
3789 266735783 267804375 268361320 269035797 270700455 272282352 273273926 272850990 269420376 264780045
3798 264780045 259242287 255668640 259201508 263307800 261967411 258783569 254056931 251674652 257749062
3807 257749062 265905132 271823883 275447350 274501305 271315804 266728401 262941360 263894787 265210152
3816 265210152 263230076 259728661 253886681 249824982 253265381 258582821 261528015 263694267 265072327
3825 265072327 266219368 267968178 269480934 269940605 270117035 271018734 271111488 268966904 265276184
3834 265276184 259229164 253898125 252950420 253788452 255143394 256695023 256999245 258156281 262091389
$$ packed form
3771B62386551L604164J958389N03292j716613k753964l427753k409935J412391K257100
3780B61813622P49359J67617n07602m78745L48797P97768J229515J375198J240254
3789B66735783J068592N56945O74477J664658J581897R91574m22936l430614m640331
3798B64780045n537758l573647L532868M106292j340389l183842m726638k382279O074410
3807B57749062Q156070N918751L623467r46045l185501m587403l787041R53427J315365
3816B65210152j980076l501415n841980m061699L440399N317440K945194K166252J378060
3825B65072327J147041J748810J512756M59671J76430R01699R2754k144584l690720
3834B65276184o047020n331039r47705Q38032J354942J551629L04222J157036L935108
$$ plain form
3843 262091389 267882576 276320686 284190407 289463501 289369087 278247585 262736778 245286942
3851 245286942 232798576 236332397 245854607 255371552 263823013 267357578 268355122 267667046 266026497
3860 266026497 264117699 262936096 264518242 266425133 267003517 265932541 261089077 256224861 255058517
3869 255058517 255564194 257093887 259231319 261359673 263429394 265510559 266625633 264980545 263092747
3878 263092747 263567429 264344921 264195194 263230782 260115852 257965794 261149635 264569988 263616314
3887 263616314 261195889 257971764 256065121 258875599 263230324 267314415 270453453 271119347 270057907
3896 270057907 267163982 263460159 259934654 256584396 253442268 251385441 251529446 253190994 256672859
3905 256672859 260132065 261189461 261756401 263338547 264773369 265375595 265216827 263912201 262145500
$$ packed form
3843B62091389N791187Q438110P869721N273094r4414j1121502j5510807j7449836
3851B45286942j2488366L533821R522210R516945Q451461L534565R97544o88076j640549
3860B66026497j908798j181603J582146J906891N78384j070976m843464m864216j166344
3869B55058517N05677J529693K137432K128354K069721K081165J115074j645088j887798
3878B63092747M74682P77492j49727r64412l114930k150058L183841L420353r53674
3887B63616314k420425l224125j906643K810478M354725M084091L139038O65894j061440
3896B70057907k893925l703823l525505l350258l142128k056827J44005J661548L481865
3905B56672859L459206J057396N66940J582146J434822O02226j58768j304626j766701
$$ plain form
3914 262145500 260233383 258891335 259376278 260379066 260921936 261264553 261288872 261147499 260791283 260705948
3924 260705948 261782646 262753944 262488823 261469116 259333611 257478218 257515907 258432617 259956360
3933 259956360 261473408 262109032 262373924 262565365 262445908 261714687 260858288 260196190 259928703 260768166
3943 260768166 261497498 260744553 259685745 259110680 258804321 258881569 259141197 259432793 259718399 259902000
3953 259902000 260005455 259986382 259940147 259903412 260006657 260564556 261060715 260929813 260631561 260436516
3963 260436516 260343781 260471344 260731926 261173248 261507988 261320820 261042099 261058807 261084785 260873070
3973 260873070 260692348 260834694 260981064 260848999 260617962 260352135 260115128 260048370 259980202 259653091
3983 259653091 259463062 259938240 260422707 260296326 259977798 259590607 259400120 259914150 260527840 260779381
$$ packed form
3914B62145500j912117j342048M84943J002788N42870L42617K4319j41373l56216q5335
3924B60705948J076698R71298k65121j019707k135505j855393L7689R16710J523743
3933B59956360J517048O35624K64892J91441j19457p31221q56399o62098k67487Q39463
3943B60768166P29332p52945j058808n75065l06359P7248K59628K91596K85606J83601
3953B59902000J03455j9073m6235l6735J03245N57899M96159j30902k98252j95045
3963B60436516r2735J27563K60582M41322L34740j87168k78721J6708K5978k11715
3973B60873070j80722J42346J46370j32065k31037k65827k37007o6758o8168l27111
3983B59653091j90029M75178M84467j26381l18528l87191j90487N14030O13690K51541
$$ plain form
3993 260779381 260745049 260137062 259585133 259793739 260246983 260725727 261044006
4000 261044006
$$ packed form
3993B60779381l4332o07987n51929K08606M53244M78744L18279
4000B61044006
##END=$$ End of the data block
